cip-gitlab/ci/iwamatsu/linux-4.19.y-cip-rc build: 138 builds: 3 failed, 135 passed, 2 errors, 16 warnings (v4.19.252-cip78-113-gb7034e0f773f8) #kernelci


kernelci.org bot <bot@...>
 

cip-gitlab/ci/iwamatsu/linux-4.19.y-cip-rc build: 138 builds: 3 failed, 135 passed, 2 errors, 16 warnings (v4.19.252-cip78-113-gb7034e0f773f8)

Full Build Summary: https://kernelci.org/build/cip-gitlab/branch/ci%2Fiwamatsu%2Flinux-4.19.y-cip-rc/kernel/v4.19.252-cip78-113-gb7034e0f773f8/

Tree: cip-gitlab
Branch: ci/iwamatsu/linux-4.19.y-cip-rc
Git Describe: v4.19.252-cip78-113-gb7034e0f773f8
Git Commit: b7034e0f773f811f76bd4c5795f4eafe7e1dede9
Git URL: https://gitlab.com/cip-project/cip-kernel/linux-cip.git
Built: 6 unique architectures

Build Failures Detected:

arm:
rpc_defconfig: (gcc-10) FAIL

riscv:
defconfig: (gcc-10) FAIL
tinyconfig: (gcc-10) FAIL

Errors and Warnings Detected:

arc:

arm64:
defconfig (gcc-10): 3 warnings
defconfig+arm64-chromebook (gcc-10): 3 warnings

arm:
rpc_defconfig (gcc-10): 2 errors

i386:
i386_defconfig (gcc-10): 2 warnings
tinyconfig (gcc-10): 2 warnings

mips:
lemote2f_defconfig (gcc-10): 1 warning
loongson3_defconfig (gcc-10): 1 warning
mtx1_defconfig (gcc-10): 3 warnings
nlm_xlp_defconfig (gcc-10): 1 warning

riscv:

Errors summary:

1 arm-linux-gnueabihf-gcc: error: unrecognized -march target: armv3
1 arm-linux-gnueabihf-gcc: error: missing argument to ‘-march=’

Warnings summary:

6 aarch64-linux-gnu-ld: warning: -z norelro ignored
2 sound/pci/echoaudio/echoaudio_dsp.c:647:9: warning: iteration 1073741824 invokes undefined behavior [-Waggressive-loop-optimizations]
2 net/core/rtnetlink.c:3199:1: warning: the frame size of 1328 bytes is larger than 1024 bytes [-Wframe-larger-than=]
2 ld: warning: creating DT_TEXTREL in a PIE
2 ld: arch/x86/boot/compressed/head_32.o: warning: relocation in read-only section `.head.text'
1 sound/pci/echoaudio/echoaudio_dsp.c:658:9: warning: iteration 1073741824 invokes undefined behavior [-Waggressive-loop-optimizations]
1 net/core/rtnetlink.c:3199:1: warning: the frame size of 1344 bytes is larger than 1024 bytes [-Wframe-larger-than=]

Section mismatches summary:

11 WARNING: modpost: Found 1 section mismatch(es).

================================================================================

Detailed per-defconfig build reports:

--------------------------------------------------------------------------------
32r2el_defconfig (mips, gcc-10) — PASS, 0 errors, 0 warnings, 0 section mismatches

--------------------------------------------------------------------------------
acs5k_defconfig (arm, gcc-10) — PASS, 0 errors, 0 warnings, 0 section mismatches

--------------------------------------------------------------------------------
acs5k_tiny_defconfig (arm, gcc-10) — PASS, 0 errors, 0 warnings, 0 section mismatches

--------------------------------------------------------------------------------
am200epdkit_defconfig (arm, gcc-10) — PASS, 0 errors, 0 warnings, 0 section mismatches

--------------------------------------------------------------------------------
ar7_defconfig (mips, gcc-10) — PASS, 0 errors, 0 warnings, 0 section mismatches

--------------------------------------------------------------------------------
aspeed_g4_defconfig (arm, gcc-10) — PASS, 0 errors, 0 warnings, 0 section mismatches

--------------------------------------------------------------------------------
aspeed_g5_defconfig (arm, gcc-10) — PASS, 0 errors, 0 warnings, 0 section mismatches

--------------------------------------------------------------------------------
assabet_defconfig (arm, gcc-10) — PASS, 0 errors, 0 warnings, 0 section mismatches

--------------------------------------------------------------------------------
at91_dt_defconfig (arm, gcc-10) — PASS, 0 errors, 0 warnings, 0 section mismatches

--------------------------------------------------------------------------------
ath25_defconfig (mips, gcc-10) — PASS, 0 errors, 0 warnings, 0 section mismatches

--------------------------------------------------------------------------------
ath79_defconfig (mips, gcc-10) — PASS, 0 errors, 0 warnings, 0 section mismatches

--------------------------------------------------------------------------------
axm55xx_defconfig (arm, gcc-10) — PASS, 0 errors, 0 warnings, 0 section mismatches

--------------------------------------------------------------------------------
badge4_defconfig (arm, gcc-10) — PASS, 0 errors, 0 warnings, 0 section mismatches

--------------------------------------------------------------------------------
bcm2835_defconfig (arm, gcc-10) — PASS, 0 errors, 0 warnings, 0 section mismatches

--------------------------------------------------------------------------------
bcm47xx_defconfig (mips, gcc-10) — PASS, 0 errors, 0 warnings, 0 section mismatches

--------------------------------------------------------------------------------
bcm63xx_defconfig (mips, gcc-10) — PASS, 0 errors, 0 warnings, 0 section mismatches

--------------------------------------------------------------------------------
bigsur_defconfig (mips, gcc-10) — PASS, 0 errors, 0 warnings, 0 section mismatches

--------------------------------------------------------------------------------
bmips_be_defconfig (mips, gcc-10) — PASS, 0 errors, 0 warnings, 0 section mismatches

--------------------------------------------------------------------------------
bmips_stb_defconfig (mips, gcc-10) — PASS, 0 errors, 0 warnings, 0 section mismatches

--------------------------------------------------------------------------------
cavium_octeon_defconfig (mips, gcc-10) — PASS, 0 errors, 0 warnings, 0 section mismatches

--------------------------------------------------------------------------------
cerfcube_defconfig (arm, gcc-10) — PASS, 0 errors, 0 warnings, 0 section mismatches

--------------------------------------------------------------------------------
cm_x2xx_defconfig (arm, gcc-10) — PASS, 0 errors, 0 warnings, 0 section mismatches

--------------------------------------------------------------------------------
cm_x300_defconfig (arm, gcc-10) — PASS, 0 errors, 0 warnings, 0 section mismatches

--------------------------------------------------------------------------------
cobalt_defconfig (mips, gcc-10) — PASS, 0 errors, 0 warnings, 0 section mismatches

--------------------------------------------------------------------------------
colibri_pxa300_defconfig (arm, gcc-10) — PASS, 0 errors, 0 warnings, 0 section mismatches

--------------------------------------------------------------------------------
collie_defconfig (arm, gcc-10) — PASS, 0 errors, 0 warnings, 0 section mismatches

--------------------------------------------------------------------------------
corgi_defconfig (arm, gcc-10) — PASS, 0 errors, 0 warnings, 0 section mismatches

--------------------------------------------------------------------------------
davinci_all_defconfig (arm, gcc-10) — PASS, 0 errors, 0 warnings, 0 section mismatches

--------------------------------------------------------------------------------
decstation_defconfig (mips, gcc-10) — PASS, 0 errors, 0 warnings, 0 section mismatches

--------------------------------------------------------------------------------
defconfig (riscv, gcc-10) — FAIL, 0 errors, 0 warnings, 0 section mismatches

--------------------------------------------------------------------------------
defconfig (arm64, gcc-10) — PASS, 0 errors, 3 warnings, 0 section mismatches

Warnings:
aarch64-linux-gnu-ld: warning: -z norelro ignored
aarch64-linux-gnu-ld: warning: -z norelro ignored
aarch64-linux-gnu-ld: warning: -z norelro ignored

Section mismatches:
WARNING: modpost: Found 1 section mismatch(es).

--------------------------------------------------------------------------------
defconfig+arm64-chromebook (arm64, gcc-10) — PASS, 0 errors, 3 warnings, 0 section mismatches

Warnings:
aarch64-linux-gnu-ld: warning: -z norelro ignored
aarch64-linux-gnu-ld: warning: -z norelro ignored
aarch64-linux-gnu-ld: warning: -z norelro ignored

Section mismatches:
WARNING: modpost: Found 1 section mismatch(es).

--------------------------------------------------------------------------------
dove_defconfig (arm, gcc-10) — PASS, 0 errors, 0 warnings, 0 section mismatches

--------------------------------------------------------------------------------
e55_defconfig (mips, gcc-10) — PASS, 0 errors, 0 warnings, 0 section mismatches

--------------------------------------------------------------------------------
ebsa110_defconfig (arm, gcc-10) — PASS, 0 errors, 0 warnings, 0 section mismatches

--------------------------------------------------------------------------------
efm32_defconfig (arm, gcc-10) — PASS, 0 errors, 0 warnings, 0 section mismatches

--------------------------------------------------------------------------------
ep93xx_defconfig (arm, gcc-10) — PASS, 0 errors, 0 warnings, 0 section mismatches

Section mismatches:
WARNING: modpost: Found 1 section mismatch(es).

--------------------------------------------------------------------------------
footbridge_defconfig (arm, gcc-10) — PASS, 0 errors, 0 warnings, 0 section mismatches

--------------------------------------------------------------------------------
gcw0_defconfig (mips, gcc-10) — PASS, 0 errors, 0 warnings, 0 section mismatches

--------------------------------------------------------------------------------
gpr_defconfig (mips, gcc-10) — PASS, 0 errors, 0 warnings, 0 section mismatches

--------------------------------------------------------------------------------
h3600_defconfig (arm, gcc-10) — PASS, 0 errors, 0 warnings, 0 section mismatches

--------------------------------------------------------------------------------
hackkit_defconfig (arm, gcc-10) — PASS, 0 errors, 0 warnings, 0 section mismatches

--------------------------------------------------------------------------------
haps_hs_defconfig (arc, gcc-10) — PASS, 0 errors, 0 warnings, 0 section mismatches

--------------------------------------------------------------------------------
haps_hs_smp_defconfig (arc, gcc-10) — PASS, 0 errors, 0 warnings, 0 section mismatches

--------------------------------------------------------------------------------
hisi_defconfig (arm, gcc-10) — PASS, 0 errors, 0 warnings, 0 section mismatches

--------------------------------------------------------------------------------
hsdk_defconfig (arc, gcc-10) — PASS, 0 errors, 0 warnings, 0 section mismatches

--------------------------------------------------------------------------------
i386_defconfig (i386, gcc-10) — PASS, 0 errors, 2 warnings, 0 section mismatches

Warnings:
ld: arch/x86/boot/compressed/head_32.o: warning: relocation in read-only section `.head.text'
ld: warning: creating DT_TEXTREL in a PIE

--------------------------------------------------------------------------------
imote2_defconfig (arm, gcc-10) — PASS, 0 errors, 0 warnings, 0 section mismatches

--------------------------------------------------------------------------------
imx_v4_v5_defconfig (arm, gcc-10) — PASS, 0 errors, 0 warnings, 0 section mismatches

--------------------------------------------------------------------------------
integrator_defconfig (arm, gcc-10) — PASS, 0 errors, 0 warnings, 0 section mismatches

Section mismatches:
WARNING: modpost: Found 1 section mismatch(es).

--------------------------------------------------------------------------------
iop13xx_defconfig (arm, gcc-10) — PASS, 0 errors, 0 warnings, 0 section mismatches

--------------------------------------------------------------------------------
iop33x_defconfig (arm, gcc-10) — PASS, 0 errors, 0 warnings, 0 section mismatches

--------------------------------------------------------------------------------
ip32_defconfig (mips, gcc-10) — PASS, 0 errors, 0 warnings, 0 section mismatches

--------------------------------------------------------------------------------
ixp4xx_defconfig (arm, gcc-10) — PASS, 0 errors, 0 warnings, 0 section mismatches

--------------------------------------------------------------------------------
jazz_defconfig (mips, gcc-10) — PASS, 0 errors, 0 warnings, 0 section mismatches

--------------------------------------------------------------------------------
jmr3927_defconfig (mips, gcc-10) — PASS, 0 errors, 0 warnings, 0 section mismatches

--------------------------------------------------------------------------------
jornada720_defconfig (arm, gcc-10) — PASS, 0 errors, 0 warnings, 0 section mismatches

--------------------------------------------------------------------------------
lart_defconfig (arm, gcc-10) — PASS, 0 errors, 0 warnings, 0 section mismatches

--------------------------------------------------------------------------------
lasat_defconfig (mips, gcc-10) — PASS, 0 errors, 0 warnings, 0 section mismatches

--------------------------------------------------------------------------------
lemote2f_defconfig (mips, gcc-10) — PASS, 0 errors, 1 warning, 0 section mismatches

Warnings:
net/core/rtnetlink.c:3199:1: warning: the frame size of 1328 bytes is larger than 1024 bytes [-Wframe-larger-than=]

--------------------------------------------------------------------------------
loongson1b_defconfig (mips, gcc-10) — PASS, 0 errors, 0 warnings, 0 section mismatches

--------------------------------------------------------------------------------
loongson3_defconfig (mips, gcc-10) — PASS, 0 errors, 1 warning, 0 section mismatches

Warnings:
net/core/rtnetlink.c:3199:1: warning: the frame size of 1328 bytes is larger than 1024 bytes [-Wframe-larger-than=]

--------------------------------------------------------------------------------
lpd270_defconfig (arm, gcc-10) — PASS, 0 errors, 0 warnings, 0 section mismatches

--------------------------------------------------------------------------------
lubbock_defconfig (arm, gcc-10) — PASS, 0 errors, 0 warnings, 0 section mismatches

--------------------------------------------------------------------------------
magician_defconfig (arm, gcc-10) — PASS, 0 errors, 0 warnings, 0 section mismatches

--------------------------------------------------------------------------------
malta_defconfig (mips, gcc-10) — PASS, 0 errors, 0 warnings, 0 section mismatches

--------------------------------------------------------------------------------
malta_kvm_defconfig (mips, gcc-10) — PASS, 0 errors, 0 warnings, 0 section mismatches

--------------------------------------------------------------------------------
malta_kvm_guest_defconfig (mips, gcc-10) — PASS, 0 errors, 0 warnings, 0 section mismatches

--------------------------------------------------------------------------------
maltaaprp_defconfig (mips, gcc-10) — PASS, 0 errors, 0 warnings, 0 section mismatches

--------------------------------------------------------------------------------
maltasmvp_eva_defconfig (mips, gcc-10) — PASS, 0 errors, 0 warnings, 0 section mismatches

--------------------------------------------------------------------------------
maltaup_defconfig (mips, gcc-10) — PASS, 0 errors, 0 warnings, 0 section mismatches

--------------------------------------------------------------------------------
maltaup_xpa_defconfig (mips, gcc-10) — PASS, 0 errors, 0 warnings, 0 section mismatches

--------------------------------------------------------------------------------
markeins_defconfig (mips, gcc-10) — PASS, 0 errors, 0 warnings, 0 section mismatches

--------------------------------------------------------------------------------
mpc30x_defconfig (mips, gcc-10) — PASS, 0 errors, 0 warnings, 0 section mismatches

--------------------------------------------------------------------------------
mps2_defconfig (arm, gcc-10) — PASS, 0 errors, 0 warnings, 0 section mismatches

--------------------------------------------------------------------------------
msp71xx_defconfig (mips, gcc-10) — PASS, 0 errors, 0 warnings, 0 section mismatches

--------------------------------------------------------------------------------
mtx1_defconfig (mips, gcc-10) — PASS, 0 errors, 3 warnings, 0 section mismatches

Warnings:
sound/pci/echoaudio/echoaudio_dsp.c:647:9: warning: iteration 1073741824 invokes undefined behavior [-Waggressive-loop-optimizations]
sound/pci/echoaudio/echoaudio_dsp.c:658:9: warning: iteration 1073741824 invokes undefined behavior [-Waggressive-loop-optimizations]
sound/pci/echoaudio/echoaudio_dsp.c:647:9: warning: iteration 1073741824 invokes undefined behavior [-Waggressive-loop-optimizations]

--------------------------------------------------------------------------------
multi_v4t_defconfig (arm, gcc-10) — PASS, 0 errors, 0 warnings, 0 section mismatches

--------------------------------------------------------------------------------
multi_v5_defconfig (arm, gcc-10) — PASS, 0 errors, 0 warnings, 0 section mismatches

Section mismatches:
WARNING: modpost: Found 1 section mismatch(es).

--------------------------------------------------------------------------------
multi_v7_defconfig (arm, gcc-10) — PASS, 0 errors, 0 warnings, 0 section mismatches

--------------------------------------------------------------------------------
mvebu_v7_defconfig (arm, gcc-10) — PASS, 0 errors, 0 warnings, 0 section mismatches

--------------------------------------------------------------------------------
mxs_defconfig (arm, gcc-10) — PASS, 0 errors, 0 warnings, 0 section mismatches

--------------------------------------------------------------------------------
neponset_defconfig (arm, gcc-10) — PASS, 0 errors, 0 warnings, 0 section mismatches

--------------------------------------------------------------------------------
netwinder_defconfig (arm, gcc-10) — PASS, 0 errors, 0 warnings, 0 section mismatches

--------------------------------------------------------------------------------
netx_defconfig (arm, gcc-10) — PASS, 0 errors, 0 warnings, 0 section mismatches

Section mismatches:
WARNING: modpost: Found 1 section mismatch(es).

--------------------------------------------------------------------------------
nhk8815_defconfig (arm, gcc-10) — PASS, 0 errors, 0 warnings, 0 section mismatches

Section mismatches:
WARNING: modpost: Found 1 section mismatch(es).

--------------------------------------------------------------------------------
nlm_xlp_defconfig (mips, gcc-10) — PASS, 0 errors, 1 warning, 0 section mismatches

Warnings:
net/core/rtnetlink.c:3199:1: warning: the frame size of 1344 bytes is larger than 1024 bytes [-Wframe-larger-than=]

--------------------------------------------------------------------------------
nlm_xlr_defconfig (mips, gcc-10) — PASS, 0 errors, 0 warnings, 0 section mismatches

--------------------------------------------------------------------------------
nsimosci_hs_defconfig (arc, gcc-10) — PASS, 0 errors, 0 warnings, 0 section mismatches

--------------------------------------------------------------------------------
nuc950_defconfig (arm, gcc-10) — PASS, 0 errors, 0 warnings, 0 section mismatches

--------------------------------------------------------------------------------
nuc960_defconfig (arm, gcc-10) — PASS, 0 errors, 0 warnings, 0 section mismatches

--------------------------------------------------------------------------------
omap2plus_defconfig (arm, gcc-10) — PASS, 0 errors, 0 warnings, 0 section mismatches

--------------------------------------------------------------------------------
orion5x_defconfig (arm, gcc-10) — PASS, 0 errors, 0 warnings, 0 section mismatches

--------------------------------------------------------------------------------
oxnas_v6_defconfig (arm, gcc-10) — PASS, 0 errors, 0 warnings, 0 section mismatches

--------------------------------------------------------------------------------
palmz72_defconfig (arm, gcc-10) — PASS, 0 errors, 0 warnings, 0 section mismatches

--------------------------------------------------------------------------------
pcm027_defconfig (arm, gcc-10) — PASS, 0 errors, 0 warnings, 0 section mismatches

--------------------------------------------------------------------------------
pleb_defconfig (arm, gcc-10) — PASS, 0 errors, 0 warnings, 0 section mismatches

--------------------------------------------------------------------------------
pnx8335_stb225_defconfig (mips, gcc-10) — PASS, 0 errors, 0 warnings, 0 section mismatches

--------------------------------------------------------------------------------
prima2_defconfig (arm, gcc-10) — PASS, 0 errors, 0 warnings, 0 section mismatches

--------------------------------------------------------------------------------
pxa168_defconfig (arm, gcc-10) — PASS, 0 errors, 0 warnings, 0 section mismatches

--------------------------------------------------------------------------------
pxa255-idp_defconfig (arm, gcc-10) — PASS, 0 errors, 0 warnings, 0 section mismatches

--------------------------------------------------------------------------------
pxa3xx_defconfig (arm, gcc-10) — PASS, 0 errors, 0 warnings, 0 section mismatches

--------------------------------------------------------------------------------
pxa910_defconfig (arm, gcc-10) — PASS, 0 errors, 0 warnings, 0 section mismatches

--------------------------------------------------------------------------------
pxa_defconfig (arm, gcc-10) — PASS, 0 errors, 0 warnings, 0 section mismatches

--------------------------------------------------------------------------------
qcom_defconfig (arm, gcc-10) — PASS, 0 errors, 0 warnings, 0 section mismatches

--------------------------------------------------------------------------------
qi_lb60_defconfig (mips, gcc-10) — PASS, 0 errors, 0 warnings, 0 section mismatches

--------------------------------------------------------------------------------
raumfeld_defconfig (arm, gcc-10) — PASS, 0 errors, 0 warnings, 0 section mismatches

--------------------------------------------------------------------------------
rb532_defconfig (mips, gcc-10) — PASS, 0 errors, 0 warnings, 0 section mismatches

--------------------------------------------------------------------------------
rbtx49xx_defconfig (mips, gcc-10) — PASS, 0 errors, 0 warnings, 0 section mismatches

--------------------------------------------------------------------------------
rpc_defconfig (arm, gcc-10) — FAIL, 2 errors, 0 warnings, 0 section mismatches

Errors:
arm-linux-gnueabihf-gcc: error: unrecognized -march target: armv3
arm-linux-gnueabihf-gcc: error: missing argument to ‘-march=’

--------------------------------------------------------------------------------
s5pv210_defconfig (arm, gcc-10) — PASS, 0 errors, 0 warnings, 0 section mismatches

Section mismatches:
WARNING: modpost: Found 1 section mismatch(es).

--------------------------------------------------------------------------------
sama5_defconfig (arm, gcc-10) — PASS, 0 errors, 0 warnings, 0 section mismatches

--------------------------------------------------------------------------------
shannon_defconfig (arm, gcc-10) — PASS, 0 errors, 0 warnings, 0 section mismatches

--------------------------------------------------------------------------------
shmobile_defconfig (arm, gcc-10) — PASS, 0 errors, 0 warnings, 0 section mismatches

--------------------------------------------------------------------------------
simpad_defconfig (arm, gcc-10) — PASS, 0 errors, 0 warnings, 0 section mismatches

--------------------------------------------------------------------------------
socfpga_defconfig (arm, gcc-10) — PASS, 0 errors, 0 warnings, 0 section mismatches

--------------------------------------------------------------------------------
spear13xx_defconfig (arm, gcc-10) — PASS, 0 errors, 0 warnings, 0 section mismatches

--------------------------------------------------------------------------------
spear3xx_defconfig (arm, gcc-10) — PASS, 0 errors, 0 warnings, 0 section mismatches

Section mismatches:
WARNING: modpost: Found 1 section mismatch(es).

--------------------------------------------------------------------------------
spear6xx_defconfig (arm, gcc-10) — PASS, 0 errors, 0 warnings, 0 section mismatches

Section mismatches:
WARNING: modpost: Found 1 section mismatch(es).

--------------------------------------------------------------------------------
spitz_defconfig (arm, gcc-10) — PASS, 0 errors, 0 warnings, 0 section mismatches

--------------------------------------------------------------------------------
stm32_defconfig (arm, gcc-10) — PASS, 0 errors, 0 warnings, 0 section mismatches

--------------------------------------------------------------------------------
sunxi_defconfig (arm, gcc-10) — PASS, 0 errors, 0 warnings, 0 section mismatches

--------------------------------------------------------------------------------
tango4_defconfig (arm, gcc-10) — PASS, 0 errors, 0 warnings, 0 section mismatches

--------------------------------------------------------------------------------
tb0226_defconfig (mips, gcc-10) — PASS, 0 errors, 0 warnings, 0 section mismatches

--------------------------------------------------------------------------------
tct_hammer_defconfig (arm, gcc-10) — PASS, 0 errors, 0 warnings, 0 section mismatches

--------------------------------------------------------------------------------
tinyconfig (i386, gcc-10) — PASS, 0 errors, 2 warnings, 0 section mismatches

Warnings:
ld: arch/x86/boot/compressed/head_32.o: warning: relocation in read-only section `.head.text'
ld: warning: creating DT_TEXTREL in a PIE

--------------------------------------------------------------------------------
tinyconfig (riscv, gcc-10) — FAIL, 0 errors, 0 warnings, 0 section mismatches

--------------------------------------------------------------------------------
tinyconfig (arc, gcc-10) — PASS, 0 errors, 0 warnings, 0 section mismatches

--------------------------------------------------------------------------------
u8500_defconfig (arm, gcc-10) — PASS, 0 errors, 0 warnings, 0 section mismatches

--------------------------------------------------------------------------------
vdk_hs38_defconfig (arc, gcc-10) — PASS, 0 errors, 0 warnings, 0 section mismatches

--------------------------------------------------------------------------------
versatile_defconfig (arm, gcc-10) — PASS, 0 errors, 0 warnings, 0 section mismatches

Section mismatches:
WARNING: modpost: Found 1 section mismatch(es).

--------------------------------------------------------------------------------
vf610m4_defconfig (arm, gcc-10) — PASS, 0 errors, 0 warnings, 0 section mismatches

--------------------------------------------------------------------------------
viper_defconfig (arm, gcc-10) — PASS, 0 errors, 0 warnings, 0 section mismatches

--------------------------------------------------------------------------------
vocore2_defconfig (mips, gcc-10) — PASS, 0 errors, 0 warnings, 0 section mismatches

--------------------------------------------------------------------------------
vt8500_v6_v7_defconfig (arm, gcc-10) — PASS, 0 errors, 0 warnings, 0 section mismatches

--------------------------------------------------------------------------------
workpad_defconfig (mips, gcc-10) — PASS, 0 errors, 0 warnings, 0 section mismatches

--------------------------------------------------------------------------------
xcep_defconfig (arm, gcc-10) — PASS, 0 errors, 0 warnings, 0 section mismatches

--------------------------------------------------------------------------------
zx_defconfig (arm, gcc-10) — PASS, 0 errors, 0 warnings, 0 section mismatches

---
For more info write to <info@...>

Join cip-dev@lists.cip-project.org to automatically receive all group messages.