Date   

Re: [PATCH] Update to kas 3.0

Jan Kiszka
 

On 07.03.22 10:34, Srinuvasan A wrote:
From: Srinuvasan A <srinuvasan_a@...>

Update to kas 3.0.

Signed-off-by: Srinuvasan A <srinuvasan_a@...>
---
.gitlab-ci.yml | 2 +-
README.md | 2 +-
2 files changed, 2 insertions(+), 2 deletions(-)

diff --git a/.gitlab-ci.yml b/.gitlab-ci.yml
index c06c783..f573da6 100644
--- a/.gitlab-ci.yml
+++ b/.gitlab-ci.yml
@@ -1,4 +1,4 @@
-image: ghcr.io/siemens/kas/kas-isar:2.6.2
+image: ghcr.io/siemens/kas/kas-isar:3.0

variables:
GIT_STRATEGY: clone
diff --git a/README.md b/README.md
index f7cb86e..fc4ddbf 100644
--- a/README.md
+++ b/README.md
@@ -12,7 +12,7 @@ from scratch.

Install `kas-container` from the [kas project](https://github.com/siemens/kas):

- wget https://raw.githubusercontent.com/siemens/kas/2.6.2/kas-container
+ wget https://raw.githubusercontent.com/siemens/kas/3.0/kas-container
chmod a+x kas-container

Furthermore, install docker and make sure you have required permissions to
Please give kas 3.0.2 now a try. It should finally work without
undesired side-effects.

Thanks,
Jan

--
Siemens AG, Technology
Competence Center Embedded Linux


Adding v4.9.y-rc testing support

Chris Paterson
 

Hello Iwamatsu-san, all,

I've started to add v4.9.y-rc testing support.
Initially the build/test support [0] is identical to our v4.4.y-rc testing [1].

In a test run [2] however, we're seeing three failures.
Looking into it further, it looks like we didn't copy three configurations from v4.4.y-cip to v4.9.y-cip [3].
Was this intentional? Or do we need to reinclude the siemens_am57xx-pxm3, siemens_dcu2 and siemens_iot2000 configs in v4.9.y-cip?

[0] https://gitlab.com/cip-project/cip-testing/linux-cip-pipelines/-/blob/patersonc/test-4.9-stable/trees/linux-4.9.y.yml
[1] https://gitlab.com/cip-project/cip-testing/linux-cip-pipelines/-/blob/master/trees/linux-4.4.y.yml
[2] https://gitlab.com/cip-project/cip-testing/linux-stable-rc-ci/-/pipelines/486998446
[3] https://gitlab.com/cip-project/cip-kernel/cip-kernel-config/-/commit/e737c5ec22d2b7d3220d83855a952340f2357636

Thanks, Chris


Re: [PATCH] linux-cip: Update kernel versions

Jan Kiszka
 

On 08.03.22 11:44, Srinuvasan A wrote:
From: Srinuvasan A <srinuvasan_a@...>

Bump kernel versions for linux-cip-kernel 4.4,4.19 and 5.10.

Signed-off-by: Srinuvasan A <srinuvasan_a@...>
---
...4.4.285-cip63-rt36.bb => linux-cip-rt_4.4.302-cip68-rt38.bb} | 2 +-
...rt_5.10.83-cip1-rt1.bb => linux-cip-rt_5.10.100-cip2-rt2.bb} | 2 +-
...{linux-cip_4.19.217-cip62.bb => linux-cip_4.19.231-cip68.bb} | 2 +-
.../{linux-cip_4.4.291-cip65.bb => linux-cip_4.4.302-cip68.bb} | 2 +-
.../{linux-cip_5.10.83-cip1.bb => linux-cip_5.10.100-cip2.bb} | 2 +-
5 files changed, 5 insertions(+), 5 deletions(-)
rename recipes-kernel/linux/{linux-cip-rt_4.4.285-cip63-rt36.bb => linux-cip-rt_4.4.302-cip68-rt38.bb} (72%)
rename recipes-kernel/linux/{linux-cip-rt_5.10.83-cip1-rt1.bb => linux-cip-rt_5.10.100-cip2-rt2.bb} (72%)
rename recipes-kernel/linux/{linux-cip_4.19.217-cip62.bb => linux-cip_4.19.231-cip68.bb} (72%)
rename recipes-kernel/linux/{linux-cip_4.4.291-cip65.bb => linux-cip_4.4.302-cip68.bb} (72%)
rename recipes-kernel/linux/{linux-cip_5.10.83-cip1.bb => linux-cip_5.10.100-cip2.bb} (71%)

diff --git a/recipes-kernel/linux/linux-cip-rt_4.4.285-cip63-rt36.bb b/recipes-kernel/linux/linux-cip-rt_4.4.302-cip68-rt38.bb
similarity index 72%
rename from recipes-kernel/linux/linux-cip-rt_4.4.285-cip63-rt36.bb
rename to recipes-kernel/linux/linux-cip-rt_4.4.302-cip68-rt38.bb
index 41342b3..fae4125 100644
--- a/recipes-kernel/linux/linux-cip-rt_4.4.285-cip63-rt36.bb
+++ b/recipes-kernel/linux/linux-cip-rt_4.4.302-cip68-rt38.bb
@@ -13,4 +13,4 @@ require linux-cip-rt-common.inc

KERNEL_DEFCONFIG_VERSION ?= "4.4.y-cip"

-SRC_URI[sha256sum] = "c2fe6bcf44fc7a8ee9785adc4dc41d07c50d803883add859648cbbb0461854fa"
+SRC_URI[sha256sum] = "bbcc9af1b08a1285a9fc5ba57cba74dcc9fb6511dd74029576ca82629d04cad7"
diff --git a/recipes-kernel/linux/linux-cip-rt_5.10.83-cip1-rt1.bb b/recipes-kernel/linux/linux-cip-rt_5.10.100-cip2-rt2.bb
similarity index 72%
rename from recipes-kernel/linux/linux-cip-rt_5.10.83-cip1-rt1.bb
rename to recipes-kernel/linux/linux-cip-rt_5.10.100-cip2-rt2.bb
index b20ac56..96c4d07 100644
--- a/recipes-kernel/linux/linux-cip-rt_5.10.83-cip1-rt1.bb
+++ b/recipes-kernel/linux/linux-cip-rt_5.10.100-cip2-rt2.bb
@@ -13,4 +13,4 @@ require linux-cip-rt-common.inc

KERNEL_DEFCONFIG_VERSION ?= "5.10.y-cip"

-SRC_URI[sha256sum] = "e10b3ab1ad09ed7650883c5357b68660ac1c56f6d71b3b82feb0d69ed182ea54"
+SRC_URI[sha256sum] = "e642fc604b611dc6f3e8382447fb2bc4047d129a14cba3996d34b85e07ae9d3a"
diff --git a/recipes-kernel/linux/linux-cip_4.19.217-cip62.bb b/recipes-kernel/linux/linux-cip_4.19.231-cip68.bb
similarity index 72%
rename from recipes-kernel/linux/linux-cip_4.19.217-cip62.bb
rename to recipes-kernel/linux/linux-cip_4.19.231-cip68.bb
index 0147313..91ef5f6 100644
--- a/recipes-kernel/linux/linux-cip_4.19.217-cip62.bb
+++ b/recipes-kernel/linux/linux-cip_4.19.231-cip68.bb
@@ -13,4 +13,4 @@ require linux-cip-common.inc

KERNEL_DEFCONFIG_VERSION ?= "4.19.y-cip"

-SRC_URI[sha256sum] = "00b22f2e7b3d4f5787ca92f2e182211ac2c1391c09435174c2b4670b2837b23c"
+SRC_URI[sha256sum] = "f39146555dcee1e9f76c4b6e000e0d6f42d4a6a56d95d415ac1442b1f99d0465"
diff --git a/recipes-kernel/linux/linux-cip_4.4.291-cip65.bb b/recipes-kernel/linux/linux-cip_4.4.302-cip68.bb
similarity index 72%
rename from recipes-kernel/linux/linux-cip_4.4.291-cip65.bb
rename to recipes-kernel/linux/linux-cip_4.4.302-cip68.bb
index 4e32031..160b7ed 100644
--- a/recipes-kernel/linux/linux-cip_4.4.291-cip65.bb
+++ b/recipes-kernel/linux/linux-cip_4.4.302-cip68.bb
@@ -13,4 +13,4 @@ require linux-cip-common.inc

KERNEL_DEFCONFIG_VERSION ?= "4.4.y-cip"

-SRC_URI[sha256sum] = "9ed7782c067793e684691e99388608ff746f04121cc35dbbbfc2fa5ed6f9e88e"
+SRC_URI[sha256sum] = "d49e1fd2df419279a8595db6e68311cbb91399a92e6d71672543c4eb2088b317"
diff --git a/recipes-kernel/linux/linux-cip_5.10.83-cip1.bb b/recipes-kernel/linux/linux-cip_5.10.100-cip2.bb
similarity index 71%
rename from recipes-kernel/linux/linux-cip_5.10.83-cip1.bb
rename to recipes-kernel/linux/linux-cip_5.10.100-cip2.bb
index 236358a..e2bb298 100644
--- a/recipes-kernel/linux/linux-cip_5.10.83-cip1.bb
+++ b/recipes-kernel/linux/linux-cip_5.10.100-cip2.bb
@@ -13,4 +13,4 @@ require linux-cip-common.inc

KERNEL_DEFCONFIG_VERSION ?= "5.10.y-cip"

-SRC_URI[sha256sum] = "85af8f809b2505c6434266d6658d977d62d383889b3a4f9968b2764794108d4f"
+SRC_URI[sha256sum] = "0fe532c7900299888160a740ed70c1daaa9536fe545bee4f754043e1e0a09c16"
Thanks for taking care! Applied to next.

Jan

--
Siemens AG, Technology
Competence Center Embedded Linux


[PATCH] linux-cip: Update kernel versions

Srinuvasan A
 

From: Srinuvasan A <srinuvasan_a@...>

Bump kernel versions for linux-cip-kernel 4.4,4.19 and 5.10.

Signed-off-by: Srinuvasan A <srinuvasan_a@...>
---
...4.4.285-cip63-rt36.bb => linux-cip-rt_4.4.302-cip68-rt38.bb} | 2 +-
...rt_5.10.83-cip1-rt1.bb => linux-cip-rt_5.10.100-cip2-rt2.bb} | 2 +-
...{linux-cip_4.19.217-cip62.bb => linux-cip_4.19.231-cip68.bb} | 2 +-
.../{linux-cip_4.4.291-cip65.bb => linux-cip_4.4.302-cip68.bb} | 2 +-
.../{linux-cip_5.10.83-cip1.bb => linux-cip_5.10.100-cip2.bb} | 2 +-
5 files changed, 5 insertions(+), 5 deletions(-)
rename recipes-kernel/linux/{linux-cip-rt_4.4.285-cip63-rt36.bb => linux-cip-rt_4.4.302-cip68-rt38.bb} (72%)
rename recipes-kernel/linux/{linux-cip-rt_5.10.83-cip1-rt1.bb => linux-cip-rt_5.10.100-cip2-rt2.bb} (72%)
rename recipes-kernel/linux/{linux-cip_4.19.217-cip62.bb => linux-cip_4.19.231-cip68.bb} (72%)
rename recipes-kernel/linux/{linux-cip_4.4.291-cip65.bb => linux-cip_4.4.302-cip68.bb} (72%)
rename recipes-kernel/linux/{linux-cip_5.10.83-cip1.bb => linux-cip_5.10.100-cip2.bb} (71%)

diff --git a/recipes-kernel/linux/linux-cip-rt_4.4.285-cip63-rt36.bb b/recipes-kernel/linux/linux-cip-rt_4.4.302-cip68-rt38.bb
similarity index 72%
rename from recipes-kernel/linux/linux-cip-rt_4.4.285-cip63-rt36.bb
rename to recipes-kernel/linux/linux-cip-rt_4.4.302-cip68-rt38.bb
index 41342b3..fae4125 100644
--- a/recipes-kernel/linux/linux-cip-rt_4.4.285-cip63-rt36.bb
+++ b/recipes-kernel/linux/linux-cip-rt_4.4.302-cip68-rt38.bb
@@ -13,4 +13,4 @@ require linux-cip-rt-common.inc

KERNEL_DEFCONFIG_VERSION ?= "4.4.y-cip"

-SRC_URI[sha256sum] = "c2fe6bcf44fc7a8ee9785adc4dc41d07c50d803883add859648cbbb0461854fa"
+SRC_URI[sha256sum] = "bbcc9af1b08a1285a9fc5ba57cba74dcc9fb6511dd74029576ca82629d04cad7"
diff --git a/recipes-kernel/linux/linux-cip-rt_5.10.83-cip1-rt1.bb b/recipes-kernel/linux/linux-cip-rt_5.10.100-cip2-rt2.bb
similarity index 72%
rename from recipes-kernel/linux/linux-cip-rt_5.10.83-cip1-rt1.bb
rename to recipes-kernel/linux/linux-cip-rt_5.10.100-cip2-rt2.bb
index b20ac56..96c4d07 100644
--- a/recipes-kernel/linux/linux-cip-rt_5.10.83-cip1-rt1.bb
+++ b/recipes-kernel/linux/linux-cip-rt_5.10.100-cip2-rt2.bb
@@ -13,4 +13,4 @@ require linux-cip-rt-common.inc

KERNEL_DEFCONFIG_VERSION ?= "5.10.y-cip"

-SRC_URI[sha256sum] = "e10b3ab1ad09ed7650883c5357b68660ac1c56f6d71b3b82feb0d69ed182ea54"
+SRC_URI[sha256sum] = "e642fc604b611dc6f3e8382447fb2bc4047d129a14cba3996d34b85e07ae9d3a"
diff --git a/recipes-kernel/linux/linux-cip_4.19.217-cip62.bb b/recipes-kernel/linux/linux-cip_4.19.231-cip68.bb
similarity index 72%
rename from recipes-kernel/linux/linux-cip_4.19.217-cip62.bb
rename to recipes-kernel/linux/linux-cip_4.19.231-cip68.bb
index 0147313..91ef5f6 100644
--- a/recipes-kernel/linux/linux-cip_4.19.217-cip62.bb
+++ b/recipes-kernel/linux/linux-cip_4.19.231-cip68.bb
@@ -13,4 +13,4 @@ require linux-cip-common.inc

KERNEL_DEFCONFIG_VERSION ?= "4.19.y-cip"

-SRC_URI[sha256sum] = "00b22f2e7b3d4f5787ca92f2e182211ac2c1391c09435174c2b4670b2837b23c"
+SRC_URI[sha256sum] = "f39146555dcee1e9f76c4b6e000e0d6f42d4a6a56d95d415ac1442b1f99d0465"
diff --git a/recipes-kernel/linux/linux-cip_4.4.291-cip65.bb b/recipes-kernel/linux/linux-cip_4.4.302-cip68.bb
similarity index 72%
rename from recipes-kernel/linux/linux-cip_4.4.291-cip65.bb
rename to recipes-kernel/linux/linux-cip_4.4.302-cip68.bb
index 4e32031..160b7ed 100644
--- a/recipes-kernel/linux/linux-cip_4.4.291-cip65.bb
+++ b/recipes-kernel/linux/linux-cip_4.4.302-cip68.bb
@@ -13,4 +13,4 @@ require linux-cip-common.inc

KERNEL_DEFCONFIG_VERSION ?= "4.4.y-cip"

-SRC_URI[sha256sum] = "9ed7782c067793e684691e99388608ff746f04121cc35dbbbfc2fa5ed6f9e88e"
+SRC_URI[sha256sum] = "d49e1fd2df419279a8595db6e68311cbb91399a92e6d71672543c4eb2088b317"
diff --git a/recipes-kernel/linux/linux-cip_5.10.83-cip1.bb b/recipes-kernel/linux/linux-cip_5.10.100-cip2.bb
similarity index 71%
rename from recipes-kernel/linux/linux-cip_5.10.83-cip1.bb
rename to recipes-kernel/linux/linux-cip_5.10.100-cip2.bb
index 236358a..e2bb298 100644
--- a/recipes-kernel/linux/linux-cip_5.10.83-cip1.bb
+++ b/recipes-kernel/linux/linux-cip_5.10.100-cip2.bb
@@ -13,4 +13,4 @@ require linux-cip-common.inc

KERNEL_DEFCONFIG_VERSION ?= "5.10.y-cip"

-SRC_URI[sha256sum] = "85af8f809b2505c6434266d6658d977d62d383889b3a4f9968b2764794108d4f"
+SRC_URI[sha256sum] = "0fe532c7900299888160a740ed70c1daaa9536fe545bee4f754043e1e0a09c16"
--
2.25.1


cip-gitlab/ci/pavel/linux-test build: 155 builds: 3 failed, 152 passed, 4 errors, 9 warnings (v5.10.100-cip2-319-g7182f5032311) #kernelci

kernelci.org bot <bot@...>
 

cip-gitlab/ci/pavel/linux-test build: 155 builds: 3 failed, 152 passed, 4 errors, 9 warnings (v5.10.100-cip2-319-g7182f5032311)

Full Build Summary: https://kernelci.org/build/cip-gitlab/branch/ci%2Fpavel%2Flinux-test/kernel/v5.10.100-cip2-319-g7182f5032311/

Tree: cip-gitlab
Branch: ci/pavel/linux-test
Git Describe: v5.10.100-cip2-319-g7182f5032311
Git Commit: 7182f50323114ab417bdac55f0be890e8f84e2a1
Git URL: https://gitlab.com/cip-project/cip-kernel/linux-cip.git
Built: 7 unique architectures

Build Failures Detected:

arm:
rpc_defconfig: (gcc-10) FAIL

mips:
ip27_defconfig: (gcc-10) FAIL
ip28_defconfig: (gcc-10) FAIL

Errors and Warnings Detected:

arc:

arm64:

arm:
rpc_defconfig (gcc-10): 4 errors

i386:

mips:
32r2el_defconfig (gcc-10): 1 warning
decstation_64_defconfig (gcc-10): 1 warning
decstation_defconfig (gcc-10): 1 warning
decstation_r4k_defconfig (gcc-10): 1 warning
lemote2f_defconfig (gcc-10): 1 warning

riscv:
rv32_defconfig (gcc-10): 4 warnings

x86_64:

Errors summary:

2 arm-linux-gnueabihf-gcc: error: unrecognized -march target: armv3m
2 arm-linux-gnueabihf-gcc: error: missing argument to ‘-march=’

Warnings summary:

3 kernel/rcu/tasks.h:707:13: warning: ‘show_rcu_tasks_rude_gp_kthread’ defined but not used [-Wunused-function]
2 <stdin>:830:2: warning: #warning syscall fstat64 not implemented [-Wcpp]
2 <stdin>:1127:2: warning: #warning syscall fstatat64 not implemented [-Wcpp]
1 net/mac80211/mlme.c:4335:1: warning: the frame size of 1040 bytes is larger than 1024 bytes [-Wframe-larger-than=]
1 WARNING: modpost: Symbol info of vmlinux is missing. Unresolved symbol check will be entirely skipped.

Section mismatches summary:

1 WARNING: modpost: vmlinux.o(.text+0xd040): Section mismatch in reference from the function __arm_ioremap_pfn_caller() to the function .meminit.text:memblock_is_map_memory()
1 WARNING: modpost: vmlinux.o(.text+0xce9c): Section mismatch in reference from the function __arm_ioremap_pfn_caller() to the function .meminit.text:memblock_is_map_memory()
1 WARNING: modpost: vmlinux.o(.text+0xcda4): Section mismatch in reference from the function __arm_ioremap_pfn_caller() to the function .meminit.text:memblock_is_map_memory()
1 WARNING: modpost: vmlinux.o(.text+0xcd38): Section mismatch in reference from the function __arm_ioremap_pfn_caller() to the function .meminit.text:memblock_is_map_memory()
1 WARNING: modpost: vmlinux.o(.text+0xcb84): Section mismatch in reference from the function __arm_ioremap_pfn_caller() to the function .meminit.text:memblock_is_map_memory()
1 WARNING: modpost: vmlinux.o(.text+0xcb6c): Section mismatch in reference from the function __arm_ioremap_pfn_caller() to the function .meminit.text:memblock_is_map_memory()
1 WARNING: modpost: vmlinux.o(.text+0xcb4c): Section mismatch in reference from the function __arm_ioremap_pfn_caller() to the function .meminit.text:memblock_is_map_memory()
1 WARNING: modpost: vmlinux.o(.text+0xcaa8): Section mismatch in reference from the function __arm_ioremap_pfn_caller() to the function .meminit.text:memblock_is_map_memory()
1 WARNING: modpost: vmlinux.o(.text+0xc8ec): Section mismatch in reference from the function __arm_ioremap_pfn_caller() to the function .meminit.text:memblock_is_map_memory()
1 WARNING: modpost: vmlinux.o(.text+0xb904): Section mismatch in reference from the function __arm_ioremap_pfn_caller() to the function .meminit.text:memblock_is_map_memory()
1 WARNING: modpost: vmlinux.o(.text+0x8054): Section mismatch in reference from the function __arm_ioremap_pfn_caller() to the function .meminit.text:memblock_is_map_memory()
1 WARNING: modpost: vmlinux.o(.text+0x7670): Section mismatch in reference from the function __arm_ioremap_pfn_caller() to the function .meminit.text:memblock_is_map_memory()

================================================================================

Detailed per-defconfig build reports:

--------------------------------------------------------------------------------
32r2el_defconfig (mips, gcc-10) — PASS, 0 errors, 1 warning, 0 section mismatches

Warnings:
WARNING: modpost: Symbol info of vmlinux is missing. Unresolved symbol check will be entirely skipped.

--------------------------------------------------------------------------------
allnoconfig (x86_64, gcc-10) — PASS, 0 errors, 0 warnings, 0 section mismatches

--------------------------------------------------------------------------------
allnoconfig (arc, gcc-10) — PASS, 0 errors, 0 warnings, 0 section mismatches

--------------------------------------------------------------------------------
allnoconfig (i386, gcc-10) — PASS, 0 errors, 0 warnings, 0 section mismatches

--------------------------------------------------------------------------------
am200epdkit_defconfig (arm, gcc-10) — PASS, 0 errors, 0 warnings, 0 section mismatches

--------------------------------------------------------------------------------
ar7_defconfig (mips, gcc-10) — PASS, 0 errors, 0 warnings, 0 section mismatches

--------------------------------------------------------------------------------
aspeed_g4_defconfig (arm, gcc-10) — PASS, 0 errors, 0 warnings, 0 section mismatches

--------------------------------------------------------------------------------
aspeed_g5_defconfig (arm, gcc-10) — PASS, 0 errors, 0 warnings, 0 section mismatches

--------------------------------------------------------------------------------
assabet_defconfig (arm, gcc-10) — PASS, 0 errors, 0 warnings, 0 section mismatches

Section mismatches:
WARNING: modpost: vmlinux.o(.text+0xcb6c): Section mismatch in reference from the function __arm_ioremap_pfn_caller() to the function .meminit.text:memblock_is_map_memory()

--------------------------------------------------------------------------------
at91_dt_defconfig (arm, gcc-10) — PASS, 0 errors, 0 warnings, 0 section mismatches

--------------------------------------------------------------------------------
ath79_defconfig (mips, gcc-10) — PASS, 0 errors, 0 warnings, 0 section mismatches

--------------------------------------------------------------------------------
axm55xx_defconfig (arm, gcc-10) — PASS, 0 errors, 0 warnings, 0 section mismatches

--------------------------------------------------------------------------------
axs103_smp_defconfig (arc, gcc-10) — PASS, 0 errors, 0 warnings, 0 section mismatches

--------------------------------------------------------------------------------
badge4_defconfig (arm, gcc-10) — PASS, 0 errors, 0 warnings, 0 section mismatches

Section mismatches:
WARNING: modpost: vmlinux.o(.text+0xcd38): Section mismatch in reference from the function __arm_ioremap_pfn_caller() to the function .meminit.text:memblock_is_map_memory()

--------------------------------------------------------------------------------
bcm2835_defconfig (arm, gcc-10) — PASS, 0 errors, 0 warnings, 0 section mismatches

--------------------------------------------------------------------------------
bcm47xx_defconfig (mips, gcc-10) — PASS, 0 errors, 0 warnings, 0 section mismatches

--------------------------------------------------------------------------------
bcm63xx_defconfig (mips, gcc-10) — PASS, 0 errors, 0 warnings, 0 section mismatches

--------------------------------------------------------------------------------
bigsur_defconfig (mips, gcc-10) — PASS, 0 errors, 0 warnings, 0 section mismatches

--------------------------------------------------------------------------------
bmips_stb_defconfig (mips, gcc-10) — PASS, 0 errors, 0 warnings, 0 section mismatches

--------------------------------------------------------------------------------
cavium_octeon_defconfig (mips, gcc-10) — PASS, 0 errors, 0 warnings, 0 section mismatches

--------------------------------------------------------------------------------
cerfcube_defconfig (arm, gcc-10) — PASS, 0 errors, 0 warnings, 0 section mismatches

Section mismatches:
WARNING: modpost: vmlinux.o(.text+0x7670): Section mismatch in reference from the function __arm_ioremap_pfn_caller() to the function .meminit.text:memblock_is_map_memory()

--------------------------------------------------------------------------------
ci20_defconfig (mips, gcc-10) — PASS, 0 errors, 0 warnings, 0 section mismatches

--------------------------------------------------------------------------------
cm_x300_defconfig (arm, gcc-10) — PASS, 0 errors, 0 warnings, 0 section mismatches

--------------------------------------------------------------------------------
cobalt_defconfig (mips, gcc-10) — PASS, 0 errors, 0 warnings, 0 section mismatches

--------------------------------------------------------------------------------
colibri_pxa270_defconfig (arm, gcc-10) — PASS, 0 errors, 0 warnings, 0 section mismatches

--------------------------------------------------------------------------------
collie_defconfig (arm, gcc-10) — PASS, 0 errors, 0 warnings, 0 section mismatches

Section mismatches:
WARNING: modpost: vmlinux.o(.text+0xb904): Section mismatch in reference from the function __arm_ioremap_pfn_caller() to the function .meminit.text:memblock_is_map_memory()

--------------------------------------------------------------------------------
corgi_defconfig (arm, gcc-10) — PASS, 0 errors, 0 warnings, 0 section mismatches

--------------------------------------------------------------------------------
cu1830-neo_defconfig (mips, gcc-10) — PASS, 0 errors, 0 warnings, 0 section mismatches

--------------------------------------------------------------------------------
davinci_all_defconfig (arm, gcc-10) — PASS, 0 errors, 0 warnings, 0 section mismatches

--------------------------------------------------------------------------------
db1xxx_defconfig (mips, gcc-10) — PASS, 0 errors, 0 warnings, 0 section mismatches

--------------------------------------------------------------------------------
decstation_64_defconfig (mips, gcc-10) — PASS, 0 errors, 1 warning, 0 section mismatches

Warnings:
kernel/rcu/tasks.h:707:13: warning: ‘show_rcu_tasks_rude_gp_kthread’ defined but not used [-Wunused-function]

--------------------------------------------------------------------------------
decstation_defconfig (mips, gcc-10) — PASS, 0 errors, 1 warning, 0 section mismatches

Warnings:
kernel/rcu/tasks.h:707:13: warning: ‘show_rcu_tasks_rude_gp_kthread’ defined but not used [-Wunused-function]

--------------------------------------------------------------------------------
decstation_r4k_defconfig (mips, gcc-10) — PASS, 0 errors, 1 warning, 0 section mismatches

Warnings:
kernel/rcu/tasks.h:707:13: warning: ‘show_rcu_tasks_rude_gp_kthread’ defined but not used [-Wunused-function]

--------------------------------------------------------------------------------
defconfig (riscv, gcc-10) — PASS, 0 errors, 0 warnings, 0 section mismatches

--------------------------------------------------------------------------------
defconfig (arm64, gcc-10) — PASS, 0 errors, 0 warnings, 0 section mismatches

--------------------------------------------------------------------------------
defconfig+arm64-chromebook (arm64, gcc-10) — PASS, 0 errors, 0 warnings, 0 section mismatches

--------------------------------------------------------------------------------
dove_defconfig (arm, gcc-10) — PASS, 0 errors, 0 warnings, 0 section mismatches

--------------------------------------------------------------------------------
e55_defconfig (mips, gcc-10) — PASS, 0 errors, 0 warnings, 0 section mismatches

--------------------------------------------------------------------------------
ebsa110_defconfig (arm, gcc-10) — PASS, 0 errors, 0 warnings, 0 section mismatches

--------------------------------------------------------------------------------
ep93xx_defconfig (arm, gcc-10) — PASS, 0 errors, 0 warnings, 0 section mismatches

Section mismatches:
WARNING: modpost: vmlinux.o(.text+0x8054): Section mismatch in reference from the function __arm_ioremap_pfn_caller() to the function .meminit.text:memblock_is_map_memory()

--------------------------------------------------------------------------------
eseries_pxa_defconfig (arm, gcc-10) — PASS, 0 errors, 0 warnings, 0 section mismatches

--------------------------------------------------------------------------------
exynos_defconfig (arm, gcc-10) — PASS, 0 errors, 0 warnings, 0 section mismatches

--------------------------------------------------------------------------------
ezx_defconfig (arm, gcc-10) — PASS, 0 errors, 0 warnings, 0 section mismatches

--------------------------------------------------------------------------------
footbridge_defconfig (arm, gcc-10) — PASS, 0 errors, 0 warnings, 0 section mismatches

--------------------------------------------------------------------------------
fuloong2e_defconfig (mips, gcc-10) — PASS, 0 errors, 0 warnings, 0 section mismatches

--------------------------------------------------------------------------------
gcw0_defconfig (mips, gcc-10) — PASS, 0 errors, 0 warnings, 0 section mismatches

--------------------------------------------------------------------------------
gemini_defconfig (arm, gcc-10) — PASS, 0 errors, 0 warnings, 0 section mismatches

--------------------------------------------------------------------------------
gpr_defconfig (mips, gcc-10) — PASS, 0 errors, 0 warnings, 0 section mismatches

--------------------------------------------------------------------------------
h3600_defconfig (arm, gcc-10) — PASS, 0 errors, 0 warnings, 0 section mismatches

Section mismatches:
WARNING: modpost: vmlinux.o(.text+0xcb84): Section mismatch in reference from the function __arm_ioremap_pfn_caller() to the function .meminit.text:memblock_is_map_memory()

--------------------------------------------------------------------------------
h5000_defconfig (arm, gcc-10) — PASS, 0 errors, 0 warnings, 0 section mismatches

--------------------------------------------------------------------------------
hackkit_defconfig (arm, gcc-10) — PASS, 0 errors, 0 warnings, 0 section mismatches

Section mismatches:
WARNING: modpost: vmlinux.o(.text+0xce9c): Section mismatch in reference from the function __arm_ioremap_pfn_caller() to the function .meminit.text:memblock_is_map_memory()

--------------------------------------------------------------------------------
haps_hs_defconfig (arc, gcc-10) — PASS, 0 errors, 0 warnings, 0 section mismatches

--------------------------------------------------------------------------------
haps_hs_smp_defconfig (arc, gcc-10) — PASS, 0 errors, 0 warnings, 0 section mismatches

--------------------------------------------------------------------------------
hisi_defconfig (arm, gcc-10) — PASS, 0 errors, 0 warnings, 0 section mismatches

--------------------------------------------------------------------------------
hsdk_defconfig (arc, gcc-10) — PASS, 0 errors, 0 warnings, 0 section mismatches

--------------------------------------------------------------------------------
i386_defconfig (i386, gcc-10) — PASS, 0 errors, 0 warnings, 0 section mismatches

--------------------------------------------------------------------------------
imote2_defconfig (arm, gcc-10) — PASS, 0 errors, 0 warnings, 0 section mismatches

--------------------------------------------------------------------------------
imx_v4_v5_defconfig (arm, gcc-10) — PASS, 0 errors, 0 warnings, 0 section mismatches

--------------------------------------------------------------------------------
imx_v6_v7_defconfig (arm, gcc-10) — PASS, 0 errors, 0 warnings, 0 section mismatches

--------------------------------------------------------------------------------
iop32x_defconfig (arm, gcc-10) — PASS, 0 errors, 0 warnings, 0 section mismatches

--------------------------------------------------------------------------------
ip22_defconfig (mips, gcc-10) — PASS, 0 errors, 0 warnings, 0 section mismatches

--------------------------------------------------------------------------------
ip27_defconfig (mips, gcc-10) — FAIL, 0 errors, 0 warnings, 0 section mismatches

--------------------------------------------------------------------------------
ip28_defconfig (mips, gcc-10) — FAIL, 0 errors, 0 warnings, 0 section mismatches

--------------------------------------------------------------------------------
ip32_defconfig (mips, gcc-10) — PASS, 0 errors, 0 warnings, 0 section mismatches

--------------------------------------------------------------------------------
ixp4xx_defconfig (arm, gcc-10) — PASS, 0 errors, 0 warnings, 0 section mismatches

--------------------------------------------------------------------------------
jazz_defconfig (mips, gcc-10) — PASS, 0 errors, 0 warnings, 0 section mismatches

--------------------------------------------------------------------------------
jmr3927_defconfig (mips, gcc-10) — PASS, 0 errors, 0 warnings, 0 section mismatches

--------------------------------------------------------------------------------
jornada720_defconfig (arm, gcc-10) — PASS, 0 errors, 0 warnings, 0 section mismatches

Section mismatches:
WARNING: modpost: vmlinux.o(.text+0xcaa8): Section mismatch in reference from the function __arm_ioremap_pfn_caller() to the function .meminit.text:memblock_is_map_memory()

--------------------------------------------------------------------------------
keystone_defconfig (arm, gcc-10) — PASS, 0 errors, 0 warnings, 0 section mismatches

--------------------------------------------------------------------------------
lemote2f_defconfig (mips, gcc-10) — PASS, 0 errors, 1 warning, 0 section mismatches

Warnings:
net/mac80211/mlme.c:4335:1: warning: the frame size of 1040 bytes is larger than 1024 bytes [-Wframe-larger-than=]

--------------------------------------------------------------------------------
loongson1b_defconfig (mips, gcc-10) — PASS, 0 errors, 0 warnings, 0 section mismatches

--------------------------------------------------------------------------------
loongson1c_defconfig (mips, gcc-10) — PASS, 0 errors, 0 warnings, 0 section mismatches

--------------------------------------------------------------------------------
loongson3_defconfig (mips, gcc-10) — PASS, 0 errors, 0 warnings, 0 section mismatches

--------------------------------------------------------------------------------
lpc18xx_defconfig (arm, gcc-10) — PASS, 0 errors, 0 warnings, 0 section mismatches

--------------------------------------------------------------------------------
lpc32xx_defconfig (arm, gcc-10) — PASS, 0 errors, 0 warnings, 0 section mismatches

--------------------------------------------------------------------------------
lpd270_defconfig (arm, gcc-10) — PASS, 0 errors, 0 warnings, 0 section mismatches

--------------------------------------------------------------------------------
lubbock_defconfig (arm, gcc-10) — PASS, 0 errors, 0 warnings, 0 section mismatches

--------------------------------------------------------------------------------
mainstone_defconfig (arm, gcc-10) — PASS, 0 errors, 0 warnings, 0 section mismatches

--------------------------------------------------------------------------------
malta_defconfig (mips, gcc-10) — PASS, 0 errors, 0 warnings, 0 section mismatches

--------------------------------------------------------------------------------
malta_kvm_defconfig (mips, gcc-10) — PASS, 0 errors, 0 warnings, 0 section mismatches

--------------------------------------------------------------------------------
maltaaprp_defconfig (mips, gcc-10) — PASS, 0 errors, 0 warnings, 0 section mismatches

--------------------------------------------------------------------------------
maltasmvp_defconfig (mips, gcc-10) — PASS, 0 errors, 0 warnings, 0 section mismatches

--------------------------------------------------------------------------------
maltasmvp_eva_defconfig (mips, gcc-10) — PASS, 0 errors, 0 warnings, 0 section mismatches

--------------------------------------------------------------------------------
maltaup_xpa_defconfig (mips, gcc-10) — PASS, 0 errors, 0 warnings, 0 section mismatches

--------------------------------------------------------------------------------
milbeaut_m10v_defconfig (arm, gcc-10) — PASS, 0 errors, 0 warnings, 0 section mismatches

--------------------------------------------------------------------------------
mini2440_defconfig (arm, gcc-10) — PASS, 0 errors, 0 warnings, 0 section mismatches

--------------------------------------------------------------------------------
mmp2_defconfig (arm, gcc-10) — PASS, 0 errors, 0 warnings, 0 section mismatches

--------------------------------------------------------------------------------
mpc30x_defconfig (mips, gcc-10) — PASS, 0 errors, 0 warnings, 0 section mismatches

--------------------------------------------------------------------------------
mtx1_defconfig (mips, gcc-10) — PASS, 0 errors, 0 warnings, 0 section mismatches

--------------------------------------------------------------------------------
multi_v5_defconfig (arm, gcc-10) — PASS, 0 errors, 0 warnings, 0 section mismatches

--------------------------------------------------------------------------------
multi_v7_defconfig (arm, gcc-10) — PASS, 0 errors, 0 warnings, 0 section mismatches

--------------------------------------------------------------------------------
mvebu_v5_defconfig (arm, gcc-10) — PASS, 0 errors, 0 warnings, 0 section mismatches

--------------------------------------------------------------------------------
mvebu_v7_defconfig (arm, gcc-10) — PASS, 0 errors, 0 warnings, 0 section mismatches

--------------------------------------------------------------------------------
mxs_defconfig (arm, gcc-10) — PASS, 0 errors, 0 warnings, 0 section mismatches

--------------------------------------------------------------------------------
neponset_defconfig (arm, gcc-10) — PASS, 0 errors, 0 warnings, 0 section mismatches

Section mismatches:
WARNING: modpost: vmlinux.o(.text+0xcda4): Section mismatch in reference from the function __arm_ioremap_pfn_caller() to the function .meminit.text:memblock_is_map_memory()

--------------------------------------------------------------------------------
netwinder_defconfig (arm, gcc-10) — PASS, 0 errors, 0 warnings, 0 section mismatches

--------------------------------------------------------------------------------
nhk8815_defconfig (arm, gcc-10) — PASS, 0 errors, 0 warnings, 0 section mismatches

--------------------------------------------------------------------------------
nlm_xlp_defconfig (mips, gcc-10) — PASS, 0 errors, 0 warnings, 0 section mismatches

--------------------------------------------------------------------------------
nlm_xlr_defconfig (mips, gcc-10) — PASS, 0 errors, 0 warnings, 0 section mismatches

--------------------------------------------------------------------------------
nommu_k210_defconfig (riscv, gcc-10) — PASS, 0 errors, 0 warnings, 0 section mismatches

--------------------------------------------------------------------------------
nsimosci_hs_smp_defconfig (arc, gcc-10) — PASS, 0 errors, 0 warnings, 0 section mismatches

--------------------------------------------------------------------------------
omap1_defconfig (arm, gcc-10) — PASS, 0 errors, 0 warnings, 0 section mismatches

--------------------------------------------------------------------------------
omega2p_defconfig (mips, gcc-10) — PASS, 0 errors, 0 warnings, 0 section mismatches

--------------------------------------------------------------------------------
orion5x_defconfig (arm, gcc-10) — PASS, 0 errors, 0 warnings, 0 section mismatches

--------------------------------------------------------------------------------
oxnas_v6_defconfig (arm, gcc-10) — PASS, 0 errors, 0 warnings, 0 section mismatches

--------------------------------------------------------------------------------
palmz72_defconfig (arm, gcc-10) — PASS, 0 errors, 0 warnings, 0 section mismatches

--------------------------------------------------------------------------------
pic32mzda_defconfig (mips, gcc-10) — PASS, 0 errors, 0 warnings, 0 section mismatches

--------------------------------------------------------------------------------
pleb_defconfig (arm, gcc-10) — PASS, 0 errors, 0 warnings, 0 section mismatches

Section mismatches:
WARNING: modpost: vmlinux.o(.text+0xc8ec): Section mismatch in reference from the function __arm_ioremap_pfn_caller() to the function .meminit.text:memblock_is_map_memory()

--------------------------------------------------------------------------------
prima2_defconfig (arm, gcc-10) — PASS, 0 errors, 0 warnings, 0 section mismatches

--------------------------------------------------------------------------------
pxa255-idp_defconfig (arm, gcc-10) — PASS, 0 errors, 0 warnings, 0 section mismatches

--------------------------------------------------------------------------------
pxa3xx_defconfig (arm, gcc-10) — PASS, 0 errors, 0 warnings, 0 section mismatches

--------------------------------------------------------------------------------
pxa_defconfig (arm, gcc-10) — PASS, 0 errors, 0 warnings, 0 section mismatches

--------------------------------------------------------------------------------
qcom_defconfig (arm, gcc-10) — PASS, 0 errors, 0 warnings, 0 section mismatches

--------------------------------------------------------------------------------
qi_lb60_defconfig (mips, gcc-10) — PASS, 0 errors, 0 warnings, 0 section mismatches

--------------------------------------------------------------------------------
rb532_defconfig (mips, gcc-10) — PASS, 0 errors, 0 warnings, 0 section mismatches

--------------------------------------------------------------------------------
rbtx49xx_defconfig (mips, gcc-10) — PASS, 0 errors, 0 warnings, 0 section mismatches

--------------------------------------------------------------------------------
realview_defconfig (arm, gcc-10) — PASS, 0 errors, 0 warnings, 0 section mismatches

--------------------------------------------------------------------------------
rpc_defconfig (arm, gcc-10) — FAIL, 4 errors, 0 warnings, 0 section mismatches

Errors:
arm-linux-gnueabihf-gcc: error: unrecognized -march target: armv3m
arm-linux-gnueabihf-gcc: error: missing argument to ‘-march=’
arm-linux-gnueabihf-gcc: error: unrecognized -march target: armv3m
arm-linux-gnueabihf-gcc: error: missing argument to ‘-march=’

--------------------------------------------------------------------------------
rt305x_defconfig (mips, gcc-10) — PASS, 0 errors, 0 warnings, 0 section mismatches

--------------------------------------------------------------------------------
rv32_defconfig (riscv, gcc-10) — PASS, 0 errors, 4 warnings, 0 section mismatches

Warnings:
<stdin>:830:2: warning: #warning syscall fstat64 not implemented [-Wcpp]
<stdin>:1127:2: warning: #warning syscall fstatat64 not implemented [-Wcpp]
<stdin>:830:2: warning: #warning syscall fstat64 not implemented [-Wcpp]
<stdin>:1127:2: warning: #warning syscall fstatat64 not implemented [-Wcpp]

--------------------------------------------------------------------------------
s3c2410_defconfig (arm, gcc-10) — PASS, 0 errors, 0 warnings, 0 section mismatches

--------------------------------------------------------------------------------
s3c6400_defconfig (arm, gcc-10) — PASS, 0 errors, 0 warnings, 0 section mismatches

--------------------------------------------------------------------------------
s5pv210_defconfig (arm, gcc-10) — PASS, 0 errors, 0 warnings, 0 section mismatches

--------------------------------------------------------------------------------
sama5_defconfig (arm, gcc-10) — PASS, 0 errors, 0 warnings, 0 section mismatches

--------------------------------------------------------------------------------
shannon_defconfig (arm, gcc-10) — PASS, 0 errors, 0 warnings, 0 section mismatches

Section mismatches:
WARNING: modpost: vmlinux.o(.text+0xcb4c): Section mismatch in reference from the function __arm_ioremap_pfn_caller() to the function .meminit.text:memblock_is_map_memory()

--------------------------------------------------------------------------------
shmobile_defconfig (arm, gcc-10) — PASS, 0 errors, 0 warnings, 0 section mismatches

--------------------------------------------------------------------------------
simpad_defconfig (arm, gcc-10) — PASS, 0 errors, 0 warnings, 0 section mismatches

Section mismatches:
WARNING: modpost: vmlinux.o(.text+0xd040): Section mismatch in reference from the function __arm_ioremap_pfn_caller() to the function .meminit.text:memblock_is_map_memory()

--------------------------------------------------------------------------------
socfpga_defconfig (arm, gcc-10) — PASS, 0 errors, 0 warnings, 0 section mismatches

--------------------------------------------------------------------------------
spear3xx_defconfig (arm, gcc-10) — PASS, 0 errors, 0 warnings, 0 section mismatches

--------------------------------------------------------------------------------
spear6xx_defconfig (arm, gcc-10) — PASS, 0 errors, 0 warnings, 0 section mismatches

--------------------------------------------------------------------------------
spitz_defconfig (arm, gcc-10) — PASS, 0 errors, 0 warnings, 0 section mismatches

--------------------------------------------------------------------------------
stm32_defconfig (arm, gcc-10) — PASS, 0 errors, 0 warnings, 0 section mismatches

--------------------------------------------------------------------------------
sunxi_defconfig (arm, gcc-10) — PASS, 0 errors, 0 warnings, 0 section mismatches

--------------------------------------------------------------------------------
tango4_defconfig (arm, gcc-10) — PASS, 0 errors, 0 warnings, 0 section mismatches

--------------------------------------------------------------------------------
tb0219_defconfig (mips, gcc-10) — PASS, 0 errors, 0 warnings, 0 section mismatches

--------------------------------------------------------------------------------
tb0226_defconfig (mips, gcc-10) — PASS, 0 errors, 0 warnings, 0 section mismatches

--------------------------------------------------------------------------------
tb0287_defconfig (mips, gcc-10) — PASS, 0 errors, 0 warnings, 0 section mismatches

--------------------------------------------------------------------------------
tct_hammer_defconfig (arm, gcc-10) — PASS, 0 errors, 0 warnings, 0 section mismatches

--------------------------------------------------------------------------------
tinyconfig (i386, gcc-10) — PASS, 0 errors, 0 warnings, 0 section mismatches

--------------------------------------------------------------------------------
tinyconfig (arc, gcc-10) — PASS, 0 errors, 0 warnings, 0 section mismatches

--------------------------------------------------------------------------------
tinyconfig (x86_64, gcc-10) — PASS, 0 errors, 0 warnings, 0 section mismatches

--------------------------------------------------------------------------------
trizeps4_defconfig (arm, gcc-10) — PASS, 0 errors, 0 warnings, 0 section mismatches

--------------------------------------------------------------------------------
vdk_hs38_defconfig (arc, gcc-10) — PASS, 0 errors, 0 warnings, 0 section mismatches

--------------------------------------------------------------------------------
vdk_hs38_smp_defconfig (arc, gcc-10) — PASS, 0 errors, 0 warnings, 0 section mismatches

--------------------------------------------------------------------------------
versatile_defconfig (arm, gcc-10) — PASS, 0 errors, 0 warnings, 0 section mismatches

--------------------------------------------------------------------------------
vexpress_defconfig (arm, gcc-10) — PASS, 0 errors, 0 warnings, 0 section mismatches

--------------------------------------------------------------------------------
vf610m4_defconfig (arm, gcc-10) — PASS, 0 errors, 0 warnings, 0 section mismatches

--------------------------------------------------------------------------------
viper_defconfig (arm, gcc-10) — PASS, 0 errors, 0 warnings, 0 section mismatches

--------------------------------------------------------------------------------
vocore2_defconfig (mips, gcc-10) — PASS, 0 errors, 0 warnings, 0 section mismatches

--------------------------------------------------------------------------------
workpad_defconfig (mips, gcc-10) — PASS, 0 errors, 0 warnings, 0 section mismatches

--------------------------------------------------------------------------------
x86_64_defconfig (x86_64, gcc-10) — PASS, 0 errors, 0 warnings, 0 section mismatches

--------------------------------------------------------------------------------
x86_64_defconfig+x86-chromebook (x86_64, gcc-10) — PASS, 0 errors, 0 warnings, 0 section mismatches

--------------------------------------------------------------------------------
xcep_defconfig (arm, gcc-10) — PASS, 0 errors, 0 warnings, 0 section mismatches

--------------------------------------------------------------------------------
zeus_defconfig (arm, gcc-10) — PASS, 0 errors, 0 warnings, 0 section mismatches

--------------------------------------------------------------------------------
zx_defconfig (arm, gcc-10) — PASS, 0 errors, 0 warnings, 0 section mismatches

---
For more info write to <info@...>


Re: [PATCH] Update to kas 3.0

Jan Kiszka
 

On 07.03.22 11:09, Srinuvasan Arjunan wrote:


On Mon, Mar 7, 2022 at 3:11 PM Jan Kiszka <jan.kiszka@...
<mailto:jan.kiszka@...>> wrote:

On 07.03.22 10:34, Srinuvasan A wrote:
> From: Srinuvasan A <srinuvasan_a@...
<mailto:srinuvasan_a@...>>
>
> Update to kas 3.0.
>
> Signed-off-by: Srinuvasan A <srinuvasan_a@...
<mailto:srinuvasan_a@...>>
> ---
>  .gitlab-ci.yml | 2 +-
>  README.md      | 2 +-
>  2 files changed, 2 insertions(+), 2 deletions(-)
>
> diff --git a/.gitlab-ci.yml b/.gitlab-ci.yml
> index c06c783..f573da6 100644
> --- a/.gitlab-ci.yml
> +++ b/.gitlab-ci.yml
> @@ -1,4 +1,4 @@
> -image: ghcr.io/siemens/kas/kas-isar:2.6.2
<http://ghcr.io/siemens/kas/kas-isar:2.6.2>
> +image: ghcr.io/siemens/kas/kas-isar:3.0
<http://ghcr.io/siemens/kas/kas-isar:3.0>

>  variables:
>    GIT_STRATEGY: clone
> diff --git a/README.md b/README.md
> index f7cb86e..fc4ddbf 100644
> --- a/README.md
> +++ b/README.md
> @@ -12,7 +12,7 @@ from scratch.

>  Install `kas-container` from the [kas
project](https://github.com/siemens/kas
<https://github.com/siemens/kas>):

> -    wget
https://raw.githubusercontent.com/siemens/kas/2.6.2/kas-container
<https://raw.githubusercontent.com/siemens/kas/2.6.2/kas-container>
> +    wget
https://raw.githubusercontent.com/siemens/kas/3.0/kas-container
<https://raw.githubusercontent.com/siemens/kas/3.0/kas-container>
>      chmod a+x kas-container

>  Furthermore, install docker and make sure you have required
permissions to

Please test before you submit: We have an open issue with kas-isar:3.0.


  I did a build and verified the pipeline in KAS github, It seems okay,
but when i trigger the build i was able to see some logs related to sbuild
Adding user `builder' to group `sbuild' ...
Adding user builder to group sbuild
Done.

# Setup tasks for sudo users:

# BUILD
# HOME directory in chroot, user:sbuild, 0770 perms, from
# passwd/group copying to chroot, filtered
# Maybe source 50sbuild, or move into common location.

Next, copy the example sbuildrc file to the home directory of each user and
set the variables for your system:

  cp /usr/share/doc/sbuild/examples/example.sbuildrc /builder/.sbuildrc

Now try a build:

  cd /path/to/source
  sbuild-update -ud <distribution>
  (or "sbuild-apt <distribution> apt-get -f install"
       first if the chroot is broken)
  sbuild -d <distribution> <package>_<version>
 
 Might be i missed the open issue things
That warning is just a cosmetic issue, but I plan to fix it with 3.0.1
this week. The actual issue was (now fixed in next) that swupdate images
did not build. CI would have revealed it as well, but I happened to
notice this already on Friday during EFI Boot Guard experiments.

Jan

--
Siemens AG, Technology
Competence Center Embedded Linux


Re: [isar-cip-core][PATCH] classes: Use extracted partitions provided by wic

Jan Kiszka
 

On 07.03.22 12:50, Q. Gylstorff wrote:
From: Quirin Gylstorff <quirin.gylstorff@...>

Newer versions of the wic provide separated disk partitions
therefore, the extraction code is no longer necessary.

Rename the class from extract-partition to
compress-swupdate-rootfs to clarify the use case.
This also resolves the build breakage we see with bullseye-based
kas-iser:3.0 which no longer carried fdisk (which it did by chance so far).

Signed-off-by: Quirin Gylstorff <quirin.gylstorff@...>
---
classes/compress_swupdate_rootfs.bbclass | 21 +++++++++++++++++++
classes/extract-partition.bbclass | 26 ------------------------
classes/secure-swupdate-img.bbclass | 6 +++---
classes/wic-swu-img.bbclass | 6 +++---
recipes-core/images/secureboot.inc | 4 ++--
recipes-core/images/swupdate.inc | 4 ++--
6 files changed, 31 insertions(+), 36 deletions(-)
create mode 100644 classes/compress_swupdate_rootfs.bbclass
delete mode 100644 classes/extract-partition.bbclass

diff --git a/classes/compress_swupdate_rootfs.bbclass b/classes/compress_swupdate_rootfs.bbclass
new file mode 100644
index 0000000..2a01e59
--- /dev/null
+++ b/classes/compress_swupdate_rootfs.bbclass
@@ -0,0 +1,21 @@
+#
+# CIP Core, generic profile
+#
+# Copyright (c) Siemens AG, 2022
+#
+# Authors:
+# Quirin Gylstorff <quirin.gylstorff@...>
+#
+# SPDX-License-Identifier: MIT
+#
+
+EXTRACT_PARTITIONS ?= "${IMAGE_FULLNAME}.wic.img.p4"
+
+do_compress_swupdate_rootfs () {
+ for PARTITION in ${EXTRACT_PARTITIONS}; do
+ if [ -e ${DEPLOY_DIR_IMAGE}/${PARTITION} ]; then
+ rm -f ${DEPLOY_DIR_IMAGE}/${PARTITION}.gz
+ gzip ${DEPLOY_DIR_IMAGE}/${PARTITION}
Out of curiosity: gz is not a particularly recent method anymore. Does
SWUpdate support more? Or not in our configuration?

+ fi
+ done
+}
diff --git a/classes/extract-partition.bbclass b/classes/extract-partition.bbclass
deleted file mode 100644
index e9de8fc..0000000
--- a/classes/extract-partition.bbclass
+++ /dev/null
@@ -1,26 +0,0 @@
-#
-# CIP Core, generic profile
-#
-# Copyright (c) Siemens AG, 2020
-#
-# Authors:
-# Quirin Gylstorff <quirin.gylstorff@...>
-#
-# SPDX-License-Identifier: MIT
-#
-
-SOURCE_IMAGE_FILE ?= "${WIC_IMAGE_FILE}"
-EXTRACT_PARTITIONS ?= "img4"
-
-do_extract_partition () {
- for PARTITION in ${EXTRACT_PARTITIONS}; do
- rm -f ${DEPLOY_DIR_IMAGE}/${PARTITION}.gz
- PART_START=$(fdisk -lu ${SOURCE_IMAGE_FILE} | grep ${PARTITION} | awk '{ print $2 }' )
- PART_END=$(fdisk -lu ${SOURCE_IMAGE_FILE} | grep ${PARTITION} | awk '{ print $3 }' )
- PART_COUNT=$(expr ${PART_END} - ${PART_START} + 1 )
-
- dd if=${SOURCE_IMAGE_FILE} of=${DEPLOY_DIR_IMAGE}/${PARTITION} bs=512 skip=${PART_START} count=${PART_COUNT}
-
- gzip ${DEPLOY_DIR_IMAGE}/${PARTITION}
- done
-}
diff --git a/classes/secure-swupdate-img.bbclass b/classes/secure-swupdate-img.bbclass
index 431939b..1715c8a 100644
--- a/classes/secure-swupdate-img.bbclass
+++ b/classes/secure-swupdate-img.bbclass
@@ -21,12 +21,12 @@ INITRD_IMAGE = "${INITRAMFS_RECIPE}-${DISTRO}-${MACHINE}.initrd.img"

inherit verity-img
inherit wic-img
-inherit extract-partition
+inherit compress_swupdate_rootfs
inherit swupdate-img

SOURCE_IMAGE_FILE = "${WIC_IMAGE_FILE}"

addtask do_verity_image after do_${SECURE_IMAGE_FSTYPE}_image
addtask do_wic_image after do_verity_image
-addtask do_extract_partition after do_wic_image
-addtask do_swupdate_image after do_extract_partition
+addtask do_compress_swupdate_rootfs after do_wic_image
+addtask do_swupdate_image after do_compress_swupdate_rootfs
diff --git a/classes/wic-swu-img.bbclass b/classes/wic-swu-img.bbclass
index c8532ba..3a09721 100644
--- a/classes/wic-swu-img.bbclass
+++ b/classes/wic-swu-img.bbclass
@@ -11,10 +11,10 @@


inherit wic-img
-inherit extract-partition
+inherit compress_swupdate_rootfs
inherit swupdate-img

SOURCE_IMAGE_FILE = "${WIC_IMAGE_FILE}"

-addtask do_extract_partition after do_wic_image
-addtask do_swupdate_image after do_extract_partition
+addtask do_compress_swupdate_rootfs after do_wic_image
+addtask do_swupdate_image after do_compress_swupdate_rootfs
diff --git a/recipes-core/images/secureboot.inc b/recipes-core/images/secureboot.inc
index f048497..b619b50 100644
--- a/recipes-core/images/secureboot.inc
+++ b/recipes-core/images/secureboot.inc
@@ -11,8 +11,8 @@

FILESEXTRAPATHS_prepend := "${THISDIR}/files/secure-boot:"

-EXTRACT_PARTITIONS = "img4"
-ROOTFS_PARTITION_NAME="img4.gz"
+EXTRACT_PARTITIONS = "${IMAGE_FULLNAME}.wic.img.p4"
+ROOTFS_PARTITION_NAME="${IMAGE_FULLNAME}.wic.img.p4.gz"

SRC_URI += "file://sw-description.tmpl"
TEMPLATE_FILES += "sw-description.tmpl"
diff --git a/recipes-core/images/swupdate.inc b/recipes-core/images/swupdate.inc
index 06ad5af..2e9094a 100644
--- a/recipes-core/images/swupdate.inc
+++ b/recipes-core/images/swupdate.inc
@@ -11,8 +11,8 @@

FILESEXTRAPATHS_prepend := "${THISDIR}/files:"

-EXTRACT_PARTITIONS = "img4"
-ROOTFS_PARTITION_NAME="img4.gz"
+EXTRACT_PARTITIONS = "${IMAGE_FULLNAME}.wic.img.p4"
+ROOTFS_PARTITION_NAME="${IMAGE_FULLNAME}.wic.img.p4.gz"

SRC_URI += "file://sw-description.tmpl"
TEMPLATE_FILES += "sw-description.tmpl"
Thanks, applied to next.

Jan

--
Siemens AG, Technology
Competence Center Embedded Linux


[isar-cip-core][PATCH] classes: Use extracted partitions provided by wic

Quirin Gylstorff
 

From: Quirin Gylstorff <quirin.gylstorff@...>

Newer versions of the wic provide separated disk partitions
therefore, the extraction code is no longer necessary.

Rename the class from extract-partition to
compress-swupdate-rootfs to clarify the use case.

Signed-off-by: Quirin Gylstorff <quirin.gylstorff@...>
---
classes/compress_swupdate_rootfs.bbclass | 21 +++++++++++++++++++
classes/extract-partition.bbclass | 26 ------------------------
classes/secure-swupdate-img.bbclass | 6 +++---
classes/wic-swu-img.bbclass | 6 +++---
recipes-core/images/secureboot.inc | 4 ++--
recipes-core/images/swupdate.inc | 4 ++--
6 files changed, 31 insertions(+), 36 deletions(-)
create mode 100644 classes/compress_swupdate_rootfs.bbclass
delete mode 100644 classes/extract-partition.bbclass

diff --git a/classes/compress_swupdate_rootfs.bbclass b/classes/compress_swupdate_rootfs.bbclass
new file mode 100644
index 0000000..2a01e59
--- /dev/null
+++ b/classes/compress_swupdate_rootfs.bbclass
@@ -0,0 +1,21 @@
+#
+# CIP Core, generic profile
+#
+# Copyright (c) Siemens AG, 2022
+#
+# Authors:
+# Quirin Gylstorff <quirin.gylstorff@...>
+#
+# SPDX-License-Identifier: MIT
+#
+
+EXTRACT_PARTITIONS ?= "${IMAGE_FULLNAME}.wic.img.p4"
+
+do_compress_swupdate_rootfs () {
+ for PARTITION in ${EXTRACT_PARTITIONS}; do
+ if [ -e ${DEPLOY_DIR_IMAGE}/${PARTITION} ]; then
+ rm -f ${DEPLOY_DIR_IMAGE}/${PARTITION}.gz
+ gzip ${DEPLOY_DIR_IMAGE}/${PARTITION}
+ fi
+ done
+}
diff --git a/classes/extract-partition.bbclass b/classes/extract-partition.bbclass
deleted file mode 100644
index e9de8fc..0000000
--- a/classes/extract-partition.bbclass
+++ /dev/null
@@ -1,26 +0,0 @@
-#
-# CIP Core, generic profile
-#
-# Copyright (c) Siemens AG, 2020
-#
-# Authors:
-# Quirin Gylstorff <quirin.gylstorff@...>
-#
-# SPDX-License-Identifier: MIT
-#
-
-SOURCE_IMAGE_FILE ?= "${WIC_IMAGE_FILE}"
-EXTRACT_PARTITIONS ?= "img4"
-
-do_extract_partition () {
- for PARTITION in ${EXTRACT_PARTITIONS}; do
- rm -f ${DEPLOY_DIR_IMAGE}/${PARTITION}.gz
- PART_START=$(fdisk -lu ${SOURCE_IMAGE_FILE} | grep ${PARTITION} | awk '{ print $2 }' )
- PART_END=$(fdisk -lu ${SOURCE_IMAGE_FILE} | grep ${PARTITION} | awk '{ print $3 }' )
- PART_COUNT=$(expr ${PART_END} - ${PART_START} + 1 )
-
- dd if=${SOURCE_IMAGE_FILE} of=${DEPLOY_DIR_IMAGE}/${PARTITION} bs=512 skip=${PART_START} count=${PART_COUNT}
-
- gzip ${DEPLOY_DIR_IMAGE}/${PARTITION}
- done
-}
diff --git a/classes/secure-swupdate-img.bbclass b/classes/secure-swupdate-img.bbclass
index 431939b..1715c8a 100644
--- a/classes/secure-swupdate-img.bbclass
+++ b/classes/secure-swupdate-img.bbclass
@@ -21,12 +21,12 @@ INITRD_IMAGE = "${INITRAMFS_RECIPE}-${DISTRO}-${MACHINE}.initrd.img"

inherit verity-img
inherit wic-img
-inherit extract-partition
+inherit compress_swupdate_rootfs
inherit swupdate-img

SOURCE_IMAGE_FILE = "${WIC_IMAGE_FILE}"

addtask do_verity_image after do_${SECURE_IMAGE_FSTYPE}_image
addtask do_wic_image after do_verity_image
-addtask do_extract_partition after do_wic_image
-addtask do_swupdate_image after do_extract_partition
+addtask do_compress_swupdate_rootfs after do_wic_image
+addtask do_swupdate_image after do_compress_swupdate_rootfs
diff --git a/classes/wic-swu-img.bbclass b/classes/wic-swu-img.bbclass
index c8532ba..3a09721 100644
--- a/classes/wic-swu-img.bbclass
+++ b/classes/wic-swu-img.bbclass
@@ -11,10 +11,10 @@


inherit wic-img
-inherit extract-partition
+inherit compress_swupdate_rootfs
inherit swupdate-img

SOURCE_IMAGE_FILE = "${WIC_IMAGE_FILE}"

-addtask do_extract_partition after do_wic_image
-addtask do_swupdate_image after do_extract_partition
+addtask do_compress_swupdate_rootfs after do_wic_image
+addtask do_swupdate_image after do_compress_swupdate_rootfs
diff --git a/recipes-core/images/secureboot.inc b/recipes-core/images/secureboot.inc
index f048497..b619b50 100644
--- a/recipes-core/images/secureboot.inc
+++ b/recipes-core/images/secureboot.inc
@@ -11,8 +11,8 @@

FILESEXTRAPATHS_prepend := "${THISDIR}/files/secure-boot:"

-EXTRACT_PARTITIONS = "img4"
-ROOTFS_PARTITION_NAME="img4.gz"
+EXTRACT_PARTITIONS = "${IMAGE_FULLNAME}.wic.img.p4"
+ROOTFS_PARTITION_NAME="${IMAGE_FULLNAME}.wic.img.p4.gz"

SRC_URI += "file://sw-description.tmpl"
TEMPLATE_FILES += "sw-description.tmpl"
diff --git a/recipes-core/images/swupdate.inc b/recipes-core/images/swupdate.inc
index 06ad5af..2e9094a 100644
--- a/recipes-core/images/swupdate.inc
+++ b/recipes-core/images/swupdate.inc
@@ -11,8 +11,8 @@

FILESEXTRAPATHS_prepend := "${THISDIR}/files:"

-EXTRACT_PARTITIONS = "img4"
-ROOTFS_PARTITION_NAME="img4.gz"
+EXTRACT_PARTITIONS = "${IMAGE_FULLNAME}.wic.img.p4"
+ROOTFS_PARTITION_NAME="${IMAGE_FULLNAME}.wic.img.p4.gz"

SRC_URI += "file://sw-description.tmpl"
TEMPLATE_FILES += "sw-description.tmpl"
--
2.34.1


Re: [PATCH] Update to kas 3.0

Srinuvasan Arjunan
 



On Mon, Mar 7, 2022 at 3:11 PM Jan Kiszka <jan.kiszka@...> wrote:
On 07.03.22 10:34, Srinuvasan A wrote:
> From: Srinuvasan A <srinuvasan_a@...>
>
> Update to kas 3.0.
>
> Signed-off-by: Srinuvasan A <srinuvasan_a@...>
> ---
>  .gitlab-ci.yml | 2 +-
>  README.md      | 2 +-
>  2 files changed, 2 insertions(+), 2 deletions(-)
>
> diff --git a/.gitlab-ci.yml b/.gitlab-ci.yml
> index c06c783..f573da6 100644
> --- a/.gitlab-ci.yml
> +++ b/.gitlab-ci.yml
> @@ -1,4 +1,4 @@
> -image: ghcr.io/siemens/kas/kas-isar:2.6.2
> +image: ghcr.io/siemens/kas/kas-isar:3.0

>  variables:
>    GIT_STRATEGY: clone
> diff --git a/README.md b/README.md
> index f7cb86e..fc4ddbf 100644
> --- a/README.md
> +++ b/README.md
> @@ -12,7 +12,7 @@ from scratch.

>  Install `kas-container` from the [kas project](https://github.com/siemens/kas):

> -    wget https://raw.githubusercontent.com/siemens/kas/2.6.2/kas-container
> +    wget https://raw.githubusercontent.com/siemens/kas/3.0/kas-container
>      chmod a+x kas-container

>  Furthermore, install docker and make sure you have required permissions to

Please test before you submit: We have an open issue with kas-isar:3.0.

  I did a build and verified the pipeline in KAS github, It seems okay, but when i trigger the build i was able to see some logs related to sbuild
Adding user `builder' to group `sbuild' ...
Adding user builder to group sbuild
Done.

# Setup tasks for sudo users:

# BUILD
# HOME directory in chroot, user:sbuild, 0770 perms, from
# passwd/group copying to chroot, filtered
# Maybe source 50sbuild, or move into common location.

Next, copy the example sbuildrc file to the home directory of each user and
set the variables for your system:

  cp /usr/share/doc/sbuild/examples/example.sbuildrc /builder/.sbuildrc

Now try a build:

  cd /path/to/source
  sbuild-update -ud <distribution>
  (or "sbuild-apt <distribution> apt-get -f install"
       first if the chroot is broken)
  sbuild -d <distribution> <package>_<version>
 
 Might be i missed the open issue things

thanks,
Srinuvasan.A
 
Jan

--
Siemens AG, Technology
Competence Center Embedded Linux




Re: [PATCH] Update to kas 3.0

Jan Kiszka
 

On 07.03.22 10:34, Srinuvasan A wrote:
From: Srinuvasan A <srinuvasan_a@...>

Update to kas 3.0.

Signed-off-by: Srinuvasan A <srinuvasan_a@...>
---
.gitlab-ci.yml | 2 +-
README.md | 2 +-
2 files changed, 2 insertions(+), 2 deletions(-)

diff --git a/.gitlab-ci.yml b/.gitlab-ci.yml
index c06c783..f573da6 100644
--- a/.gitlab-ci.yml
+++ b/.gitlab-ci.yml
@@ -1,4 +1,4 @@
-image: ghcr.io/siemens/kas/kas-isar:2.6.2
+image: ghcr.io/siemens/kas/kas-isar:3.0

variables:
GIT_STRATEGY: clone
diff --git a/README.md b/README.md
index f7cb86e..fc4ddbf 100644
--- a/README.md
+++ b/README.md
@@ -12,7 +12,7 @@ from scratch.

Install `kas-container` from the [kas project](https://github.com/siemens/kas):

- wget https://raw.githubusercontent.com/siemens/kas/2.6.2/kas-container
+ wget https://raw.githubusercontent.com/siemens/kas/3.0/kas-container
chmod a+x kas-container

Furthermore, install docker and make sure you have required permissions to
Please test before you submit: We have an open issue with kas-isar:3.0.

Jan

--
Siemens AG, Technology
Competence Center Embedded Linux


[PATCH] Update to kas 3.0

Srinuvasan A
 

From: Srinuvasan A <srinuvasan_a@...>

Update to kas 3.0.

Signed-off-by: Srinuvasan A <srinuvasan_a@...>
---
.gitlab-ci.yml | 2 +-
README.md | 2 +-
2 files changed, 2 insertions(+), 2 deletions(-)

diff --git a/.gitlab-ci.yml b/.gitlab-ci.yml
index c06c783..f573da6 100644
--- a/.gitlab-ci.yml
+++ b/.gitlab-ci.yml
@@ -1,4 +1,4 @@
-image: ghcr.io/siemens/kas/kas-isar:2.6.2
+image: ghcr.io/siemens/kas/kas-isar:3.0

variables:
GIT_STRATEGY: clone
diff --git a/README.md b/README.md
index f7cb86e..fc4ddbf 100644
--- a/README.md
+++ b/README.md
@@ -12,7 +12,7 @@ from scratch.

Install `kas-container` from the [kas project](https://github.com/siemens/kas):

- wget https://raw.githubusercontent.com/siemens/kas/2.6.2/kas-container
+ wget https://raw.githubusercontent.com/siemens/kas/3.0/kas-container
chmod a+x kas-container

Furthermore, install docker and make sure you have required permissions to
--
2.25.1


[isar-cip-core][PATCH] start-qemu.sh: Cleanup of common args

Jan Kiszka
 

From: Jan Kiszka <jan.kiszka@...>

Move QEMU_EXTRA_ARGS into QEMU_COMMON_OPTIONS to unify the invocations.

Signed-off-by: Jan Kiszka <jan.kiszka@...>
---
start-qemu.sh | 17 ++++++++++-------
1 file changed, 10 insertions(+), 7 deletions(-)

diff --git a/start-qemu.sh b/start-qemu.sh
index 4105d4e..b623602 100755
--- a/start-qemu.sh
+++ b/start-qemu.sh
@@ -117,24 +117,26 @@ shift 1
QEMU_COMMON_OPTIONS=" \
-m 1G \
-serial mon:stdio \
- -netdev user,id=net"
+ -netdev user,id=net \
+ ${QEMU_EXTRA_ARGS}"

if [ -n "${SECURE_BOOT}" ]; then
ovmf_code=${OVMF_CODE:-./build/tmp/deploy/images/qemu-amd64/OVMF/OVMF_CODE_4M.secboot.fd}
ovmf_vars=${OVMF_VARS:-./build/tmp/deploy/images/qemu-amd64/OVMF/OVMF_VARS_4M.snakeoil.fd}
- QEMU_EXTRA_ARGS=" ${QEMU_EXTRA_ARGS} \
- -global ICH9-LPC.disable_s3=1 \
- -global isa-fdc.driveA= "

${QEMU_PATH}${QEMU} \
+ -global ICH9-LPC.disable_s3=1 \
+ -global isa-fdc.driveA= \
-drive if=pflash,format=raw,unit=0,readonly=on,file=${ovmf_code} \
-drive if=pflash,format=raw,file=${ovmf_vars} \
- -drive file=${IMAGE_PREFIX}.wic.img,discard=unmap,if=none,id=disk,format=raw ${QEMU_COMMON_OPTIONS} ${QEMU_EXTRA_ARGS} "$@"
+ -drive file=${IMAGE_PREFIX}.wic.img,discard=unmap,if=none,id=disk,format=raw \
+ ${QEMU_COMMON_OPTIONS} "$@"

elif [ -n "${SWUPDATE_BOOT}" ]; then
${QEMU_PATH}${QEMU} \
-drive file=${IMAGE_PREFIX}.wic.img,discard=unmap,if=none,id=disk,format=raw \
- -bios OVMF.fd ${QEMU_COMMON_OPTIONS} ${QEMU_EXTRA_ARGS} "$@"
+ -bios OVMF.fd \
+ ${QEMU_COMMON_OPTIONS} "$@"

else
IMAGE_FILE=$(ls ${IMAGE_PREFIX}.ext4.img)
@@ -145,5 +147,6 @@ else
${QEMU_PATH}${QEMU} \
-drive file=${IMAGE_FILE},discard=unmap,if=none,id=disk,format=raw \
-kernel ${KERNEL_FILE} -append "${KERNEL_CMDLINE}" \
- -initrd ${INITRD_FILE} ${QEMU_COMMON_OPTIONS} ${QEMU_EXTRA_ARGS} "$@"
+ -initrd ${INITRD_FILE} \
+ ${QEMU_COMMON_OPTIONS} "$@"
fi
--
2.34.1


Re: [PATCH v2] start-qemu.sh: Remove BOOT_FILES variable and call qemu directly in secure,swupdate and normal path

Jan Kiszka
 

On 04.03.22 09:03, Srinuvasan A wrote:
From: Srinuvasan A <srinuvasan_a@...>

Broke the normal boot part.
Fixed them.

-append takes arguments inside double quotes(""). If we escape
and pass the " along with the value the final command would form
like what we would expect.

qemu-system-x86_64 .... -append " root=/dev/sda console=ttyS0"

But when the shell parses it, due to how whitespace splitting works
for arguments passed via a variable, it parses the first quote(")
as argument 1 and root=dev/sda as argument 2 and messing up the
command.
It should ideally treat the whole " root=/dev/sda console=ttyS0" as
a single argument.

Hence Maintaining argument splitting is complex. A simpler one for here is to
avoid BOOT_FILES and unrole the actual qemu call with its different
kernels into the secure, swupdate and normal path.

Signed-off-by: Srinuvasan A <srinuvasan_a@...>
---
start-qemu.sh | 25 ++++++++++++++++---------
1 file changed, 16 insertions(+), 9 deletions(-)

diff --git a/start-qemu.sh b/start-qemu.sh
index a7e0588..4105d4e 100755
--- a/start-qemu.sh
+++ b/start-qemu.sh
@@ -114,6 +114,11 @@ fi

shift 1

+QEMU_COMMON_OPTIONS=" \
+ -m 1G \
+ -serial mon:stdio \
+ -netdev user,id=net"
+
if [ -n "${SECURE_BOOT}" ]; then
ovmf_code=${OVMF_CODE:-./build/tmp/deploy/images/qemu-amd64/OVMF/OVMF_CODE_4M.secboot.fd}
ovmf_vars=${OVMF_VARS:-./build/tmp/deploy/images/qemu-amd64/OVMF/OVMF_VARS_4M.snakeoil.fd}
@@ -121,22 +126,24 @@ if [ -n "${SECURE_BOOT}" ]; then
-global ICH9-LPC.disable_s3=1 \
-global isa-fdc.driveA= "

- BOOT_FILES="-drive if=pflash,format=raw,unit=0,readonly=on,file=${ovmf_code} \
+ ${QEMU_PATH}${QEMU} \
+ -drive if=pflash,format=raw,unit=0,readonly=on,file=${ovmf_code} \
-drive if=pflash,format=raw,file=${ovmf_vars} \
- -drive file=${IMAGE_PREFIX}.wic.img,discard=unmap,if=none,id=disk,format=raw"
+ -drive file=${IMAGE_PREFIX}.wic.img,discard=unmap,if=none,id=disk,format=raw ${QEMU_COMMON_OPTIONS} ${QEMU_EXTRA_ARGS} "$@"
+
elif [ -n "${SWUPDATE_BOOT}" ]; then
- BOOT_FILES="-drive file=${IMAGE_PREFIX}.wic.img,discard=unmap,if=none,id=disk,format=raw \
- -bios OVMF.fd "
+ ${QEMU_PATH}${QEMU} \
+ -drive file=${IMAGE_PREFIX}.wic.img,discard=unmap,if=none,id=disk,format=raw \
+ -bios OVMF.fd ${QEMU_COMMON_OPTIONS} ${QEMU_EXTRA_ARGS} "$@"
+
else
IMAGE_FILE=$(ls ${IMAGE_PREFIX}.ext4.img)

KERNEL_FILE=$(ls ${IMAGE_PREFIX}-vmlinu* | tail -1)
INITRD_FILE=$(ls ${IMAGE_PREFIX}-initrd.img* | tail -1)

- BOOT_FILES="-drive file=${IMAGE_FILE},discard=unmap,if=none,id=disk,format=raw \
+ ${QEMU_PATH}${QEMU} \
+ -drive file=${IMAGE_FILE},discard=unmap,if=none,id=disk,format=raw \
-kernel ${KERNEL_FILE} -append "${KERNEL_CMDLINE}" \
- -initrd ${INITRD_FILE}"
+ -initrd ${INITRD_FILE} ${QEMU_COMMON_OPTIONS} ${QEMU_EXTRA_ARGS} "$@"
fi
-${QEMU_PATH}${QEMU} \
- -m 1G -serial mon:stdio -netdev user,id=net \
- ${BOOT_FILES} ${QEMU_EXTRA_ARGS} "$@"
Thanks, applied. Further cleanup on top will follow.

Jan

--
Siemens AG, Technology
Competence Center Embedded Linux


[PATCH v2] start-qemu.sh: Remove BOOT_FILES variable and call qemu directly in secure,swupdate and normal path

Srinuvasan A
 

From: Srinuvasan A <srinuvasan_a@...>

Broke the normal boot part.
Fixed them.

-append takes arguments inside double quotes(""). If we escape
and pass the " along with the value the final command would form
like what we would expect.

qemu-system-x86_64 .... -append " root=/dev/sda console=ttyS0"

But when the shell parses it, due to how whitespace splitting works
for arguments passed via a variable, it parses the first quote(")
as argument 1 and root=dev/sda as argument 2 and messing up the
command.
It should ideally treat the whole " root=/dev/sda console=ttyS0" as
a single argument.

Hence Maintaining argument splitting is complex. A simpler one for here is to
avoid BOOT_FILES and unrole the actual qemu call with its different
kernels into the secure, swupdate and normal path.

Signed-off-by: Srinuvasan A <srinuvasan_a@...>
---
start-qemu.sh | 25 ++++++++++++++++---------
1 file changed, 16 insertions(+), 9 deletions(-)

diff --git a/start-qemu.sh b/start-qemu.sh
index a7e0588..4105d4e 100755
--- a/start-qemu.sh
+++ b/start-qemu.sh
@@ -114,6 +114,11 @@ fi

shift 1

+QEMU_COMMON_OPTIONS=" \
+ -m 1G \
+ -serial mon:stdio \
+ -netdev user,id=net"
+
if [ -n "${SECURE_BOOT}" ]; then
ovmf_code=${OVMF_CODE:-./build/tmp/deploy/images/qemu-amd64/OVMF/OVMF_CODE_4M.secboot.fd}
ovmf_vars=${OVMF_VARS:-./build/tmp/deploy/images/qemu-amd64/OVMF/OVMF_VARS_4M.snakeoil.fd}
@@ -121,22 +126,24 @@ if [ -n "${SECURE_BOOT}" ]; then
-global ICH9-LPC.disable_s3=1 \
-global isa-fdc.driveA= "

- BOOT_FILES="-drive if=pflash,format=raw,unit=0,readonly=on,file=${ovmf_code} \
+ ${QEMU_PATH}${QEMU} \
+ -drive if=pflash,format=raw,unit=0,readonly=on,file=${ovmf_code} \
-drive if=pflash,format=raw,file=${ovmf_vars} \
- -drive file=${IMAGE_PREFIX}.wic.img,discard=unmap,if=none,id=disk,format=raw"
+ -drive file=${IMAGE_PREFIX}.wic.img,discard=unmap,if=none,id=disk,format=raw ${QEMU_COMMON_OPTIONS} ${QEMU_EXTRA_ARGS} "$@"
+
elif [ -n "${SWUPDATE_BOOT}" ]; then
- BOOT_FILES="-drive file=${IMAGE_PREFIX}.wic.img,discard=unmap,if=none,id=disk,format=raw \
- -bios OVMF.fd "
+ ${QEMU_PATH}${QEMU} \
+ -drive file=${IMAGE_PREFIX}.wic.img,discard=unmap,if=none,id=disk,format=raw \
+ -bios OVMF.fd ${QEMU_COMMON_OPTIONS} ${QEMU_EXTRA_ARGS} "$@"
+
else
IMAGE_FILE=$(ls ${IMAGE_PREFIX}.ext4.img)

KERNEL_FILE=$(ls ${IMAGE_PREFIX}-vmlinu* | tail -1)
INITRD_FILE=$(ls ${IMAGE_PREFIX}-initrd.img* | tail -1)

- BOOT_FILES="-drive file=${IMAGE_FILE},discard=unmap,if=none,id=disk,format=raw \
+ ${QEMU_PATH}${QEMU} \
+ -drive file=${IMAGE_FILE},discard=unmap,if=none,id=disk,format=raw \
-kernel ${KERNEL_FILE} -append "${KERNEL_CMDLINE}" \
- -initrd ${INITRD_FILE}"
+ -initrd ${INITRD_FILE} ${QEMU_COMMON_OPTIONS} ${QEMU_EXTRA_ARGS} "$@"
fi
-${QEMU_PATH}${QEMU} \
- -m 1G -serial mon:stdio -netdev user,id=net \
- ${BOOT_FILES} ${QEMU_EXTRA_ARGS} "$@"
--
2.25.1


cip-gitlab/ci/iwamatsu/linux-5.10.y-cip-rc ltp-timers: 9 runs, 2 regressions (v5.10.100-cip2-319-gcbff87047566) #kernelci

kernelci.org bot <bot@...>
 

cip-gitlab/ci/iwamatsu/linux-5.10.y-cip-rc ltp-timers: 9 runs, 2 regressions (v5.10.100-cip2-319-gcbff87047566)

Regressions Summary
-------------------

platform | arch | lab | compiler | defconfig | regressions
-------------------------+-------+---------+----------+-----------+------------
r8a774a1-hihope-rzg2m-ex | arm64 | lab-cip | gcc-10 | defconfig | 2

Details: https://kernelci.org/test/job/cip-gitlab/branch/ci%2Fiwamatsu%2Flinux-5.10.y-cip-rc/kernel/v5.10.100-cip2-319-gcbff87047566/plan/ltp-timers/

Test: ltp-timers
Tree: cip-gitlab
Branch: ci/iwamatsu/linux-5.10.y-cip-rc
Describe: v5.10.100-cip2-319-gcbff87047566
URL: https://gitlab.com/cip-project/cip-kernel/linux-cip.git
SHA: cbff870475669d78815941c2e765cc5a8b6078f0

Test suite revisions:
ltp-tests
URL: https://github.com/linux-test-project/ltp.git
SHA: faffae0b7edd5385c0c5ba08ff03e158aa9c1a1c


Test Regressions
----------------


platform | arch | lab | compiler | defconfig | regressions
-------------------------+-------+---------+----------+-----------+------------
r8a774a1-hihope-rzg2m-ex | arm64 | lab-cip | gcc-10 | defconfig | 2

Details: https://kernelci.org/test/plan/id/62214ec66580a8433ac6298d

Results: 32 PASS, 4 FAIL, 0 SKIP
Full config: defconfig
Compiler: gcc-10 (aarch64-linux-gnu-gcc (Debian 10.2.1-6) 10.2.1 20210110)
Plain log: https://storage.kernelci.org//cip-gitlab/ci-iwamatsu-linux-5.10.y-cip-rc/v5.10.100-cip2-319-gcbff87047566/arm64/defconfig/gcc-10/lab-cip/ltp-timers-r8a774a1-hihope-rzg2m-ex.txt
HTML log: https://storage.kernelci.org//cip-gitlab/ci-iwamatsu-linux-5.10.y-cip-rc/v5.10.100-cip2-319-gcbff87047566/arm64/defconfig/gcc-10/lab-cip/ltp-timers-r8a774a1-hihope-rzg2m-ex.html
Rootfs: http://storage.kernelci.org/images/rootfs/debian/bullseye-ltp/20220218.1/arm64/initrd.cpio.gz


* ltp-timers.clock_settime: https://kernelci.org/test/case/id/62214ec66580a8433ac62998
new failure (last pass: v5.10.100-cip2-239-g01aa183a119a)

* ltp-timers.clock_settime: https://kernelci.org/test/case/id/62214ec66580a8433ac62998
new failure (last pass: v5.10.100-cip2-239-g01aa183a119a)


cip-gitlab/ci/iwamatsu/linux-5.10.y-cip-rc kselftest-seccomp: 6 runs, 3 regressions (v5.10.100-cip2-319-gcbff87047566) #kernelci

kernelci.org bot <bot@...>
 

cip-gitlab/ci/iwamatsu/linux-5.10.y-cip-rc kselftest-seccomp: 6 runs, 3 regressions (v5.10.100-cip2-319-gcbff87047566)

Regressions Summary
-------------------

platform | arch | lab | compiler | defconfig | regressions
--------------------------+--------+---------------+----------+------------------------------+------------
asus-C433TA-AJ0005-rammus | x86_64 | lab-collabora | gcc-10 | x86_64_defcon...ok+kselftest | 1
asus-C523NA-A20057-coral | x86_64 | lab-collabora | gcc-10 | x86_64_defcon...ok+kselftest | 1
hp-11A-G6-EE-grunt | x86_64 | lab-collabora | gcc-10 | x86_64_defcon...ok+kselftest | 1

Details: https://kernelci.org/test/job/cip-gitlab/branch/ci%2Fiwamatsu%2Flinux-5.10.y-cip-rc/kernel/v5.10.100-cip2-319-gcbff87047566/plan/kselftest-seccomp/

Test: kselftest-seccomp
Tree: cip-gitlab
Branch: ci/iwamatsu/linux-5.10.y-cip-rc
Describe: v5.10.100-cip2-319-gcbff87047566
URL: https://gitlab.com/cip-project/cip-kernel/linux-cip.git
SHA: cbff870475669d78815941c2e765cc5a8b6078f0


Test Regressions
----------------


platform | arch | lab | compiler | defconfig | regressions
--------------------------+--------+---------------+----------+------------------------------+------------
asus-C433TA-AJ0005-rammus | x86_64 | lab-collabora | gcc-10 | x86_64_defcon...ok+kselftest | 1

Details: https://kernelci.org/test/plan/id/62215004cc7490426cc62a55

Results: 83 PASS, 4 FAIL, 7 SKIP
Full config: x86_64_defconfig+x86-chromebook+kselftest
Compiler: gcc-10 (gcc (Debian 10.2.1-6) 10.2.1 20210110)
Plain log: https://storage.kernelci.org//cip-gitlab/ci-iwamatsu-linux-5.10.y-cip-rc/v5.10.100-cip2-319-gcbff87047566/x86_64/x86_64_defconfig+x86-chromebook+kselftest/gcc-10/lab-collabora/kselftest-seccomp-asus-C433TA-AJ0005-rammus.txt
HTML log: https://storage.kernelci.org//cip-gitlab/ci-iwamatsu-linux-5.10.y-cip-rc/v5.10.100-cip2-319-gcbff87047566/x86_64/x86_64_defconfig+x86-chromebook+kselftest/gcc-10/lab-collabora/kselftest-seccomp-asus-C433TA-AJ0005-rammus.html
Rootfs: http://storage.kernelci.org/images/rootfs/debian/bullseye-kselftest/20220218.1/amd64/initrd.cpio.gz


* kselftest-seccomp.seccomp_seccomp_bpf_TSYNC_siblings_fail_prctl: https://kernelci.org/test/case/id/62215004cc7490426cc62a5c
new failure (last pass: v5.10.83-cip1-1540-g9fb82e7fedf9)



platform | arch | lab | compiler | defconfig | regressions
--------------------------+--------+---------------+----------+------------------------------+------------
asus-C523NA-A20057-coral | x86_64 | lab-collabora | gcc-10 | x86_64_defcon...ok+kselftest | 1

Details: https://kernelci.org/test/plan/id/622151c36bc3faaef1c6297a

Results: 83 PASS, 4 FAIL, 7 SKIP
Full config: x86_64_defconfig+x86-chromebook+kselftest
Compiler: gcc-10 (gcc (Debian 10.2.1-6) 10.2.1 20210110)
Plain log: https://storage.kernelci.org//cip-gitlab/ci-iwamatsu-linux-5.10.y-cip-rc/v5.10.100-cip2-319-gcbff87047566/x86_64/x86_64_defconfig+x86-chromebook+kselftest/gcc-10/lab-collabora/kselftest-seccomp-asus-C523NA-A20057-coral.txt
HTML log: https://storage.kernelci.org//cip-gitlab/ci-iwamatsu-linux-5.10.y-cip-rc/v5.10.100-cip2-319-gcbff87047566/x86_64/x86_64_defconfig+x86-chromebook+kselftest/gcc-10/lab-collabora/kselftest-seccomp-asus-C523NA-A20057-coral.html
Rootfs: http://storage.kernelci.org/images/rootfs/debian/bullseye-kselftest/20220218.1/amd64/initrd.cpio.gz


* kselftest-seccomp.seccomp_seccomp_bpf_TSYNC_siblings_fail_prctl: https://kernelci.org/test/case/id/622151c36bc3faaef1c62981
new failure (last pass: v5.10.83-cip1-1540-g9fb82e7fedf9)



platform | arch | lab | compiler | defconfig | regressions
--------------------------+--------+---------------+----------+------------------------------+------------
hp-11A-G6-EE-grunt | x86_64 | lab-collabora | gcc-10 | x86_64_defcon...ok+kselftest | 1

Details: https://kernelci.org/test/plan/id/62215076bfdc8f639bc629bf

Results: 83 PASS, 4 FAIL, 7 SKIP
Full config: x86_64_defconfig+x86-chromebook+kselftest
Compiler: gcc-10 (gcc (Debian 10.2.1-6) 10.2.1 20210110)
Plain log: https://storage.kernelci.org//cip-gitlab/ci-iwamatsu-linux-5.10.y-cip-rc/v5.10.100-cip2-319-gcbff87047566/x86_64/x86_64_defconfig+x86-chromebook+kselftest/gcc-10/lab-collabora/kselftest-seccomp-hp-11A-G6-EE-grunt.txt
HTML log: https://storage.kernelci.org//cip-gitlab/ci-iwamatsu-linux-5.10.y-cip-rc/v5.10.100-cip2-319-gcbff87047566/x86_64/x86_64_defconfig+x86-chromebook+kselftest/gcc-10/lab-collabora/kselftest-seccomp-hp-11A-G6-EE-grunt.html
Rootfs: http://storage.kernelci.org/images/rootfs/debian/bullseye-kselftest/20220218.1/amd64/initrd.cpio.gz


* kselftest-seccomp.seccomp_seccomp_bpf_TSYNC_siblings_fail_prctl: https://kernelci.org/test/case/id/62215076bfdc8f639bc629c6
new failure (last pass: v5.10.83-cip1-1540-g9fb82e7fedf9)


cip-gitlab/ci/iwamatsu/linux-4.19.y-cip-rc build: 151 builds: 5 failed, 146 passed, 2 errors, 18 warnings (v4.19.231-cip68-36-g01a8d14a9290) #kernelci

kernelci.org bot <bot@...>
 

cip-gitlab/ci/iwamatsu/linux-4.19.y-cip-rc build: 151 builds: 5 failed, 146 passed, 2 errors, 18 warnings (v4.19.231-cip68-36-g01a8d14a9290)

Full Build Summary: https://kernelci.org/build/cip-gitlab/branch/ci%2Fiwamatsu%2Flinux-4.19.y-cip-rc/kernel/v4.19.231-cip68-36-g01a8d14a9290/

Tree: cip-gitlab
Branch: ci/iwamatsu/linux-4.19.y-cip-rc
Git Describe: v4.19.231-cip68-36-g01a8d14a9290
Git Commit: 01a8d14a9290d6fa6ed8c06a2a5d96e961b57ec4
Git URL: https://gitlab.com/cip-project/cip-kernel/linux-cip.git
Built: 7 unique architectures

Build Failures Detected:

arm:
rpc_defconfig: (gcc-10) FAIL

mips:
ip27_defconfig: (gcc-10) FAIL

riscv:
allnoconfig: (gcc-10) FAIL
defconfig: (gcc-10) FAIL
tinyconfig: (gcc-10) FAIL

Errors and Warnings Detected:

arc:

arm64:
defconfig+arm64-chromebook (gcc-10): 3 warnings

arm:
omap1_defconfig (gcc-10): 1 warning
rpc_defconfig (gcc-10): 2 errors

i386:
tinyconfig (gcc-10): 2 warnings

mips:
lemote2f_defconfig (gcc-10): 1 warning
malta_qemu_32r6_defconfig (gcc-10): 1 warning
mtx1_defconfig (gcc-10): 3 warnings
nlm_xlp_defconfig (gcc-10): 1 warning

riscv:

x86_64:
x86_64_defconfig (gcc-10): 3 warnings
x86_64_defconfig+x86-chromebook (gcc-10): 3 warnings

Errors summary:

1 arm-linux-gnueabihf-gcc: error: unrecognized -march target: armv3
1 arm-linux-gnueabihf-gcc: error: missing argument to ‘-march=’

Warnings summary:

3 ld: warning: creating DT_TEXTREL in a PIE
3 aarch64-linux-gnu-ld: warning: -z norelro ignored
2 sound/pci/echoaudio/echoaudio_dsp.c:647:9: warning: iteration 1073741824 invokes undefined behavior [-Waggressive-loop-optimizations]
2 ld: arch/x86/boot/compressed/head_64.o: warning: relocation in read-only section `.head.text'
2 arch/x86/entry/entry_64.S:1738: Warning: no instruction mnemonic suffix given and no register operands; using default for `sysret'
1 {standard input}:132: Warning: macro instruction expanded into multiple instructions
1 sound/pci/echoaudio/echoaudio_dsp.c:658:9: warning: iteration 1073741824 invokes undefined behavior [-Waggressive-loop-optimizations]
1 net/core/rtnetlink.c:3199:1: warning: the frame size of 1344 bytes is larger than 1024 bytes [-Wframe-larger-than=]
1 net/core/rtnetlink.c:3199:1: warning: the frame size of 1328 bytes is larger than 1024 bytes [-Wframe-larger-than=]
1 ld: arch/x86/boot/compressed/head_32.o: warning: relocation in read-only section `.head.text'
1 drivers/gpio/gpio-omap.c:1233:34: warning: array ‘omap_gpio_match’ assumed to have one element

================================================================================

Detailed per-defconfig build reports:

--------------------------------------------------------------------------------
32r2el_defconfig (mips, gcc-10) — PASS, 0 errors, 0 warnings, 0 section mismatches

--------------------------------------------------------------------------------
acs5k_tiny_defconfig (arm, gcc-10) — PASS, 0 errors, 0 warnings, 0 section mismatches

--------------------------------------------------------------------------------
allnoconfig (riscv, gcc-10) — FAIL, 0 errors, 0 warnings, 0 section mismatches

--------------------------------------------------------------------------------
allnoconfig (arc, gcc-10) — PASS, 0 errors, 0 warnings, 0 section mismatches

--------------------------------------------------------------------------------
am200epdkit_defconfig (arm, gcc-10) — PASS, 0 errors, 0 warnings, 0 section mismatches

--------------------------------------------------------------------------------
ar7_defconfig (mips, gcc-10) — PASS, 0 errors, 0 warnings, 0 section mismatches

--------------------------------------------------------------------------------
aspeed_g4_defconfig (arm, gcc-10) — PASS, 0 errors, 0 warnings, 0 section mismatches

--------------------------------------------------------------------------------
assabet_defconfig (arm, gcc-10) — PASS, 0 errors, 0 warnings, 0 section mismatches

--------------------------------------------------------------------------------
at91_dt_defconfig (arm, gcc-10) — PASS, 0 errors, 0 warnings, 0 section mismatches

--------------------------------------------------------------------------------
ath25_defconfig (mips, gcc-10) — PASS, 0 errors, 0 warnings, 0 section mismatches

--------------------------------------------------------------------------------
axm55xx_defconfig (arm, gcc-10) — PASS, 0 errors, 0 warnings, 0 section mismatches

--------------------------------------------------------------------------------
axs103_defconfig (arc, gcc-10) — PASS, 0 errors, 0 warnings, 0 section mismatches

--------------------------------------------------------------------------------
bcm2835_defconfig (arm, gcc-10) — PASS, 0 errors, 0 warnings, 0 section mismatches

--------------------------------------------------------------------------------
bigsur_defconfig (mips, gcc-10) — PASS, 0 errors, 0 warnings, 0 section mismatches

--------------------------------------------------------------------------------
bmips_be_defconfig (mips, gcc-10) — PASS, 0 errors, 0 warnings, 0 section mismatches

--------------------------------------------------------------------------------
bmips_stb_defconfig (mips, gcc-10) — PASS, 0 errors, 0 warnings, 0 section mismatches

--------------------------------------------------------------------------------
capcella_defconfig (mips, gcc-10) — PASS, 0 errors, 0 warnings, 0 section mismatches

--------------------------------------------------------------------------------
cavium_octeon_defconfig (mips, gcc-10) — PASS, 0 errors, 0 warnings, 0 section mismatches

--------------------------------------------------------------------------------
ci20_defconfig (mips, gcc-10) — PASS, 0 errors, 0 warnings, 0 section mismatches

--------------------------------------------------------------------------------
cm_x300_defconfig (arm, gcc-10) — PASS, 0 errors, 0 warnings, 0 section mismatches

--------------------------------------------------------------------------------
cobalt_defconfig (mips, gcc-10) — PASS, 0 errors, 0 warnings, 0 section mismatches

--------------------------------------------------------------------------------
colibri_pxa300_defconfig (arm, gcc-10) — PASS, 0 errors, 0 warnings, 0 section mismatches

--------------------------------------------------------------------------------
collie_defconfig (arm, gcc-10) — PASS, 0 errors, 0 warnings, 0 section mismatches

--------------------------------------------------------------------------------
corgi_defconfig (arm, gcc-10) — PASS, 0 errors, 0 warnings, 0 section mismatches

--------------------------------------------------------------------------------
davinci_all_defconfig (arm, gcc-10) — PASS, 0 errors, 0 warnings, 0 section mismatches

--------------------------------------------------------------------------------
db1xxx_defconfig (mips, gcc-10) — PASS, 0 errors, 0 warnings, 0 section mismatches

--------------------------------------------------------------------------------
defconfig (riscv, gcc-10) — FAIL, 0 errors, 0 warnings, 0 section mismatches

--------------------------------------------------------------------------------
defconfig+arm64-chromebook (arm64, gcc-10) — PASS, 0 errors, 3 warnings, 0 section mismatches

Warnings:
aarch64-linux-gnu-ld: warning: -z norelro ignored
aarch64-linux-gnu-ld: warning: -z norelro ignored
aarch64-linux-gnu-ld: warning: -z norelro ignored

--------------------------------------------------------------------------------
dove_defconfig (arm, gcc-10) — PASS, 0 errors, 0 warnings, 0 section mismatches

--------------------------------------------------------------------------------
e55_defconfig (mips, gcc-10) — PASS, 0 errors, 0 warnings, 0 section mismatches

--------------------------------------------------------------------------------
ebsa110_defconfig (arm, gcc-10) — PASS, 0 errors, 0 warnings, 0 section mismatches

--------------------------------------------------------------------------------
efm32_defconfig (arm, gcc-10) — PASS, 0 errors, 0 warnings, 0 section mismatches

--------------------------------------------------------------------------------
em_x270_defconfig (arm, gcc-10) — PASS, 0 errors, 0 warnings, 0 section mismatches

--------------------------------------------------------------------------------
ep93xx_defconfig (arm, gcc-10) — PASS, 0 errors, 0 warnings, 0 section mismatches

--------------------------------------------------------------------------------
eseries_pxa_defconfig (arm, gcc-10) — PASS, 0 errors, 0 warnings, 0 section mismatches

--------------------------------------------------------------------------------
exynos_defconfig (arm, gcc-10) — PASS, 0 errors, 0 warnings, 0 section mismatches

--------------------------------------------------------------------------------
ezx_defconfig (arm, gcc-10) — PASS, 0 errors, 0 warnings, 0 section mismatches

--------------------------------------------------------------------------------
footbridge_defconfig (arm, gcc-10) — PASS, 0 errors, 0 warnings, 0 section mismatches

--------------------------------------------------------------------------------
fuloong2e_defconfig (mips, gcc-10) — PASS, 0 errors, 0 warnings, 0 section mismatches

--------------------------------------------------------------------------------
gcw0_defconfig (mips, gcc-10) — PASS, 0 errors, 0 warnings, 0 section mismatches

--------------------------------------------------------------------------------
gemini_defconfig (arm, gcc-10) — PASS, 0 errors, 0 warnings, 0 section mismatches

--------------------------------------------------------------------------------
gpr_defconfig (mips, gcc-10) — PASS, 0 errors, 0 warnings, 0 section mismatches

--------------------------------------------------------------------------------
h5000_defconfig (arm, gcc-10) — PASS, 0 errors, 0 warnings, 0 section mismatches

--------------------------------------------------------------------------------
hackkit_defconfig (arm, gcc-10) — PASS, 0 errors, 0 warnings, 0 section mismatches

--------------------------------------------------------------------------------
haps_hs_defconfig (arc, gcc-10) — PASS, 0 errors, 0 warnings, 0 section mismatches

--------------------------------------------------------------------------------
haps_hs_smp_defconfig (arc, gcc-10) — PASS, 0 errors, 0 warnings, 0 section mismatches

--------------------------------------------------------------------------------
hisi_defconfig (arm, gcc-10) — PASS, 0 errors, 0 warnings, 0 section mismatches

--------------------------------------------------------------------------------
hsdk_defconfig (arc, gcc-10) — PASS, 0 errors, 0 warnings, 0 section mismatches

--------------------------------------------------------------------------------
imote2_defconfig (arm, gcc-10) — PASS, 0 errors, 0 warnings, 0 section mismatches

--------------------------------------------------------------------------------
imx_v4_v5_defconfig (arm, gcc-10) — PASS, 0 errors, 0 warnings, 0 section mismatches

--------------------------------------------------------------------------------
integrator_defconfig (arm, gcc-10) — PASS, 0 errors, 0 warnings, 0 section mismatches

--------------------------------------------------------------------------------
iop32x_defconfig (arm, gcc-10) — PASS, 0 errors, 0 warnings, 0 section mismatches

--------------------------------------------------------------------------------
iop33x_defconfig (arm, gcc-10) — PASS, 0 errors, 0 warnings, 0 section mismatches

--------------------------------------------------------------------------------
ip22_defconfig (mips, gcc-10) — PASS, 0 errors, 0 warnings, 0 section mismatches

--------------------------------------------------------------------------------
ip27_defconfig (mips, gcc-10) — FAIL, 0 errors, 0 warnings, 0 section mismatches

--------------------------------------------------------------------------------
ip32_defconfig (mips, gcc-10) — PASS, 0 errors, 0 warnings, 0 section mismatches

--------------------------------------------------------------------------------
ixp4xx_defconfig (arm, gcc-10) — PASS, 0 errors, 0 warnings, 0 section mismatches

--------------------------------------------------------------------------------
jmr3927_defconfig (mips, gcc-10) — PASS, 0 errors, 0 warnings, 0 section mismatches

--------------------------------------------------------------------------------
keystone_defconfig (arm, gcc-10) — PASS, 0 errors, 0 warnings, 0 section mismatches

--------------------------------------------------------------------------------
ks8695_defconfig (arm, gcc-10) — PASS, 0 errors, 0 warnings, 0 section mismatches

--------------------------------------------------------------------------------
lart_defconfig (arm, gcc-10) — PASS, 0 errors, 0 warnings, 0 section mismatches

--------------------------------------------------------------------------------
lasat_defconfig (mips, gcc-10) — PASS, 0 errors, 0 warnings, 0 section mismatches

--------------------------------------------------------------------------------
lemote2f_defconfig (mips, gcc-10) — PASS, 0 errors, 1 warning, 0 section mismatches

Warnings:
net/core/rtnetlink.c:3199:1: warning: the frame size of 1328 bytes is larger than 1024 bytes [-Wframe-larger-than=]

--------------------------------------------------------------------------------
loongson1b_defconfig (mips, gcc-10) — PASS, 0 errors, 0 warnings, 0 section mismatches

--------------------------------------------------------------------------------
loongson1c_defconfig (mips, gcc-10) — PASS, 0 errors, 0 warnings, 0 section mismatches

--------------------------------------------------------------------------------
lpc18xx_defconfig (arm, gcc-10) — PASS, 0 errors, 0 warnings, 0 section mismatches

--------------------------------------------------------------------------------
lpd270_defconfig (arm, gcc-10) — PASS, 0 errors, 0 warnings, 0 section mismatches

--------------------------------------------------------------------------------
lubbock_defconfig (arm, gcc-10) — PASS, 0 errors, 0 warnings, 0 section mismatches

--------------------------------------------------------------------------------
magician_defconfig (arm, gcc-10) — PASS, 0 errors, 0 warnings, 0 section mismatches

--------------------------------------------------------------------------------
mainstone_defconfig (arm, gcc-10) — PASS, 0 errors, 0 warnings, 0 section mismatches

--------------------------------------------------------------------------------
malta_defconfig (mips, gcc-10) — PASS, 0 errors, 0 warnings, 0 section mismatches

--------------------------------------------------------------------------------
malta_kvm_guest_defconfig (mips, gcc-10) — PASS, 0 errors, 0 warnings, 0 section mismatches

--------------------------------------------------------------------------------
malta_qemu_32r6_defconfig (mips, gcc-10) — PASS, 0 errors, 1 warning, 0 section mismatches

Warnings:
{standard input}:132: Warning: macro instruction expanded into multiple instructions

--------------------------------------------------------------------------------
maltaaprp_defconfig (mips, gcc-10) — PASS, 0 errors, 0 warnings, 0 section mismatches

--------------------------------------------------------------------------------
maltasmvp_eva_defconfig (mips, gcc-10) — PASS, 0 errors, 0 warnings, 0 section mismatches

--------------------------------------------------------------------------------
maltaup_defconfig (mips, gcc-10) — PASS, 0 errors, 0 warnings, 0 section mismatches

--------------------------------------------------------------------------------
maltaup_xpa_defconfig (mips, gcc-10) — PASS, 0 errors, 0 warnings, 0 section mismatches

--------------------------------------------------------------------------------
mips_paravirt_defconfig (mips, gcc-10) — PASS, 0 errors, 0 warnings, 0 section mismatches

--------------------------------------------------------------------------------
mmp2_defconfig (arm, gcc-10) — PASS, 0 errors, 0 warnings, 0 section mismatches

--------------------------------------------------------------------------------
mps2_defconfig (arm, gcc-10) — PASS, 0 errors, 0 warnings, 0 section mismatches

--------------------------------------------------------------------------------
msp71xx_defconfig (mips, gcc-10) — PASS, 0 errors, 0 warnings, 0 section mismatches

--------------------------------------------------------------------------------
mtx1_defconfig (mips, gcc-10) — PASS, 0 errors, 3 warnings, 0 section mismatches

Warnings:
sound/pci/echoaudio/echoaudio_dsp.c:647:9: warning: iteration 1073741824 invokes undefined behavior [-Waggressive-loop-optimizations]
sound/pci/echoaudio/echoaudio_dsp.c:658:9: warning: iteration 1073741824 invokes undefined behavior [-Waggressive-loop-optimizations]
sound/pci/echoaudio/echoaudio_dsp.c:647:9: warning: iteration 1073741824 invokes undefined behavior [-Waggressive-loop-optimizations]

--------------------------------------------------------------------------------
multi_v4t_defconfig (arm, gcc-10) — PASS, 0 errors, 0 warnings, 0 section mismatches

--------------------------------------------------------------------------------
multi_v5_defconfig (arm, gcc-10) — PASS, 0 errors, 0 warnings, 0 section mismatches

--------------------------------------------------------------------------------
multi_v7_defconfig (arm, gcc-10) — PASS, 0 errors, 0 warnings, 0 section mismatches

--------------------------------------------------------------------------------
mvebu_v5_defconfig (arm, gcc-10) — PASS, 0 errors, 0 warnings, 0 section mismatches

--------------------------------------------------------------------------------
mvebu_v7_defconfig (arm, gcc-10) — PASS, 0 errors, 0 warnings, 0 section mismatches

--------------------------------------------------------------------------------
mxs_defconfig (arm, gcc-10) — PASS, 0 errors, 0 warnings, 0 section mismatches

--------------------------------------------------------------------------------
neponset_defconfig (arm, gcc-10) — PASS, 0 errors, 0 warnings, 0 section mismatches

--------------------------------------------------------------------------------
netwinder_defconfig (arm, gcc-10) — PASS, 0 errors, 0 warnings, 0 section mismatches

--------------------------------------------------------------------------------
nhk8815_defconfig (arm, gcc-10) — PASS, 0 errors, 0 warnings, 0 section mismatches

--------------------------------------------------------------------------------
nlm_xlp_defconfig (mips, gcc-10) — PASS, 0 errors, 1 warning, 0 section mismatches

Warnings:
net/core/rtnetlink.c:3199:1: warning: the frame size of 1344 bytes is larger than 1024 bytes [-Wframe-larger-than=]

--------------------------------------------------------------------------------
nsim_hs_defconfig (arc, gcc-10) — PASS, 0 errors, 0 warnings, 0 section mismatches

--------------------------------------------------------------------------------
nsim_hs_smp_defconfig (arc, gcc-10) — PASS, 0 errors, 0 warnings, 0 section mismatches

--------------------------------------------------------------------------------
nsimosci_hs_defconfig (arc, gcc-10) — PASS, 0 errors, 0 warnings, 0 section mismatches

--------------------------------------------------------------------------------
nsimosci_hs_smp_defconfig (arc, gcc-10) — PASS, 0 errors, 0 warnings, 0 section mismatches

--------------------------------------------------------------------------------
nuc960_defconfig (arm, gcc-10) — PASS, 0 errors, 0 warnings, 0 section mismatches

--------------------------------------------------------------------------------
omap1_defconfig (arm, gcc-10) — PASS, 0 errors, 1 warning, 0 section mismatches

Warnings:
drivers/gpio/gpio-omap.c:1233:34: warning: array ‘omap_gpio_match’ assumed to have one element

--------------------------------------------------------------------------------
omap2plus_defconfig (arm, gcc-10) — PASS, 0 errors, 0 warnings, 0 section mismatches

--------------------------------------------------------------------------------
omega2p_defconfig (mips, gcc-10) — PASS, 0 errors, 0 warnings, 0 section mismatches

--------------------------------------------------------------------------------
orion5x_defconfig (arm, gcc-10) — PASS, 0 errors, 0 warnings, 0 section mismatches

--------------------------------------------------------------------------------
pcm027_defconfig (arm, gcc-10) — PASS, 0 errors, 0 warnings, 0 section mismatches

--------------------------------------------------------------------------------
pic32mzda_defconfig (mips, gcc-10) — PASS, 0 errors, 0 warnings, 0 section mismatches

--------------------------------------------------------------------------------
pistachio_defconfig (mips, gcc-10) — PASS, 0 errors, 0 warnings, 0 section mismatches

--------------------------------------------------------------------------------
pleb_defconfig (arm, gcc-10) — PASS, 0 errors, 0 warnings, 0 section mismatches

--------------------------------------------------------------------------------
pnx8335_stb225_defconfig (mips, gcc-10) — PASS, 0 errors, 0 warnings, 0 section mismatches

--------------------------------------------------------------------------------
prima2_defconfig (arm, gcc-10) — PASS, 0 errors, 0 warnings, 0 section mismatches

--------------------------------------------------------------------------------
pxa3xx_defconfig (arm, gcc-10) — PASS, 0 errors, 0 warnings, 0 section mismatches

--------------------------------------------------------------------------------
pxa910_defconfig (arm, gcc-10) — PASS, 0 errors, 0 warnings, 0 section mismatches

--------------------------------------------------------------------------------
pxa_defconfig (arm, gcc-10) — PASS, 0 errors, 0 warnings, 0 section mismatches

--------------------------------------------------------------------------------
qcom_defconfig (arm, gcc-10) — PASS, 0 errors, 0 warnings, 0 section mismatches

--------------------------------------------------------------------------------
qi_lb60_defconfig (mips, gcc-10) — PASS, 0 errors, 0 warnings, 0 section mismatches

--------------------------------------------------------------------------------
raumfeld_defconfig (arm, gcc-10) — PASS, 0 errors, 0 warnings, 0 section mismatches

--------------------------------------------------------------------------------
rb532_defconfig (mips, gcc-10) — PASS, 0 errors, 0 warnings, 0 section mismatches

--------------------------------------------------------------------------------
rbtx49xx_defconfig (mips, gcc-10) — PASS, 0 errors, 0 warnings, 0 section mismatches

--------------------------------------------------------------------------------
realview_defconfig (arm, gcc-10) — PASS, 0 errors, 0 warnings, 0 section mismatches

--------------------------------------------------------------------------------
rm200_defconfig (mips, gcc-10) — PASS, 0 errors, 0 warnings, 0 section mismatches

--------------------------------------------------------------------------------
rpc_defconfig (arm, gcc-10) — FAIL, 2 errors, 0 warnings, 0 section mismatches

Errors:
arm-linux-gnueabihf-gcc: error: unrecognized -march target: armv3
arm-linux-gnueabihf-gcc: error: missing argument to ‘-march=’

--------------------------------------------------------------------------------
rt305x_defconfig (mips, gcc-10) — PASS, 0 errors, 0 warnings, 0 section mismatches

--------------------------------------------------------------------------------
s3c2410_defconfig (arm, gcc-10) — PASS, 0 errors, 0 warnings, 0 section mismatches

--------------------------------------------------------------------------------
s3c6400_defconfig (arm, gcc-10) — PASS, 0 errors, 0 warnings, 0 section mismatches

--------------------------------------------------------------------------------
s5pv210_defconfig (arm, gcc-10) — PASS, 0 errors, 0 warnings, 0 section mismatches

--------------------------------------------------------------------------------
shmobile_defconfig (arm, gcc-10) — PASS, 0 errors, 0 warnings, 0 section mismatches

--------------------------------------------------------------------------------
socfpga_defconfig (arm, gcc-10) — PASS, 0 errors, 0 warnings, 0 section mismatches

--------------------------------------------------------------------------------
spear13xx_defconfig (arm, gcc-10) — PASS, 0 errors, 0 warnings, 0 section mismatches

--------------------------------------------------------------------------------
spear3xx_defconfig (arm, gcc-10) — PASS, 0 errors, 0 warnings, 0 section mismatches

--------------------------------------------------------------------------------
spear6xx_defconfig (arm, gcc-10) — PASS, 0 errors, 0 warnings, 0 section mismatches

--------------------------------------------------------------------------------
spitz_defconfig (arm, gcc-10) — PASS, 0 errors, 0 warnings, 0 section mismatches

--------------------------------------------------------------------------------
stm32_defconfig (arm, gcc-10) — PASS, 0 errors, 0 warnings, 0 section mismatches

--------------------------------------------------------------------------------
sunxi_defconfig (arm, gcc-10) — PASS, 0 errors, 0 warnings, 0 section mismatches

--------------------------------------------------------------------------------
tango4_defconfig (arm, gcc-10) — PASS, 0 errors, 0 warnings, 0 section mismatches

--------------------------------------------------------------------------------
tb0219_defconfig (mips, gcc-10) — PASS, 0 errors, 0 warnings, 0 section mismatches

--------------------------------------------------------------------------------
tb0226_defconfig (mips, gcc-10) — PASS, 0 errors, 0 warnings, 0 section mismatches

--------------------------------------------------------------------------------
tct_hammer_defconfig (arm, gcc-10) — PASS, 0 errors, 0 warnings, 0 section mismatches

--------------------------------------------------------------------------------
tegra_defconfig (arm, gcc-10) — PASS, 0 errors, 0 warnings, 0 section mismatches

--------------------------------------------------------------------------------
tinyconfig (riscv, gcc-10) — FAIL, 0 errors, 0 warnings, 0 section mismatches

--------------------------------------------------------------------------------
tinyconfig (arc, gcc-10) — PASS, 0 errors, 0 warnings, 0 section mismatches

--------------------------------------------------------------------------------
tinyconfig (i386, gcc-10) — PASS, 0 errors, 2 warnings, 0 section mismatches

Warnings:
ld: arch/x86/boot/compressed/head_32.o: warning: relocation in read-only section `.head.text'
ld: warning: creating DT_TEXTREL in a PIE

--------------------------------------------------------------------------------
trizeps4_defconfig (arm, gcc-10) — PASS, 0 errors, 0 warnings, 0 section mismatches

--------------------------------------------------------------------------------
u300_defconfig (arm, gcc-10) — PASS, 0 errors, 0 warnings, 0 section mismatches

--------------------------------------------------------------------------------
u8500_defconfig (arm, gcc-10) — PASS, 0 errors, 0 warnings, 0 section mismatches

--------------------------------------------------------------------------------
vdk_hs38_defconfig (arc, gcc-10) — PASS, 0 errors, 0 warnings, 0 section mismatches

--------------------------------------------------------------------------------
vf610m4_defconfig (arm, gcc-10) — PASS, 0 errors, 0 warnings, 0 section mismatches

--------------------------------------------------------------------------------
viper_defconfig (arm, gcc-10) — PASS, 0 errors, 0 warnings, 0 section mismatches

--------------------------------------------------------------------------------
vt8500_v6_v7_defconfig (arm, gcc-10) — PASS, 0 errors, 0 warnings, 0 section mismatches

--------------------------------------------------------------------------------
workpad_defconfig (mips, gcc-10) — PASS, 0 errors, 0 warnings, 0 section mismatches

--------------------------------------------------------------------------------
x86_64_defconfig (x86_64, gcc-10) — PASS, 0 errors, 3 warnings, 0 section mismatches

Warnings:
arch/x86/entry/entry_64.S:1738: Warning: no instruction mnemonic suffix given and no register operands; using default for `sysret'
ld: arch/x86/boot/compressed/head_64.o: warning: relocation in read-only section `.head.text'
ld: warning: creating DT_TEXTREL in a PIE

--------------------------------------------------------------------------------
x86_64_defconfig+x86-chromebook (x86_64, gcc-10) — PASS, 0 errors, 3 warnings, 0 section mismatches

Warnings:
arch/x86/entry/entry_64.S:1738: Warning: no instruction mnemonic suffix given and no register operands; using default for `sysret'
ld: arch/x86/boot/compressed/head_64.o: warning: relocation in read-only section `.head.text'
ld: warning: creating DT_TEXTREL in a PIE

--------------------------------------------------------------------------------
xcep_defconfig (arm, gcc-10) — PASS, 0 errors, 0 warnings, 0 section mismatches

--------------------------------------------------------------------------------
zeus_defconfig (arm, gcc-10) — PASS, 0 errors, 0 warnings, 0 section mismatches

--------------------------------------------------------------------------------
zx_defconfig (arm, gcc-10) — PASS, 0 errors, 0 warnings, 0 section mismatches

---
For more info write to <info@...>


cip-gitlab/ci/iwamatsu/linux-5.10.y-cip-rc baseline-cip-nfs: 11 runs, 1 regressions (v5.10.100-cip2-319-gcbff87047566) #kernelci

kernelci.org bot <bot@...>
 

cip-gitlab/ci/iwamatsu/linux-5.10.y-cip-rc baseline-cip-nfs: 11 runs, 1 regressions (v5.10.100-cip2-319-gcbff87047566)

Regressions Summary
-------------------

platform | arch | lab | compiler | defconfig | regressions
-------------------------+-------+---------+----------+-----------+------------
r8a774a1-hihope-rzg2m-ex | arm64 | lab-cip | gcc-10 | defconfig | 1

Details: https://kernelci.org/test/job/cip-gitlab/branch/ci%2Fiwamatsu%2Flinux-5.10.y-cip-rc/kernel/v5.10.100-cip2-319-gcbff87047566/plan/baseline-cip-nfs/

Test: baseline-cip-nfs
Tree: cip-gitlab
Branch: ci/iwamatsu/linux-5.10.y-cip-rc
Describe: v5.10.100-cip2-319-gcbff87047566
URL: https://gitlab.com/cip-project/cip-kernel/linux-cip.git
SHA: cbff870475669d78815941c2e765cc5a8b6078f0


Test Regressions
----------------


platform | arch | lab | compiler | defconfig | regressions
-------------------------+-------+---------+----------+-----------+------------
r8a774a1-hihope-rzg2m-ex | arm64 | lab-cip | gcc-10 | defconfig | 1

Details: https://kernelci.org/test/plan/id/62214e4e2fe8da3528c62973

Results: 0 PASS, 1 FAIL, 0 SKIP
Full config: defconfig
Compiler: gcc-10 (aarch64-linux-gnu-gcc (Debian 10.2.1-6) 10.2.1 20210110)
Plain log: https://storage.kernelci.org//cip-gitlab/ci-iwamatsu-linux-5.10.y-cip-rc/v5.10.100-cip2-319-gcbff87047566/arm64/defconfig/gcc-10/lab-cip/baseline-cip-nfs-r8a774a1-hihope-rzg2m-ex.txt
HTML log: https://storage.kernelci.org//cip-gitlab/ci-iwamatsu-linux-5.10.y-cip-rc/v5.10.100-cip2-319-gcbff87047566/arm64/defconfig/gcc-10/lab-cip/baseline-cip-nfs-r8a774a1-hihope-rzg2m-ex.html
Rootfs: https://storage.kernelci.org/images/rootfs/cip/20211105/qemu-arm64/cip-core-image-kernelci-cip-core-buster-qemu-arm64-initrd.img.gz


* baseline-cip-nfs.login: https://kernelci.org/test/case/id/62214e4e2fe8da3528c62974
new failure (last pass: v5.10.100-cip2-239-g01aa183a119a)


cip-gitlab/ci/iwamatsu/linux-5.10.y-cip-rc build: 190 builds: 3 failed, 187 passed, 4 errors, 10 warnings (v5.10.100-cip2-319-gcbff87047566) #kernelci

kernelci.org bot <bot@...>
 

cip-gitlab/ci/iwamatsu/linux-5.10.y-cip-rc build: 190 builds: 3 failed, 187 passed, 4 errors, 10 warnings (v5.10.100-cip2-319-gcbff87047566)

Full Build Summary: https://kernelci.org/build/cip-gitlab/branch/ci%2Fiwamatsu%2Flinux-5.10.y-cip-rc/kernel/v5.10.100-cip2-319-gcbff87047566/

Tree: cip-gitlab
Branch: ci/iwamatsu/linux-5.10.y-cip-rc
Git Describe: v5.10.100-cip2-319-gcbff87047566
Git Commit: cbff870475669d78815941c2e765cc5a8b6078f0
Git URL: https://gitlab.com/cip-project/cip-kernel/linux-cip.git
Built: 7 unique architectures

Build Failures Detected:

arm:
rpc_defconfig: (gcc-10) FAIL

mips:
ip27_defconfig: (gcc-10) FAIL
ip28_defconfig: (gcc-10) FAIL

Errors and Warnings Detected:

arc:

arm64:

arm:
rpc_defconfig (gcc-10): 4 errors

i386:

mips:
32r2el_defconfig (gcc-10): 1 warning
decstation_64_defconfig (gcc-10): 1 warning
decstation_defconfig (gcc-10): 1 warning
decstation_r4k_defconfig (gcc-10): 1 warning
lemote2f_defconfig (gcc-10): 1 warning
rm200_defconfig (gcc-10): 1 warning

riscv:
rv32_defconfig (gcc-10): 4 warnings

x86_64:

Errors summary:

2 arm-linux-gnueabihf-gcc: error: unrecognized -march target: armv3m
2 arm-linux-gnueabihf-gcc: error: missing argument to ‘-march=’

Warnings summary:

3 kernel/rcu/tasks.h:707:13: warning: ‘show_rcu_tasks_rude_gp_kthread’ defined but not used [-Wunused-function]
2 <stdin>:830:2: warning: #warning syscall fstat64 not implemented [-Wcpp]
2 <stdin>:1127:2: warning: #warning syscall fstatat64 not implemented [-Wcpp]
1 net/mac80211/mlme.c:4335:1: warning: the frame size of 1040 bytes is larger than 1024 bytes [-Wframe-larger-than=]
1 drivers/block/paride/bpck.c:32: warning: "PC" redefined
1 WARNING: modpost: Symbol info of vmlinux is missing. Unresolved symbol check will be entirely skipped.

Section mismatches summary:

1 WARNING: modpost: vmlinux.o(.text+0xd040): Section mismatch in reference from the function __arm_ioremap_pfn_caller() to the function .meminit.text:memblock_is_map_memory()
1 WARNING: modpost: vmlinux.o(.text+0xce9c): Section mismatch in reference from the function __arm_ioremap_pfn_caller() to the function .meminit.text:memblock_is_map_memory()
1 WARNING: modpost: vmlinux.o(.text+0xcda4): Section mismatch in reference from the function __arm_ioremap_pfn_caller() to the function .meminit.text:memblock_is_map_memory()
1 WARNING: modpost: vmlinux.o(.text+0xcd38): Section mismatch in reference from the function __arm_ioremap_pfn_caller() to the function .meminit.text:memblock_is_map_memory()
1 WARNING: modpost: vmlinux.o(.text+0xcb84): Section mismatch in reference from the function __arm_ioremap_pfn_caller() to the function .meminit.text:memblock_is_map_memory()
1 WARNING: modpost: vmlinux.o(.text+0xcb74): Section mismatch in reference from the function __arm_ioremap_pfn_caller() to the function .meminit.text:memblock_is_map_memory()
1 WARNING: modpost: vmlinux.o(.text+0xcb6c): Section mismatch in reference from the function __arm_ioremap_pfn_caller() to the function .meminit.text:memblock_is_map_memory()
1 WARNING: modpost: vmlinux.o(.text+0xcb4c): Section mismatch in reference from the function __arm_ioremap_pfn_caller() to the function .meminit.text:memblock_is_map_memory()
1 WARNING: modpost: vmlinux.o(.text+0xcaa8): Section mismatch in reference from the function __arm_ioremap_pfn_caller() to the function .meminit.text:memblock_is_map_memory()
1 WARNING: modpost: vmlinux.o(.text+0xc8ec): Section mismatch in reference from the function __arm_ioremap_pfn_caller() to the function .meminit.text:memblock_is_map_memory()
1 WARNING: modpost: vmlinux.o(.text+0xb904): Section mismatch in reference from the function __arm_ioremap_pfn_caller() to the function .meminit.text:memblock_is_map_memory()
1 WARNING: modpost: vmlinux.o(.text+0x8054): Section mismatch in reference from the function __arm_ioremap_pfn_caller() to the function .meminit.text:memblock_is_map_memory()
1 WARNING: modpost: vmlinux.o(.text+0x7670): Section mismatch in reference from the function __arm_ioremap_pfn_caller() to the function .meminit.text:memblock_is_map_memory()

================================================================================

Detailed per-defconfig build reports:

--------------------------------------------------------------------------------
32r2el_defconfig (mips, gcc-10) — PASS, 0 errors, 1 warning, 0 section mismatches

Warnings:
WARNING: modpost: Symbol info of vmlinux is missing. Unresolved symbol check will be entirely skipped.

--------------------------------------------------------------------------------
allnoconfig (i386, gcc-10) — PASS, 0 errors, 0 warnings, 0 section mismatches

--------------------------------------------------------------------------------
allnoconfig (x86_64, gcc-10) — PASS, 0 errors, 0 warnings, 0 section mismatches

--------------------------------------------------------------------------------
allnoconfig (arc, gcc-10) — PASS, 0 errors, 0 warnings, 0 section mismatches

--------------------------------------------------------------------------------
am200epdkit_defconfig (arm, gcc-10) — PASS, 0 errors, 0 warnings, 0 section mismatches

--------------------------------------------------------------------------------
ar7_defconfig (mips, gcc-10) — PASS, 0 errors, 0 warnings, 0 section mismatches

--------------------------------------------------------------------------------
aspeed_g4_defconfig (arm, gcc-10) — PASS, 0 errors, 0 warnings, 0 section mismatches

--------------------------------------------------------------------------------
aspeed_g5_defconfig (arm, gcc-10) — PASS, 0 errors, 0 warnings, 0 section mismatches

--------------------------------------------------------------------------------
assabet_defconfig (arm, gcc-10) — PASS, 0 errors, 0 warnings, 0 section mismatches

Section mismatches:
WARNING: modpost: vmlinux.o(.text+0xcb6c): Section mismatch in reference from the function __arm_ioremap_pfn_caller() to the function .meminit.text:memblock_is_map_memory()

--------------------------------------------------------------------------------
at91_dt_defconfig (arm, gcc-10) — PASS, 0 errors, 0 warnings, 0 section mismatches

--------------------------------------------------------------------------------
ath25_defconfig (mips, gcc-10) — PASS, 0 errors, 0 warnings, 0 section mismatches

--------------------------------------------------------------------------------
ath79_defconfig (mips, gcc-10) — PASS, 0 errors, 0 warnings, 0 section mismatches

--------------------------------------------------------------------------------
axm55xx_defconfig (arm, gcc-10) — PASS, 0 errors, 0 warnings, 0 section mismatches

--------------------------------------------------------------------------------
axs103_defconfig (arc, gcc-10) — PASS, 0 errors, 0 warnings, 0 section mismatches

--------------------------------------------------------------------------------
axs103_smp_defconfig (arc, gcc-10) — PASS, 0 errors, 0 warnings, 0 section mismatches

--------------------------------------------------------------------------------
badge4_defconfig (arm, gcc-10) — PASS, 0 errors, 0 warnings, 0 section mismatches

Section mismatches:
WARNING: modpost: vmlinux.o(.text+0xcd38): Section mismatch in reference from the function __arm_ioremap_pfn_caller() to the function .meminit.text:memblock_is_map_memory()

--------------------------------------------------------------------------------
bcm2835_defconfig (arm, gcc-10) — PASS, 0 errors, 0 warnings, 0 section mismatches

--------------------------------------------------------------------------------
bcm47xx_defconfig (mips, gcc-10) — PASS, 0 errors, 0 warnings, 0 section mismatches

--------------------------------------------------------------------------------
bcm63xx_defconfig (mips, gcc-10) — PASS, 0 errors, 0 warnings, 0 section mismatches

--------------------------------------------------------------------------------
bigsur_defconfig (mips, gcc-10) — PASS, 0 errors, 0 warnings, 0 section mismatches

--------------------------------------------------------------------------------
bmips_be_defconfig (mips, gcc-10) — PASS, 0 errors, 0 warnings, 0 section mismatches

--------------------------------------------------------------------------------
bmips_stb_defconfig (mips, gcc-10) — PASS, 0 errors, 0 warnings, 0 section mismatches

--------------------------------------------------------------------------------
capcella_defconfig (mips, gcc-10) — PASS, 0 errors, 0 warnings, 0 section mismatches

--------------------------------------------------------------------------------
cavium_octeon_defconfig (mips, gcc-10) — PASS, 0 errors, 0 warnings, 0 section mismatches

--------------------------------------------------------------------------------
cerfcube_defconfig (arm, gcc-10) — PASS, 0 errors, 0 warnings, 0 section mismatches

Section mismatches:
WARNING: modpost: vmlinux.o(.text+0x7670): Section mismatch in reference from the function __arm_ioremap_pfn_caller() to the function .meminit.text:memblock_is_map_memory()

--------------------------------------------------------------------------------
ci20_defconfig (mips, gcc-10) — PASS, 0 errors, 0 warnings, 0 section mismatches

--------------------------------------------------------------------------------
cm_x300_defconfig (arm, gcc-10) — PASS, 0 errors, 0 warnings, 0 section mismatches

--------------------------------------------------------------------------------
cobalt_defconfig (mips, gcc-10) — PASS, 0 errors, 0 warnings, 0 section mismatches

--------------------------------------------------------------------------------
colibri_pxa270_defconfig (arm, gcc-10) — PASS, 0 errors, 0 warnings, 0 section mismatches

--------------------------------------------------------------------------------
colibri_pxa300_defconfig (arm, gcc-10) — PASS, 0 errors, 0 warnings, 0 section mismatches

--------------------------------------------------------------------------------
collie_defconfig (arm, gcc-10) — PASS, 0 errors, 0 warnings, 0 section mismatches

Section mismatches:
WARNING: modpost: vmlinux.o(.text+0xb904): Section mismatch in reference from the function __arm_ioremap_pfn_caller() to the function .meminit.text:memblock_is_map_memory()

--------------------------------------------------------------------------------
corgi_defconfig (arm, gcc-10) — PASS, 0 errors, 0 warnings, 0 section mismatches

--------------------------------------------------------------------------------
cu1000-neo_defconfig (mips, gcc-10) — PASS, 0 errors, 0 warnings, 0 section mismatches

--------------------------------------------------------------------------------
cu1830-neo_defconfig (mips, gcc-10) — PASS, 0 errors, 0 warnings, 0 section mismatches

--------------------------------------------------------------------------------
davinci_all_defconfig (arm, gcc-10) — PASS, 0 errors, 0 warnings, 0 section mismatches

--------------------------------------------------------------------------------
db1xxx_defconfig (mips, gcc-10) — PASS, 0 errors, 0 warnings, 0 section mismatches

--------------------------------------------------------------------------------
decstation_64_defconfig (mips, gcc-10) — PASS, 0 errors, 1 warning, 0 section mismatches

Warnings:
kernel/rcu/tasks.h:707:13: warning: ‘show_rcu_tasks_rude_gp_kthread’ defined but not used [-Wunused-function]

--------------------------------------------------------------------------------
decstation_defconfig (mips, gcc-10) — PASS, 0 errors, 1 warning, 0 section mismatches

Warnings:
kernel/rcu/tasks.h:707:13: warning: ‘show_rcu_tasks_rude_gp_kthread’ defined but not used [-Wunused-function]

--------------------------------------------------------------------------------
decstation_r4k_defconfig (mips, gcc-10) — PASS, 0 errors, 1 warning, 0 section mismatches

Warnings:
kernel/rcu/tasks.h:707:13: warning: ‘show_rcu_tasks_rude_gp_kthread’ defined but not used [-Wunused-function]

--------------------------------------------------------------------------------
defconfig (arm64, gcc-10) — PASS, 0 errors, 0 warnings, 0 section mismatches

--------------------------------------------------------------------------------
defconfig (riscv, gcc-10) — PASS, 0 errors, 0 warnings, 0 section mismatches

--------------------------------------------------------------------------------
defconfig+arm64-chromebook (arm64, gcc-10) — PASS, 0 errors, 0 warnings, 0 section mismatches

--------------------------------------------------------------------------------
defconfig+arm64-chromebook+kselftest (arm64, gcc-10) — PASS, 0 errors, 0 warnings, 0 section mismatches

--------------------------------------------------------------------------------
defconfig+kselftest (arm64, gcc-10) — PASS, 0 errors, 0 warnings, 0 section mismatches

--------------------------------------------------------------------------------
dove_defconfig (arm, gcc-10) — PASS, 0 errors, 0 warnings, 0 section mismatches

--------------------------------------------------------------------------------
e55_defconfig (mips, gcc-10) — PASS, 0 errors, 0 warnings, 0 section mismatches

--------------------------------------------------------------------------------
ebsa110_defconfig (arm, gcc-10) — PASS, 0 errors, 0 warnings, 0 section mismatches

--------------------------------------------------------------------------------
efm32_defconfig (arm, gcc-10) — PASS, 0 errors, 0 warnings, 0 section mismatches

--------------------------------------------------------------------------------
ep93xx_defconfig (arm, gcc-10) — PASS, 0 errors, 0 warnings, 0 section mismatches

Section mismatches:
WARNING: modpost: vmlinux.o(.text+0x8054): Section mismatch in reference from the function __arm_ioremap_pfn_caller() to the function .meminit.text:memblock_is_map_memory()

--------------------------------------------------------------------------------
eseries_pxa_defconfig (arm, gcc-10) — PASS, 0 errors, 0 warnings, 0 section mismatches

--------------------------------------------------------------------------------
exynos_defconfig (arm, gcc-10) — PASS, 0 errors, 0 warnings, 0 section mismatches

--------------------------------------------------------------------------------
ezx_defconfig (arm, gcc-10) — PASS, 0 errors, 0 warnings, 0 section mismatches

--------------------------------------------------------------------------------
footbridge_defconfig (arm, gcc-10) — PASS, 0 errors, 0 warnings, 0 section mismatches

--------------------------------------------------------------------------------
fuloong2e_defconfig (mips, gcc-10) — PASS, 0 errors, 0 warnings, 0 section mismatches

--------------------------------------------------------------------------------
gcw0_defconfig (mips, gcc-10) — PASS, 0 errors, 0 warnings, 0 section mismatches

--------------------------------------------------------------------------------
gemini_defconfig (arm, gcc-10) — PASS, 0 errors, 0 warnings, 0 section mismatches

--------------------------------------------------------------------------------
gpr_defconfig (mips, gcc-10) — PASS, 0 errors, 0 warnings, 0 section mismatches

--------------------------------------------------------------------------------
h3600_defconfig (arm, gcc-10) — PASS, 0 errors, 0 warnings, 0 section mismatches

Section mismatches:
WARNING: modpost: vmlinux.o(.text+0xcb84): Section mismatch in reference from the function __arm_ioremap_pfn_caller() to the function .meminit.text:memblock_is_map_memory()

--------------------------------------------------------------------------------
h5000_defconfig (arm, gcc-10) — PASS, 0 errors, 0 warnings, 0 section mismatches

--------------------------------------------------------------------------------
hackkit_defconfig (arm, gcc-10) — PASS, 0 errors, 0 warnings, 0 section mismatches

Section mismatches:
WARNING: modpost: vmlinux.o(.text+0xce9c): Section mismatch in reference from the function __arm_ioremap_pfn_caller() to the function .meminit.text:memblock_is_map_memory()

--------------------------------------------------------------------------------
haps_hs_defconfig (arc, gcc-10) — PASS, 0 errors, 0 warnings, 0 section mismatches

--------------------------------------------------------------------------------
haps_hs_smp_defconfig (arc, gcc-10) — PASS, 0 errors, 0 warnings, 0 section mismatches

--------------------------------------------------------------------------------
hisi_defconfig (arm, gcc-10) — PASS, 0 errors, 0 warnings, 0 section mismatches

--------------------------------------------------------------------------------
hsdk_defconfig (arc, gcc-10) — PASS, 0 errors, 0 warnings, 0 section mismatches

--------------------------------------------------------------------------------
i386_defconfig (i386, gcc-10) — PASS, 0 errors, 0 warnings, 0 section mismatches

--------------------------------------------------------------------------------
imote2_defconfig (arm, gcc-10) — PASS, 0 errors, 0 warnings, 0 section mismatches

--------------------------------------------------------------------------------
imx_v4_v5_defconfig (arm, gcc-10) — PASS, 0 errors, 0 warnings, 0 section mismatches

--------------------------------------------------------------------------------
imx_v6_v7_defconfig (arm, gcc-10) — PASS, 0 errors, 0 warnings, 0 section mismatches

--------------------------------------------------------------------------------
integrator_defconfig (arm, gcc-10) — PASS, 0 errors, 0 warnings, 0 section mismatches

--------------------------------------------------------------------------------
iop32x_defconfig (arm, gcc-10) — PASS, 0 errors, 0 warnings, 0 section mismatches

--------------------------------------------------------------------------------
ip22_defconfig (mips, gcc-10) — PASS, 0 errors, 0 warnings, 0 section mismatches

--------------------------------------------------------------------------------
ip27_defconfig (mips, gcc-10) — FAIL, 0 errors, 0 warnings, 0 section mismatches

--------------------------------------------------------------------------------
ip28_defconfig (mips, gcc-10) — FAIL, 0 errors, 0 warnings, 0 section mismatches

--------------------------------------------------------------------------------
ip32_defconfig (mips, gcc-10) — PASS, 0 errors, 0 warnings, 0 section mismatches

--------------------------------------------------------------------------------
ixp4xx_defconfig (arm, gcc-10) — PASS, 0 errors, 0 warnings, 0 section mismatches

--------------------------------------------------------------------------------
jazz_defconfig (mips, gcc-10) — PASS, 0 errors, 0 warnings, 0 section mismatches

--------------------------------------------------------------------------------
jmr3927_defconfig (mips, gcc-10) — PASS, 0 errors, 0 warnings, 0 section mismatches

--------------------------------------------------------------------------------
jornada720_defconfig (arm, gcc-10) — PASS, 0 errors, 0 warnings, 0 section mismatches

Section mismatches:
WARNING: modpost: vmlinux.o(.text+0xcaa8): Section mismatch in reference from the function __arm_ioremap_pfn_caller() to the function .meminit.text:memblock_is_map_memory()

--------------------------------------------------------------------------------
keystone_defconfig (arm, gcc-10) — PASS, 0 errors, 0 warnings, 0 section mismatches

--------------------------------------------------------------------------------
lart_defconfig (arm, gcc-10) — PASS, 0 errors, 0 warnings, 0 section mismatches

Section mismatches:
WARNING: modpost: vmlinux.o(.text+0xcb74): Section mismatch in reference from the function __arm_ioremap_pfn_caller() to the function .meminit.text:memblock_is_map_memory()

--------------------------------------------------------------------------------
lemote2f_defconfig (mips, gcc-10) — PASS, 0 errors, 1 warning, 0 section mismatches

Warnings:
net/mac80211/mlme.c:4335:1: warning: the frame size of 1040 bytes is larger than 1024 bytes [-Wframe-larger-than=]

--------------------------------------------------------------------------------
loongson1b_defconfig (mips, gcc-10) — PASS, 0 errors, 0 warnings, 0 section mismatches

--------------------------------------------------------------------------------
loongson1c_defconfig (mips, gcc-10) — PASS, 0 errors, 0 warnings, 0 section mismatches

--------------------------------------------------------------------------------
loongson3_defconfig (mips, gcc-10) — PASS, 0 errors, 0 warnings, 0 section mismatches

--------------------------------------------------------------------------------
lpc18xx_defconfig (arm, gcc-10) — PASS, 0 errors, 0 warnings, 0 section mismatches

--------------------------------------------------------------------------------
lpc32xx_defconfig (arm, gcc-10) — PASS, 0 errors, 0 warnings, 0 section mismatches

--------------------------------------------------------------------------------
lpd270_defconfig (arm, gcc-10) — PASS, 0 errors, 0 warnings, 0 section mismatches

--------------------------------------------------------------------------------
lubbock_defconfig (arm, gcc-10) — PASS, 0 errors, 0 warnings, 0 section mismatches

--------------------------------------------------------------------------------
magician_defconfig (arm, gcc-10) — PASS, 0 errors, 0 warnings, 0 section mismatches

--------------------------------------------------------------------------------
mainstone_defconfig (arm, gcc-10) — PASS, 0 errors, 0 warnings, 0 section mismatches

--------------------------------------------------------------------------------
malta_defconfig (mips, gcc-10) — PASS, 0 errors, 0 warnings, 0 section mismatches

--------------------------------------------------------------------------------
malta_kvm_defconfig (mips, gcc-10) — PASS, 0 errors, 0 warnings, 0 section mismatches

--------------------------------------------------------------------------------
malta_kvm_guest_defconfig (mips, gcc-10) — PASS, 0 errors, 0 warnings, 0 section mismatches

--------------------------------------------------------------------------------
malta_qemu_32r6_defconfig (mips, gcc-10) — PASS, 0 errors, 0 warnings, 0 section mismatches

--------------------------------------------------------------------------------
maltaaprp_defconfig (mips, gcc-10) — PASS, 0 errors, 0 warnings, 0 section mismatches

--------------------------------------------------------------------------------
maltasmvp_defconfig (mips, gcc-10) — PASS, 0 errors, 0 warnings, 0 section mismatches

--------------------------------------------------------------------------------
maltasmvp_eva_defconfig (mips, gcc-10) — PASS, 0 errors, 0 warnings, 0 section mismatches

--------------------------------------------------------------------------------
maltaup_defconfig (mips, gcc-10) — PASS, 0 errors, 0 warnings, 0 section mismatches

--------------------------------------------------------------------------------
maltaup_xpa_defconfig (mips, gcc-10) — PASS, 0 errors, 0 warnings, 0 section mismatches

--------------------------------------------------------------------------------
milbeaut_m10v_defconfig (arm, gcc-10) — PASS, 0 errors, 0 warnings, 0 section mismatches

--------------------------------------------------------------------------------
mini2440_defconfig (arm, gcc-10) — PASS, 0 errors, 0 warnings, 0 section mismatches

--------------------------------------------------------------------------------
mmp2_defconfig (arm, gcc-10) — PASS, 0 errors, 0 warnings, 0 section mismatches

--------------------------------------------------------------------------------
moxart_defconfig (arm, gcc-10) — PASS, 0 errors, 0 warnings, 0 section mismatches

--------------------------------------------------------------------------------
mpc30x_defconfig (mips, gcc-10) — PASS, 0 errors, 0 warnings, 0 section mismatches

--------------------------------------------------------------------------------
mps2_defconfig (arm, gcc-10) — PASS, 0 errors, 0 warnings, 0 section mismatches

--------------------------------------------------------------------------------
mtx1_defconfig (mips, gcc-10) — PASS, 0 errors, 0 warnings, 0 section mismatches

--------------------------------------------------------------------------------
multi_v4t_defconfig (arm, gcc-10) — PASS, 0 errors, 0 warnings, 0 section mismatches

--------------------------------------------------------------------------------
multi_v5_defconfig (arm, gcc-10) — PASS, 0 errors, 0 warnings, 0 section mismatches

--------------------------------------------------------------------------------
multi_v7_defconfig (arm, gcc-10) — PASS, 0 errors, 0 warnings, 0 section mismatches

--------------------------------------------------------------------------------
multi_v7_defconfig+kselftest (arm, gcc-10) — PASS, 0 errors, 0 warnings, 0 section mismatches

--------------------------------------------------------------------------------
mvebu_v5_defconfig (arm, gcc-10) — PASS, 0 errors, 0 warnings, 0 section mismatches

--------------------------------------------------------------------------------
mvebu_v7_defconfig (arm, gcc-10) — PASS, 0 errors, 0 warnings, 0 section mismatches

--------------------------------------------------------------------------------
mxs_defconfig (arm, gcc-10) — PASS, 0 errors, 0 warnings, 0 section mismatches

--------------------------------------------------------------------------------
neponset_defconfig (arm, gcc-10) — PASS, 0 errors, 0 warnings, 0 section mismatches

Section mismatches:
WARNING: modpost: vmlinux.o(.text+0xcda4): Section mismatch in reference from the function __arm_ioremap_pfn_caller() to the function .meminit.text:memblock_is_map_memory()

--------------------------------------------------------------------------------
netwinder_defconfig (arm, gcc-10) — PASS, 0 errors, 0 warnings, 0 section mismatches

--------------------------------------------------------------------------------
nhk8815_defconfig (arm, gcc-10) — PASS, 0 errors, 0 warnings, 0 section mismatches

--------------------------------------------------------------------------------
nlm_xlp_defconfig (mips, gcc-10) — PASS, 0 errors, 0 warnings, 0 section mismatches

--------------------------------------------------------------------------------
nlm_xlr_defconfig (mips, gcc-10) — PASS, 0 errors, 0 warnings, 0 section mismatches

--------------------------------------------------------------------------------
nommu_k210_defconfig (riscv, gcc-10) — PASS, 0 errors, 0 warnings, 0 section mismatches

--------------------------------------------------------------------------------
nsimosci_hs_defconfig (arc, gcc-10) — PASS, 0 errors, 0 warnings, 0 section mismatches

--------------------------------------------------------------------------------
nsimosci_hs_smp_defconfig (arc, gcc-10) — PASS, 0 errors, 0 warnings, 0 section mismatches

--------------------------------------------------------------------------------
omap1_defconfig (arm, gcc-10) — PASS, 0 errors, 0 warnings, 0 section mismatches

--------------------------------------------------------------------------------
omap2plus_defconfig (arm, gcc-10) — PASS, 0 errors, 0 warnings, 0 section mismatches

--------------------------------------------------------------------------------
omega2p_defconfig (mips, gcc-10) — PASS, 0 errors, 0 warnings, 0 section mismatches

--------------------------------------------------------------------------------
orion5x_defconfig (arm, gcc-10) — PASS, 0 errors, 0 warnings, 0 section mismatches

--------------------------------------------------------------------------------
oxnas_v6_defconfig (arm, gcc-10) — PASS, 0 errors, 0 warnings, 0 section mismatches

--------------------------------------------------------------------------------
palmz72_defconfig (arm, gcc-10) — PASS, 0 errors, 0 warnings, 0 section mismatches

--------------------------------------------------------------------------------
pcm027_defconfig (arm, gcc-10) — PASS, 0 errors, 0 warnings, 0 section mismatches

--------------------------------------------------------------------------------
pic32mzda_defconfig (mips, gcc-10) — PASS, 0 errors, 0 warnings, 0 section mismatches

--------------------------------------------------------------------------------
pistachio_defconfig (mips, gcc-10) — PASS, 0 errors, 0 warnings, 0 section mismatches

--------------------------------------------------------------------------------
pleb_defconfig (arm, gcc-10) — PASS, 0 errors, 0 warnings, 0 section mismatches

Section mismatches:
WARNING: modpost: vmlinux.o(.text+0xc8ec): Section mismatch in reference from the function __arm_ioremap_pfn_caller() to the function .meminit.text:memblock_is_map_memory()

--------------------------------------------------------------------------------
prima2_defconfig (arm, gcc-10) — PASS, 0 errors, 0 warnings, 0 section mismatches

--------------------------------------------------------------------------------
pxa168_defconfig (arm, gcc-10) — PASS, 0 errors, 0 warnings, 0 section mismatches

--------------------------------------------------------------------------------
pxa255-idp_defconfig (arm, gcc-10) — PASS, 0 errors, 0 warnings, 0 section mismatches

--------------------------------------------------------------------------------
pxa3xx_defconfig (arm, gcc-10) — PASS, 0 errors, 0 warnings, 0 section mismatches

--------------------------------------------------------------------------------
pxa910_defconfig (arm, gcc-10) — PASS, 0 errors, 0 warnings, 0 section mismatches

--------------------------------------------------------------------------------
pxa_defconfig (arm, gcc-10) — PASS, 0 errors, 0 warnings, 0 section mismatches

--------------------------------------------------------------------------------
qcom_defconfig (arm, gcc-10) — PASS, 0 errors, 0 warnings, 0 section mismatches

--------------------------------------------------------------------------------
qi_lb60_defconfig (mips, gcc-10) — PASS, 0 errors, 0 warnings, 0 section mismatches

--------------------------------------------------------------------------------
rb532_defconfig (mips, gcc-10) — PASS, 0 errors, 0 warnings, 0 section mismatches

--------------------------------------------------------------------------------
rbtx49xx_defconfig (mips, gcc-10) — PASS, 0 errors, 0 warnings, 0 section mismatches

--------------------------------------------------------------------------------
realview_defconfig (arm, gcc-10) — PASS, 0 errors, 0 warnings, 0 section mismatches

--------------------------------------------------------------------------------
rm200_defconfig (mips, gcc-10) — PASS, 0 errors, 1 warning, 0 section mismatches

Warnings:
drivers/block/paride/bpck.c:32: warning: "PC" redefined

--------------------------------------------------------------------------------
rpc_defconfig (arm, gcc-10) — FAIL, 4 errors, 0 warnings, 0 section mismatches

Errors:
arm-linux-gnueabihf-gcc: error: unrecognized -march target: armv3m
arm-linux-gnueabihf-gcc: error: missing argument to ‘-march=’
arm-linux-gnueabihf-gcc: error: unrecognized -march target: armv3m
arm-linux-gnueabihf-gcc: error: missing argument to ‘-march=’

--------------------------------------------------------------------------------
rs90_defconfig (mips, gcc-10) — PASS, 0 errors, 0 warnings, 0 section mismatches

--------------------------------------------------------------------------------
rt305x_defconfig (mips, gcc-10) — PASS, 0 errors, 0 warnings, 0 section mismatches

--------------------------------------------------------------------------------
rv32_defconfig (riscv, gcc-10) — PASS, 0 errors, 4 warnings, 0 section mismatches

Warnings:
<stdin>:830:2: warning: #warning syscall fstat64 not implemented [-Wcpp]
<stdin>:1127:2: warning: #warning syscall fstatat64 not implemented [-Wcpp]
<stdin>:830:2: warning: #warning syscall fstat64 not implemented [-Wcpp]
<stdin>:1127:2: warning: #warning syscall fstatat64 not implemented [-Wcpp]

--------------------------------------------------------------------------------
s3c2410_defconfig (arm, gcc-10) — PASS, 0 errors, 0 warnings, 0 section mismatches

--------------------------------------------------------------------------------
s3c6400_defconfig (arm, gcc-10) — PASS, 0 errors, 0 warnings, 0 section mismatches

--------------------------------------------------------------------------------
s5pv210_defconfig (arm, gcc-10) — PASS, 0 errors, 0 warnings, 0 section mismatches

--------------------------------------------------------------------------------
sama5_defconfig (arm, gcc-10) — PASS, 0 errors, 0 warnings, 0 section mismatches

--------------------------------------------------------------------------------
sb1250_swarm_defconfig (mips, gcc-10) — PASS, 0 errors, 0 warnings, 0 section mismatches

--------------------------------------------------------------------------------
shannon_defconfig (arm, gcc-10) — PASS, 0 errors, 0 warnings, 0 section mismatches

Section mismatches:
WARNING: modpost: vmlinux.o(.text+0xcb4c): Section mismatch in reference from the function __arm_ioremap_pfn_caller() to the function .meminit.text:memblock_is_map_memory()

--------------------------------------------------------------------------------
shmobile_defconfig (arm, gcc-10) — PASS, 0 errors, 0 warnings, 0 section mismatches

--------------------------------------------------------------------------------
simpad_defconfig (arm, gcc-10) — PASS, 0 errors, 0 warnings, 0 section mismatches

Section mismatches:
WARNING: modpost: vmlinux.o(.text+0xd040): Section mismatch in reference from the function __arm_ioremap_pfn_caller() to the function .meminit.text:memblock_is_map_memory()

--------------------------------------------------------------------------------
socfpga_defconfig (arm, gcc-10) — PASS, 0 errors, 0 warnings, 0 section mismatches

--------------------------------------------------------------------------------
spear13xx_defconfig (arm, gcc-10) — PASS, 0 errors, 0 warnings, 0 section mismatches

--------------------------------------------------------------------------------
spear3xx_defconfig (arm, gcc-10) — PASS, 0 errors, 0 warnings, 0 section mismatches

--------------------------------------------------------------------------------
spear6xx_defconfig (arm, gcc-10) — PASS, 0 errors, 0 warnings, 0 section mismatches

--------------------------------------------------------------------------------
spitz_defconfig (arm, gcc-10) — PASS, 0 errors, 0 warnings, 0 section mismatches

--------------------------------------------------------------------------------
stm32_defconfig (arm, gcc-10) — PASS, 0 errors, 0 warnings, 0 section mismatches

--------------------------------------------------------------------------------
sunxi_defconfig (arm, gcc-10) — PASS, 0 errors, 0 warnings, 0 section mismatches

--------------------------------------------------------------------------------
tango4_defconfig (arm, gcc-10) — PASS, 0 errors, 0 warnings, 0 section mismatches

--------------------------------------------------------------------------------
tb0219_defconfig (mips, gcc-10) — PASS, 0 errors, 0 warnings, 0 section mismatches

--------------------------------------------------------------------------------
tb0226_defconfig (mips, gcc-10) — PASS, 0 errors, 0 warnings, 0 section mismatches

--------------------------------------------------------------------------------
tb0287_defconfig (mips, gcc-10) — PASS, 0 errors, 0 warnings, 0 section mismatches

--------------------------------------------------------------------------------
tct_hammer_defconfig (arm, gcc-10) — PASS, 0 errors, 0 warnings, 0 section mismatches

--------------------------------------------------------------------------------
tegra_defconfig (arm, gcc-10) — PASS, 0 errors, 0 warnings, 0 section mismatches

--------------------------------------------------------------------------------
tinyconfig (arc, gcc-10) — PASS, 0 errors, 0 warnings, 0 section mismatches

--------------------------------------------------------------------------------
tinyconfig (x86_64, gcc-10) — PASS, 0 errors, 0 warnings, 0 section mismatches

--------------------------------------------------------------------------------
tinyconfig (i386, gcc-10) — PASS, 0 errors, 0 warnings, 0 section mismatches

--------------------------------------------------------------------------------
trizeps4_defconfig (arm, gcc-10) — PASS, 0 errors, 0 warnings, 0 section mismatches

--------------------------------------------------------------------------------
u300_defconfig (arm, gcc-10) — PASS, 0 errors, 0 warnings, 0 section mismatches

--------------------------------------------------------------------------------
u8500_defconfig (arm, gcc-10) — PASS, 0 errors, 0 warnings, 0 section mismatches

--------------------------------------------------------------------------------
vdk_hs38_defconfig (arc, gcc-10) — PASS, 0 errors, 0 warnings, 0 section mismatches

--------------------------------------------------------------------------------
vdk_hs38_smp_defconfig (arc, gcc-10) — PASS, 0 errors, 0 warnings, 0 section mismatches

--------------------------------------------------------------------------------
versatile_defconfig (arm, gcc-10) — PASS, 0 errors, 0 warnings, 0 section mismatches

--------------------------------------------------------------------------------
vexpress_defconfig (arm, gcc-10) — PASS, 0 errors, 0 warnings, 0 section mismatches

--------------------------------------------------------------------------------
vf610m4_defconfig (arm, gcc-10) — PASS, 0 errors, 0 warnings, 0 section mismatches

--------------------------------------------------------------------------------
viper_defconfig (arm, gcc-10) — PASS, 0 errors, 0 warnings, 0 section mismatches

--------------------------------------------------------------------------------
vocore2_defconfig (mips, gcc-10) — PASS, 0 errors, 0 warnings, 0 section mismatches

--------------------------------------------------------------------------------
vt8500_v6_v7_defconfig (arm, gcc-10) — PASS, 0 errors, 0 warnings, 0 section mismatches

--------------------------------------------------------------------------------
workpad_defconfig (mips, gcc-10) — PASS, 0 errors, 0 warnings, 0 section mismatches

--------------------------------------------------------------------------------
x86_64_defconfig (x86_64, gcc-10) — PASS, 0 errors, 0 warnings, 0 section mismatches

--------------------------------------------------------------------------------
x86_64_defconfig+kselftest (x86_64, gcc-10) — PASS, 0 errors, 0 warnings, 0 section mismatches

--------------------------------------------------------------------------------
x86_64_defconfig+x86-chromebook (x86_64, gcc-10) — PASS, 0 errors, 0 warnings, 0 section mismatches

--------------------------------------------------------------------------------
x86_64_defconfig+x86-chromebook+kselftest (x86_64, gcc-10) — PASS, 0 errors, 0 warnings, 0 section mismatches

--------------------------------------------------------------------------------
xcep_defconfig (arm, gcc-10) — PASS, 0 errors, 0 warnings, 0 section mismatches

--------------------------------------------------------------------------------
zeus_defconfig (arm, gcc-10) — PASS, 0 errors, 0 warnings, 0 section mismatches

--------------------------------------------------------------------------------
zx_defconfig (arm, gcc-10) — PASS, 0 errors, 0 warnings, 0 section mismatches

---
For more info write to <info@...>


Re: [PATCH] start-qemu.sh: Remove BOOT_FILES variable and call qemu directly in secure,swupdate and normal path

Jan Kiszka
 

On 03.03.22 15:45, Srinuvasan A wrote:
From: Srinuvasan A <srinuvasan_a@...>

Broke the normal boot part.
Fixed them.

-append takes arguments inside double quotes(""). If we escape
and pass the " along with the value the final command would form
like what we would expect.

qemu-system-x86_64 .... -append " root=/dev/sda console=ttyS0"

But when the shell parses it, due to how whitespace splitting works
for arguments passed via a variable, it parses the first quote(")
as argument 1 and root=dev/sda as argument 2 and messing up the
command.
It should ideally treat the whole " root=/dev/sda console=ttyS0" as
a single argument.

hence Maintaining argument splitting is complex. A simpler one for here is to
"Hence maintaining..."

avoid BOOT_FILES and unrole the actual qemu call with its different
kernels into the secure, swupdate and normal path.

Signed-off-by: Srinuvasan A <srinuvasan_a@...>
---
start-qemu.sh | 23 ++++++++++++++---------
1 file changed, 14 insertions(+), 9 deletions(-)

diff --git a/start-qemu.sh b/start-qemu.sh
index a7e0588..d19cd98 100755
--- a/start-qemu.sh
+++ b/start-qemu.sh
@@ -121,22 +121,27 @@ if [ -n "${SECURE_BOOT}" ]; then
-global ICH9-LPC.disable_s3=1 \
-global isa-fdc.driveA= "

- BOOT_FILES="-drive if=pflash,format=raw,unit=0,readonly=on,file=${ovmf_code} \
+ ${QEMU_PATH}${QEMU} \
+ -m 1G -serial mon:stdio -netdev user,id=net \
+ -drive if=pflash,format=raw,unit=0,readonly=on,file=${ovmf_code} \
-drive if=pflash,format=raw,file=${ovmf_vars} \
- -drive file=${IMAGE_PREFIX}.wic.img,discard=unmap,if=none,id=disk,format=raw"
+ -drive file=${IMAGE_PREFIX}.wic.img,discard=unmap,if=none,id=disk,format=raw ${QEMU_EXTRA_ARGS} "$@"
+
elif [ -n "${SWUPDATE_BOOT}" ]; then
- BOOT_FILES="-drive file=${IMAGE_PREFIX}.wic.img,discard=unmap,if=none,id=disk,format=raw \
- -bios OVMF.fd "
+ ${QEMU_PATH}${QEMU} \
+ -m 1G -serial mon:stdio -netdev user,id=net \
+ -drive file=${IMAGE_PREFIX}.wic.img,discard=unmap,if=none,id=disk,format=raw \
+ -bios OVMF.fd ${QEMU_EXTRA_ARGS} "$@"
+
else
IMAGE_FILE=$(ls ${IMAGE_PREFIX}.ext4.img)

KERNEL_FILE=$(ls ${IMAGE_PREFIX}-vmlinu* | tail -1)
INITRD_FILE=$(ls ${IMAGE_PREFIX}-initrd.img* | tail -1)

- BOOT_FILES="-drive file=${IMAGE_FILE},discard=unmap,if=none,id=disk,format=raw \
+ ${QEMU_PATH}${QEMU} \
+ -m 1G -serial mon:stdio -netdev user,id=net \
+ -drive file=${IMAGE_FILE},discard=unmap,if=none,id=disk,format=raw \
-kernel ${KERNEL_FILE} -append "${KERNEL_CMDLINE}" \
- -initrd ${INITRD_FILE}"
+ -initrd ${INITRD_FILE} ${QEMU_EXTRA_ARGS} "$@"
fi
-${QEMU_PATH}${QEMU} \
- -m 1G -serial mon:stdio -netdev user,id=net \
- ${BOOT_FILES} ${QEMU_EXTRA_ARGS} "$@"
Functionally fine, but your indention is not consistent (mostly tabs,
not not always).

When you do a v2, you could use that chance and factor out the common
arguments into a variable (-m 1G -serial mon:stdio -netdev user,id=net).

Jan

--
Siemens AG, Technology
Competence Center Embedded Linux

2501 - 2520 of 10169