Date   

[PATCH 5.10.y-cip 00/29] Add RSPI/OSTM/WDT/TSU/OPP support to Renesas RZ/G2L SoC

Lad Prabhakar
 

Hi All,

This patch series adds support for following to Renesas RZ/RGL SoC:
* RSPI
* WDT
* OSTM
* TSU/OPP/IPA

All the patches have been cherry-picked from v5.17 release.

Cheers,
Prabhakar

Andy Shevchenko (1):
units: Add SI metric prefix definitions

Biju Das (22):
clk: renesas: r9a07g044: Add WDT clock and reset entries
clk: renesas: r9a07g044: Rename CLK_PLL2_DIV16 and CLK_PLL2_DIV20
macros
dt-bindings: watchdog: renesas,wdt: Add support for RZ/G2L
watchdog: Add Watchdog Timer driver for RZ/G2L
clk: renesas: r9a07g044: Add OSTM clock and reset entries
dt-bindings: timer: renesas: ostm: Document Renesas RZ/G2L OSTM
reset: Add of_reset_control_get_optional_exclusive()
clocksource/drivers/renesas-ostm: Add RZ/G2L OSTM support
clocksource/drivers/renesas,ostm: Make RENESAS_OSTM symbol visible
arm64: dts: renesas: r9a07g044: Add OSTM nodes
arm64: dts: renesas: rzg2l-smarc-som: Enable OSTM
arm64: dts: renesas: r9a07g044: Add WDT nodes
arm64: dts: renesas: rzg2l-smarc-som: Enable watchdog
clk: renesas: r9a07g044: Change core clock "I" from DEF_FIXED->DEF_DIV
clk: renesas: r9a07g044: Add TSU clock and reset entry
clk: renesas: r9a07g044: Rename CLK_PLL3_DIV4 macro
clk: renesas: rzg2l: Add CPG_PL1_DDIV macro
dt-bindings: thermal: Document Renesas RZ/G2L TSU
thermal/drivers: Add TSU driver for RZ/G2L
arm64: dts: renesas: r9a07g044: Add OPP table
arm64: dts: renesas: r9a07g044: Add TSU node
arm64: dts: renesas: r9a07g044: Create thermal zone to support IPA

Lad Prabhakar (6):
clk: renesas: r9a07g044: Add RSPI clock and reset entries
spi: dt-bindings: renesas,rspi: Document RZ/G2L SoC
spi: spi-rspi: Add support to deassert/assert reset line
spi: spi-rspi: Drop redeclaring ret variable in qspi_transfer_in()
arm64: dts: renesas: r9a07g044: Add RSPI{0,1,2} nodes
arm64: dts: renesas: rzg2l-smarc: Enable RSPI1 on carrier board

.../devicetree/bindings/spi/renesas,rspi.yaml | 4 +-
.../bindings/thermal/rzg2l-thermal.yaml | 76 +++++
.../bindings/timer/renesas,ostm.yaml | 20 +-
.../bindings/watchdog/renesas,wdt.yaml | 75 +++--
arch/arm64/boot/dts/renesas/r9a07g044.dtsi | 199 +++++++++++++
.../boot/dts/renesas/rzg2l-smarc-som.dtsi | 23 ++
arch/arm64/boot/dts/renesas/rzg2l-smarc.dtsi | 14 +
drivers/clk/renesas/r9a07g044-cpg.c | 63 ++++-
drivers/clk/renesas/rzg2l-cpg.h | 2 +
drivers/clocksource/Kconfig | 3 +-
drivers/clocksource/renesas-ostm.c | 39 ++-
drivers/spi/spi-rspi.c | 27 +-
drivers/thermal/Kconfig | 9 +
drivers/thermal/Makefile | 1 +
drivers/thermal/rzg2l_thermal.c | 239 ++++++++++++++++
drivers/watchdog/Kconfig | 8 +
drivers/watchdog/Makefile | 1 +
drivers/watchdog/rzg2l_wdt.c | 263 ++++++++++++++++++
include/linux/reset.h | 20 ++
include/linux/units.h | 16 ++
20 files changed, 1068 insertions(+), 34 deletions(-)
create mode 100644 Documentation/devicetree/bindings/thermal/rzg2l-thermal.yaml
create mode 100644 drivers/thermal/rzg2l_thermal.c
create mode 100644 drivers/watchdog/rzg2l_wdt.c


base-commit: 05648080e85d797e727b8935406c2057c8a76637
--
2.17.1


cip-gitlab/ci/pavel/linux-test smc: 7 runs, 1 regressions (v4.4-st5-1479-ga84d0db6dfc6) #kernelci

kernelci.org bot <bot@...>
 

cip-gitlab/ci/pavel/linux-test smc: 7 runs, 1 regressions (v4.4-st5-1479-ga84d0db6dfc6)

Regressions Summary
-------------------

platform | arch | lab | compiler | defconfig | regressions
--------------------------+--------+---------------+----------+------------------------------+------------
hp-x360-12b-n4000-octopus | x86_64 | lab-collabora | gcc-10 | x86_64_defcon...6-chromebook | 1

Details: https://kernelci.org/test/job/cip-gitlab/branch/ci%2Fpavel%2Flinux-test/kernel/v4.4-st5-1479-ga84d0db6dfc6/plan/smc/

Test: smc
Tree: cip-gitlab
Branch: ci/pavel/linux-test
Describe: v4.4-st5-1479-ga84d0db6dfc6
URL: https://gitlab.com/cip-project/cip-kernel/linux-cip.git
SHA: a84d0db6dfc604c5de8b5446ea27ac9a039ae378


Test Regressions
----------------


platform | arch | lab | compiler | defconfig | regressions
--------------------------+--------+---------------+----------+------------------------------+------------
hp-x360-12b-n4000-octopus | x86_64 | lab-collabora | gcc-10 | x86_64_defcon...6-chromebook | 1

Details: https://kernelci.org/test/plan/id/624452633ac889106dae06f4

Results: 0 PASS, 1 FAIL, 0 SKIP
Full config: x86_64_defconfig+x86-chromebook
Compiler: gcc-10 (gcc (Debian 10.2.1-6) 10.2.1 20210110)
Plain log: https://storage.kernelci.org//cip-gitlab/ci-pavel-linux-test/v4.4-st5-1479-ga84d0db6dfc6/x86_64/x86_64_defconfig+x86-chromebook/gcc-10/lab-collabora/smc-hp-x360-12b-n4000-octopus.txt
HTML log: https://storage.kernelci.org//cip-gitlab/ci-pavel-linux-test/v4.4-st5-1479-ga84d0db6dfc6/x86_64/x86_64_defconfig+x86-chromebook/gcc-10/lab-collabora/smc-hp-x360-12b-n4000-octopus.html
Rootfs: http://storage.kernelci.org/images/rootfs/buildroot/buildroot-baseline/20220228.1/x86/rootfs.cpio.gz


* smc.login: https://kernelci.org/test/case/id/624452633ac889106dae06f5
failing since 13 days (last pass: v4.19.233-cip69-1019-g2e5815777e975, first fail: v4.4.302-18-ga78419826225)


cip-gitlab/ci/pavel/linux-test ltp-timers: 6 runs, 4 regressions (v4.4-st5-1479-ga84d0db6dfc6) #kernelci

kernelci.org bot <bot@...>
 

cip-gitlab/ci/pavel/linux-test ltp-timers: 6 runs, 4 regressions (v4.4-st5-1479-ga84d0db6dfc6)

Regressions Summary
-------------------

platform | arch | lab | compiler | defconfig | regressions
--------------------------+--------+---------------+----------+------------------------------+------------
asus-C433TA-AJ0005-rammus | x86_64 | lab-collabora | gcc-10 | x86_64_defcon...6-chromebook | 1
asus-C436FA-Flip-hatch | x86_64 | lab-collabora | gcc-10 | x86_64_defcon...6-chromebook | 1
asus-C523NA-A20057-coral | x86_64 | lab-collabora | gcc-10 | x86_64_defcon...6-chromebook | 1
hp-11A-G6-EE-grunt | x86_64 | lab-collabora | gcc-10 | x86_64_defcon...6-chromebook | 1

Details: https://kernelci.org/test/job/cip-gitlab/branch/ci%2Fpavel%2Flinux-test/kernel/v4.4-st5-1479-ga84d0db6dfc6/plan/ltp-timers/

Test: ltp-timers
Tree: cip-gitlab
Branch: ci/pavel/linux-test
Describe: v4.4-st5-1479-ga84d0db6dfc6
URL: https://gitlab.com/cip-project/cip-kernel/linux-cip.git
SHA: a84d0db6dfc604c5de8b5446ea27ac9a039ae378

Test suite revisions:
ltp-tests
URL: https://github.com/linux-test-project/ltp.git
SHA: dc836ec4cd4e02e1346001f828c1f1988a8d7d54


Test Regressions
----------------


platform | arch | lab | compiler | defconfig | regressions
--------------------------+--------+---------------+----------+------------------------------+------------
asus-C433TA-AJ0005-rammus | x86_64 | lab-collabora | gcc-10 | x86_64_defcon...6-chromebook | 1

Details: https://kernelci.org/test/plan/id/62444c934179fdedc7ae067c

Results: 0 PASS, 1 FAIL, 0 SKIP
Full config: x86_64_defconfig+x86-chromebook
Compiler: gcc-10 (gcc (Debian 10.2.1-6) 10.2.1 20210110)
Plain log: https://storage.kernelci.org//cip-gitlab/ci-pavel-linux-test/v4.4-st5-1479-ga84d0db6dfc6/x86_64/x86_64_defconfig+x86-chromebook/gcc-10/lab-collabora/ltp-timers-asus-C433TA-AJ0005-rammus.txt
HTML log: https://storage.kernelci.org//cip-gitlab/ci-pavel-linux-test/v4.4-st5-1479-ga84d0db6dfc6/x86_64/x86_64_defconfig+x86-chromebook/gcc-10/lab-collabora/ltp-timers-asus-C433TA-AJ0005-rammus.html
Rootfs: http://storage.kernelci.org/images/rootfs/debian/bullseye-ltp/20220311.1/amd64/initrd.cpio.gz


* ltp-timers.login: https://kernelci.org/test/case/id/62444c944179fdedc7ae067d
failing since 13 days (last pass: v4.19.233-cip69-1019-g2e5815777e975, first fail: v4.4.302-18-ga78419826225)



platform | arch | lab | compiler | defconfig | regressions
--------------------------+--------+---------------+----------+------------------------------+------------
asus-C436FA-Flip-hatch | x86_64 | lab-collabora | gcc-10 | x86_64_defcon...6-chromebook | 1

Details: https://kernelci.org/test/plan/id/62444e161422445cd4ae06ac

Results: 0 PASS, 1 FAIL, 0 SKIP
Full config: x86_64_defconfig+x86-chromebook
Compiler: gcc-10 (gcc (Debian 10.2.1-6) 10.2.1 20210110)
Plain log: https://storage.kernelci.org//cip-gitlab/ci-pavel-linux-test/v4.4-st5-1479-ga84d0db6dfc6/x86_64/x86_64_defconfig+x86-chromebook/gcc-10/lab-collabora/ltp-timers-asus-C436FA-Flip-hatch.txt
HTML log: https://storage.kernelci.org//cip-gitlab/ci-pavel-linux-test/v4.4-st5-1479-ga84d0db6dfc6/x86_64/x86_64_defconfig+x86-chromebook/gcc-10/lab-collabora/ltp-timers-asus-C436FA-Flip-hatch.html
Rootfs: http://storage.kernelci.org/images/rootfs/debian/bullseye-ltp/20220311.1/amd64/initrd.cpio.gz


* ltp-timers.login: https://kernelci.org/test/case/id/62444e161422445cd4ae06ad
failing since 15 days (last pass: v5.10.100-cip2-319-g7182f5032311, first fail: v4.19.233-cip69-1019-g2e5815777e975)



platform | arch | lab | compiler | defconfig | regressions
--------------------------+--------+---------------+----------+------------------------------+------------
asus-C523NA-A20057-coral | x86_64 | lab-collabora | gcc-10 | x86_64_defcon...6-chromebook | 1

Details: https://kernelci.org/test/plan/id/62449b16cb4e584977ae0695

Results: 0 PASS, 1 FAIL, 0 SKIP
Full config: x86_64_defconfig+x86-chromebook
Compiler: gcc-10 (gcc (Debian 10.2.1-6) 10.2.1 20210110)
Plain log: https://storage.kernelci.org//cip-gitlab/ci-pavel-linux-test/v4.4-st5-1479-ga84d0db6dfc6/x86_64/x86_64_defconfig+x86-chromebook/gcc-10/lab-collabora/ltp-timers-asus-C523NA-A20057-coral.txt
HTML log: https://storage.kernelci.org//cip-gitlab/ci-pavel-linux-test/v4.4-st5-1479-ga84d0db6dfc6/x86_64/x86_64_defconfig+x86-chromebook/gcc-10/lab-collabora/ltp-timers-asus-C523NA-A20057-coral.html
Rootfs: http://storage.kernelci.org/images/rootfs/debian/bullseye-ltp/20220311.1/amd64/initrd.cpio.gz


* ltp-timers.login: https://kernelci.org/test/case/id/62449b16cb4e584977ae0696
failing since 14 days (last pass: v4.19.233-cip69-1019-g2e5815777e975, first fail: v4.4.302-18-ga78419826225)



platform | arch | lab | compiler | defconfig | regressions
--------------------------+--------+---------------+----------+------------------------------+------------
hp-11A-G6-EE-grunt | x86_64 | lab-collabora | gcc-10 | x86_64_defcon...6-chromebook | 1

Details: https://kernelci.org/test/plan/id/62445044dccbf70f43ae0697

Results: 0 PASS, 1 FAIL, 0 SKIP
Full config: x86_64_defconfig+x86-chromebook
Compiler: gcc-10 (gcc (Debian 10.2.1-6) 10.2.1 20210110)
Plain log: https://storage.kernelci.org//cip-gitlab/ci-pavel-linux-test/v4.4-st5-1479-ga84d0db6dfc6/x86_64/x86_64_defconfig+x86-chromebook/gcc-10/lab-collabora/ltp-timers-hp-11A-G6-EE-grunt.txt
HTML log: https://storage.kernelci.org//cip-gitlab/ci-pavel-linux-test/v4.4-st5-1479-ga84d0db6dfc6/x86_64/x86_64_defconfig+x86-chromebook/gcc-10/lab-collabora/ltp-timers-hp-11A-G6-EE-grunt.html
Rootfs: http://storage.kernelci.org/images/rootfs/debian/bullseye-ltp/20220311.1/amd64/initrd.cpio.gz


* ltp-timers.login: https://kernelci.org/test/case/id/62445044dccbf70f43ae0698
failing since 13 days (last pass: v4.19.233-cip69-1019-g2e5815777e975, first fail: v4.4.302-18-ga78419826225)


cip-gitlab/ci/pavel/linux-test ltp-pty: 3 runs, 3 regressions (v4.4-st5-1479-ga84d0db6dfc6) #kernelci

kernelci.org bot <bot@...>
 

cip-gitlab/ci/pavel/linux-test ltp-pty: 3 runs, 3 regressions (v4.4-st5-1479-ga84d0db6dfc6)

Regressions Summary
-------------------

platform | arch | lab | compiler | defconfig | regressions
--------------------------+--------+---------------+----------+------------------------------+------------
asus-C433TA-AJ0005-rammus | x86_64 | lab-collabora | gcc-10 | x86_64_defcon...6-chromebook | 1
asus-C523NA-A20057-coral | x86_64 | lab-collabora | gcc-10 | x86_64_defcon...6-chromebook | 1
hp-11A-G6-EE-grunt | x86_64 | lab-collabora | gcc-10 | x86_64_defcon...6-chromebook | 1

Details: https://kernelci.org/test/job/cip-gitlab/branch/ci%2Fpavel%2Flinux-test/kernel/v4.4-st5-1479-ga84d0db6dfc6/plan/ltp-pty/

Test: ltp-pty
Tree: cip-gitlab
Branch: ci/pavel/linux-test
Describe: v4.4-st5-1479-ga84d0db6dfc6
URL: https://gitlab.com/cip-project/cip-kernel/linux-cip.git
SHA: a84d0db6dfc604c5de8b5446ea27ac9a039ae378

Test suite revisions:
ltp-tests
URL: https://github.com/linux-test-project/ltp.git
SHA: dc836ec4cd4e02e1346001f828c1f1988a8d7d54


Test Regressions
----------------


platform | arch | lab | compiler | defconfig | regressions
--------------------------+--------+---------------+----------+------------------------------+------------
asus-C433TA-AJ0005-rammus | x86_64 | lab-collabora | gcc-10 | x86_64_defcon...6-chromebook | 1

Details: https://kernelci.org/test/plan/id/62444c222490af9670ae068e

Results: 0 PASS, 1 FAIL, 0 SKIP
Full config: x86_64_defconfig+x86-chromebook
Compiler: gcc-10 (gcc (Debian 10.2.1-6) 10.2.1 20210110)
Plain log: https://storage.kernelci.org//cip-gitlab/ci-pavel-linux-test/v4.4-st5-1479-ga84d0db6dfc6/x86_64/x86_64_defconfig+x86-chromebook/gcc-10/lab-collabora/ltp-pty-asus-C433TA-AJ0005-rammus.txt
HTML log: https://storage.kernelci.org//cip-gitlab/ci-pavel-linux-test/v4.4-st5-1479-ga84d0db6dfc6/x86_64/x86_64_defconfig+x86-chromebook/gcc-10/lab-collabora/ltp-pty-asus-C433TA-AJ0005-rammus.html
Rootfs: http://storage.kernelci.org/images/rootfs/debian/bullseye-ltp/20220311.1/amd64/initrd.cpio.gz


* ltp-pty.login: https://kernelci.org/test/case/id/62444c222490af9670ae068f
failing since 13 days (last pass: v4.19.233-cip69-1019-g2e5815777e975, first fail: v4.4.302-18-ga78419826225)



platform | arch | lab | compiler | defconfig | regressions
--------------------------+--------+---------------+----------+------------------------------+------------
asus-C523NA-A20057-coral | x86_64 | lab-collabora | gcc-10 | x86_64_defcon...6-chromebook | 1

Details: https://kernelci.org/test/plan/id/62449aa74c5ee46efdae0697

Results: 0 PASS, 1 FAIL, 0 SKIP
Full config: x86_64_defconfig+x86-chromebook
Compiler: gcc-10 (gcc (Debian 10.2.1-6) 10.2.1 20210110)
Plain log: https://storage.kernelci.org//cip-gitlab/ci-pavel-linux-test/v4.4-st5-1479-ga84d0db6dfc6/x86_64/x86_64_defconfig+x86-chromebook/gcc-10/lab-collabora/ltp-pty-asus-C523NA-A20057-coral.txt
HTML log: https://storage.kernelci.org//cip-gitlab/ci-pavel-linux-test/v4.4-st5-1479-ga84d0db6dfc6/x86_64/x86_64_defconfig+x86-chromebook/gcc-10/lab-collabora/ltp-pty-asus-C523NA-A20057-coral.html
Rootfs: http://storage.kernelci.org/images/rootfs/debian/bullseye-ltp/20220311.1/amd64/initrd.cpio.gz


* ltp-pty.login: https://kernelci.org/test/case/id/62449aa74c5ee46efdae0698
failing since 14 days (last pass: v4.19.233-cip69-1019-g2e5815777e975, first fail: v4.4.302-18-ga78419826225)



platform | arch | lab | compiler | defconfig | regressions
--------------------------+--------+---------------+----------+------------------------------+------------
hp-11A-G6-EE-grunt | x86_64 | lab-collabora | gcc-10 | x86_64_defcon...6-chromebook | 1

Details: https://kernelci.org/test/plan/id/624455ec0748f7cdd0ae0696

Results: 0 PASS, 1 FAIL, 0 SKIP
Full config: x86_64_defconfig+x86-chromebook
Compiler: gcc-10 (gcc (Debian 10.2.1-6) 10.2.1 20210110)
Plain log: https://storage.kernelci.org//cip-gitlab/ci-pavel-linux-test/v4.4-st5-1479-ga84d0db6dfc6/x86_64/x86_64_defconfig+x86-chromebook/gcc-10/lab-collabora/ltp-pty-hp-11A-G6-EE-grunt.txt
HTML log: https://storage.kernelci.org//cip-gitlab/ci-pavel-linux-test/v4.4-st5-1479-ga84d0db6dfc6/x86_64/x86_64_defconfig+x86-chromebook/gcc-10/lab-collabora/ltp-pty-hp-11A-G6-EE-grunt.html
Rootfs: http://storage.kernelci.org/images/rootfs/debian/bullseye-ltp/20220311.1/amd64/initrd.cpio.gz


* ltp-pty.login: https://kernelci.org/test/case/id/624455ec0748f7cdd0ae0697
failing since 14 days (last pass: v4.19.233-cip69-1019-g2e5815777e975, first fail: v4.4.302-18-ga78419826225)


cip-gitlab/ci/pavel/linux-test ltp-mm: 4 runs, 4 regressions (v4.4-st5-1479-ga84d0db6dfc6) #kernelci

kernelci.org bot <bot@...>
 

cip-gitlab/ci/pavel/linux-test ltp-mm: 4 runs, 4 regressions (v4.4-st5-1479-ga84d0db6dfc6)

Regressions Summary
-------------------

platform | arch | lab | compiler | defconfig | regressions
--------------------------+--------+---------------+----------+------------------------------+------------
asus-C436FA-Flip-hatch | x86_64 | lab-collabora | gcc-10 | x86_64_defcon...6-chromebook | 1
asus-C523NA-A20057-coral | x86_64 | lab-collabora | gcc-10 | x86_64_defcon...6-chromebook | 1
hp-11A-G6-EE-grunt | x86_64 | lab-collabora | gcc-10 | x86_64_defcon...6-chromebook | 1
hp-x360-12b-n4000-octopus | x86_64 | lab-collabora | gcc-10 | x86_64_defcon...6-chromebook | 1

Details: https://kernelci.org/test/job/cip-gitlab/branch/ci%2Fpavel%2Flinux-test/kernel/v4.4-st5-1479-ga84d0db6dfc6/plan/ltp-mm/

Test: ltp-mm
Tree: cip-gitlab
Branch: ci/pavel/linux-test
Describe: v4.4-st5-1479-ga84d0db6dfc6
URL: https://gitlab.com/cip-project/cip-kernel/linux-cip.git
SHA: a84d0db6dfc604c5de8b5446ea27ac9a039ae378

Test suite revisions:
ltp-tests
URL: https://github.com/linux-test-project/ltp.git
SHA: dc836ec4cd4e02e1346001f828c1f1988a8d7d54


Test Regressions
----------------


platform | arch | lab | compiler | defconfig | regressions
--------------------------+--------+---------------+----------+------------------------------+------------
asus-C436FA-Flip-hatch | x86_64 | lab-collabora | gcc-10 | x86_64_defcon...6-chromebook | 1

Details: https://kernelci.org/test/plan/id/62444efc47ea5390bfae067f

Results: 0 PASS, 1 FAIL, 0 SKIP
Full config: x86_64_defconfig+x86-chromebook
Compiler: gcc-10 (gcc (Debian 10.2.1-6) 10.2.1 20210110)
Plain log: https://storage.kernelci.org//cip-gitlab/ci-pavel-linux-test/v4.4-st5-1479-ga84d0db6dfc6/x86_64/x86_64_defconfig+x86-chromebook/gcc-10/lab-collabora/ltp-mm-asus-C436FA-Flip-hatch.txt
HTML log: https://storage.kernelci.org//cip-gitlab/ci-pavel-linux-test/v4.4-st5-1479-ga84d0db6dfc6/x86_64/x86_64_defconfig+x86-chromebook/gcc-10/lab-collabora/ltp-mm-asus-C436FA-Flip-hatch.html
Rootfs: http://storage.kernelci.org/images/rootfs/debian/bullseye-ltp/20220311.1/amd64/initrd.cpio.gz


* ltp-mm.login: https://kernelci.org/test/case/id/62444efc47ea5390bfae0680
failing since 15 days (last pass: v5.10.100-cip2-319-g7182f5032311, first fail: v4.19.233-cip69-1019-g2e5815777e975)



platform | arch | lab | compiler | defconfig | regressions
--------------------------+--------+---------------+----------+------------------------------+------------
asus-C523NA-A20057-coral | x86_64 | lab-collabora | gcc-10 | x86_64_defcon...6-chromebook | 1

Details: https://kernelci.org/test/plan/id/624499fc0606c9c71cae0687

Results: 0 PASS, 1 FAIL, 0 SKIP
Full config: x86_64_defconfig+x86-chromebook
Compiler: gcc-10 (gcc (Debian 10.2.1-6) 10.2.1 20210110)
Plain log: https://storage.kernelci.org//cip-gitlab/ci-pavel-linux-test/v4.4-st5-1479-ga84d0db6dfc6/x86_64/x86_64_defconfig+x86-chromebook/gcc-10/lab-collabora/ltp-mm-asus-C523NA-A20057-coral.txt
HTML log: https://storage.kernelci.org//cip-gitlab/ci-pavel-linux-test/v4.4-st5-1479-ga84d0db6dfc6/x86_64/x86_64_defconfig+x86-chromebook/gcc-10/lab-collabora/ltp-mm-asus-C523NA-A20057-coral.html
Rootfs: http://storage.kernelci.org/images/rootfs/debian/bullseye-ltp/20220311.1/amd64/initrd.cpio.gz


* ltp-mm.login: https://kernelci.org/test/case/id/624499fc0606c9c71cae0688
failing since 14 days (last pass: v4.19.233-cip69-1019-g2e5815777e975, first fail: v4.4.302-18-ga78419826225)



platform | arch | lab | compiler | defconfig | regressions
--------------------------+--------+---------------+----------+------------------------------+------------
hp-11A-G6-EE-grunt | x86_64 | lab-collabora | gcc-10 | x86_64_defcon...6-chromebook | 1

Details: https://kernelci.org/test/plan/id/624456be519a02a39bae067e

Results: 0 PASS, 1 FAIL, 0 SKIP
Full config: x86_64_defconfig+x86-chromebook
Compiler: gcc-10 (gcc (Debian 10.2.1-6) 10.2.1 20210110)
Plain log: https://storage.kernelci.org//cip-gitlab/ci-pavel-linux-test/v4.4-st5-1479-ga84d0db6dfc6/x86_64/x86_64_defconfig+x86-chromebook/gcc-10/lab-collabora/ltp-mm-hp-11A-G6-EE-grunt.txt
HTML log: https://storage.kernelci.org//cip-gitlab/ci-pavel-linux-test/v4.4-st5-1479-ga84d0db6dfc6/x86_64/x86_64_defconfig+x86-chromebook/gcc-10/lab-collabora/ltp-mm-hp-11A-G6-EE-grunt.html
Rootfs: http://storage.kernelci.org/images/rootfs/debian/bullseye-ltp/20220311.1/amd64/initrd.cpio.gz


* ltp-mm.login: https://kernelci.org/test/case/id/624456be519a02a39bae067f
failing since 14 days (last pass: v4.19.233-cip69-1019-g2e5815777e975, first fail: v4.4.302-18-ga78419826225)



platform | arch | lab | compiler | defconfig | regressions
--------------------------+--------+---------------+----------+------------------------------+------------
hp-x360-12b-n4000-octopus | x86_64 | lab-collabora | gcc-10 | x86_64_defcon...6-chromebook | 1

Details: https://kernelci.org/test/plan/id/624453a63f24dded2fae071f

Results: 0 PASS, 1 FAIL, 0 SKIP
Full config: x86_64_defconfig+x86-chromebook
Compiler: gcc-10 (gcc (Debian 10.2.1-6) 10.2.1 20210110)
Plain log: https://storage.kernelci.org//cip-gitlab/ci-pavel-linux-test/v4.4-st5-1479-ga84d0db6dfc6/x86_64/x86_64_defconfig+x86-chromebook/gcc-10/lab-collabora/ltp-mm-hp-x360-12b-n4000-octopus.txt
HTML log: https://storage.kernelci.org//cip-gitlab/ci-pavel-linux-test/v4.4-st5-1479-ga84d0db6dfc6/x86_64/x86_64_defconfig+x86-chromebook/gcc-10/lab-collabora/ltp-mm-hp-x360-12b-n4000-octopus.html
Rootfs: http://storage.kernelci.org/images/rootfs/debian/bullseye-ltp/20220311.1/amd64/initrd.cpio.gz


* ltp-mm.login: https://kernelci.org/test/case/id/624453a63f24dded2fae0720
failing since 13 days (last pass: v4.19.233-cip69-1019-g2e5815777e975, first fail: v4.4.302-18-ga78419826225)


cip-gitlab/ci/pavel/linux-test ltp-ipc: 6 runs, 5 regressions (v4.4-st5-1479-ga84d0db6dfc6) #kernelci

kernelci.org bot <bot@...>
 

cip-gitlab/ci/pavel/linux-test ltp-ipc: 6 runs, 5 regressions (v4.4-st5-1479-ga84d0db6dfc6)

Regressions Summary
-------------------

platform | arch | lab | compiler | defconfig | regressions
--------------------------+--------+---------------+----------+------------------------------+------------
asus-C436FA-Flip-hatch | x86_64 | lab-collabora | gcc-10 | x86_64_defcon...6-chromebook | 1
asus-C523NA-A20057-coral | x86_64 | lab-collabora | gcc-10 | x86_64_defcon...6-chromebook | 1
asus-cx9400-volteer | x86_64 | lab-collabora | gcc-10 | x86_64_defcon...6-chromebook | 1
hp-11A-G6-EE-grunt | x86_64 | lab-collabora | gcc-10 | x86_64_defcon...6-chromebook | 1
hp-x360-12b-n4000-octopus | x86_64 | lab-collabora | gcc-10 | x86_64_defcon...6-chromebook | 1

Details: https://kernelci.org/test/job/cip-gitlab/branch/ci%2Fpavel%2Flinux-test/kernel/v4.4-st5-1479-ga84d0db6dfc6/plan/ltp-ipc/

Test: ltp-ipc
Tree: cip-gitlab
Branch: ci/pavel/linux-test
Describe: v4.4-st5-1479-ga84d0db6dfc6
URL: https://gitlab.com/cip-project/cip-kernel/linux-cip.git
SHA: a84d0db6dfc604c5de8b5446ea27ac9a039ae378

Test suite revisions:
ltp-tests
URL: https://github.com/linux-test-project/ltp.git
SHA: dc836ec4cd4e02e1346001f828c1f1988a8d7d54


Test Regressions
----------------


platform | arch | lab | compiler | defconfig | regressions
--------------------------+--------+---------------+----------+------------------------------+------------
asus-C436FA-Flip-hatch | x86_64 | lab-collabora | gcc-10 | x86_64_defcon...6-chromebook | 1

Details: https://kernelci.org/test/plan/id/62444e0e9677c01959ae06aa

Results: 0 PASS, 1 FAIL, 0 SKIP
Full config: x86_64_defconfig+x86-chromebook
Compiler: gcc-10 (gcc (Debian 10.2.1-6) 10.2.1 20210110)
Plain log: https://storage.kernelci.org//cip-gitlab/ci-pavel-linux-test/v4.4-st5-1479-ga84d0db6dfc6/x86_64/x86_64_defconfig+x86-chromebook/gcc-10/lab-collabora/ltp-ipc-asus-C436FA-Flip-hatch.txt
HTML log: https://storage.kernelci.org//cip-gitlab/ci-pavel-linux-test/v4.4-st5-1479-ga84d0db6dfc6/x86_64/x86_64_defconfig+x86-chromebook/gcc-10/lab-collabora/ltp-ipc-asus-C436FA-Flip-hatch.html
Rootfs: http://storage.kernelci.org/images/rootfs/debian/bullseye-ltp/20220311.1/amd64/initrd.cpio.gz


* ltp-ipc.login: https://kernelci.org/test/case/id/62444e0e9677c01959ae06ab
failing since 15 days (last pass: v5.10.100-cip2-319-g7182f5032311, first fail: v4.19.233-cip69-1019-g2e5815777e975)



platform | arch | lab | compiler | defconfig | regressions
--------------------------+--------+---------------+----------+------------------------------+------------
asus-C523NA-A20057-coral | x86_64 | lab-collabora | gcc-10 | x86_64_defcon...6-chromebook | 1

Details: https://kernelci.org/test/plan/id/62449ada4c5ee46efdae06aa

Results: 0 PASS, 1 FAIL, 0 SKIP
Full config: x86_64_defconfig+x86-chromebook
Compiler: gcc-10 (gcc (Debian 10.2.1-6) 10.2.1 20210110)
Plain log: https://storage.kernelci.org//cip-gitlab/ci-pavel-linux-test/v4.4-st5-1479-ga84d0db6dfc6/x86_64/x86_64_defconfig+x86-chromebook/gcc-10/lab-collabora/ltp-ipc-asus-C523NA-A20057-coral.txt
HTML log: https://storage.kernelci.org//cip-gitlab/ci-pavel-linux-test/v4.4-st5-1479-ga84d0db6dfc6/x86_64/x86_64_defconfig+x86-chromebook/gcc-10/lab-collabora/ltp-ipc-asus-C523NA-A20057-coral.html
Rootfs: http://storage.kernelci.org/images/rootfs/debian/bullseye-ltp/20220311.1/amd64/initrd.cpio.gz


* ltp-ipc.login: https://kernelci.org/test/case/id/62449ada4c5ee46efdae06ab
failing since 14 days (last pass: v4.19.233-cip69-1019-g2e5815777e975, first fail: v4.4.302-18-ga78419826225)



platform | arch | lab | compiler | defconfig | regressions
--------------------------+--------+---------------+----------+------------------------------+------------
asus-cx9400-volteer | x86_64 | lab-collabora | gcc-10 | x86_64_defcon...6-chromebook | 1

Details: https://kernelci.org/test/plan/id/62444dbcb3bd3d6bb7ae0681

Results: 0 PASS, 1 FAIL, 0 SKIP
Full config: x86_64_defconfig+x86-chromebook
Compiler: gcc-10 (gcc (Debian 10.2.1-6) 10.2.1 20210110)
Plain log: https://storage.kernelci.org//cip-gitlab/ci-pavel-linux-test/v4.4-st5-1479-ga84d0db6dfc6/x86_64/x86_64_defconfig+x86-chromebook/gcc-10/lab-collabora/ltp-ipc-asus-cx9400-volteer.txt
HTML log: https://storage.kernelci.org//cip-gitlab/ci-pavel-linux-test/v4.4-st5-1479-ga84d0db6dfc6/x86_64/x86_64_defconfig+x86-chromebook/gcc-10/lab-collabora/ltp-ipc-asus-cx9400-volteer.html
Rootfs: http://storage.kernelci.org/images/rootfs/debian/bullseye-ltp/20220311.1/amd64/initrd.cpio.gz


* ltp-ipc.login: https://kernelci.org/test/case/id/62444dbcb3bd3d6bb7ae0682
failing since 15 days (last pass: v5.10.100-cip2-319-g7182f5032311, first fail: v4.19.233-cip69-1019-g2e5815777e975)



platform | arch | lab | compiler | defconfig | regressions
--------------------------+--------+---------------+----------+------------------------------+------------
hp-11A-G6-EE-grunt | x86_64 | lab-collabora | gcc-10 | x86_64_defcon...6-chromebook | 1

Details: https://kernelci.org/test/plan/id/62444f6e47ea5390bfae06be

Results: 0 PASS, 1 FAIL, 0 SKIP
Full config: x86_64_defconfig+x86-chromebook
Compiler: gcc-10 (gcc (Debian 10.2.1-6) 10.2.1 20210110)
Plain log: https://storage.kernelci.org//cip-gitlab/ci-pavel-linux-test/v4.4-st5-1479-ga84d0db6dfc6/x86_64/x86_64_defconfig+x86-chromebook/gcc-10/lab-collabora/ltp-ipc-hp-11A-G6-EE-grunt.txt
HTML log: https://storage.kernelci.org//cip-gitlab/ci-pavel-linux-test/v4.4-st5-1479-ga84d0db6dfc6/x86_64/x86_64_defconfig+x86-chromebook/gcc-10/lab-collabora/ltp-ipc-hp-11A-G6-EE-grunt.html
Rootfs: http://storage.kernelci.org/images/rootfs/debian/bullseye-ltp/20220311.1/amd64/initrd.cpio.gz


* ltp-ipc.login: https://kernelci.org/test/case/id/62444f6e47ea5390bfae06bf
failing since 13 days (last pass: v4.19.233-cip69-1019-g2e5815777e975, first fail: v4.4.302-18-ga78419826225)



platform | arch | lab | compiler | defconfig | regressions
--------------------------+--------+---------------+----------+------------------------------+------------
hp-x360-12b-n4000-octopus | x86_64 | lab-collabora | gcc-10 | x86_64_defcon...6-chromebook | 1

Details: https://kernelci.org/test/plan/id/624452bfc84731803bae0798

Results: 0 PASS, 1 FAIL, 0 SKIP
Full config: x86_64_defconfig+x86-chromebook
Compiler: gcc-10 (gcc (Debian 10.2.1-6) 10.2.1 20210110)
Plain log: https://storage.kernelci.org//cip-gitlab/ci-pavel-linux-test/v4.4-st5-1479-ga84d0db6dfc6/x86_64/x86_64_defconfig+x86-chromebook/gcc-10/lab-collabora/ltp-ipc-hp-x360-12b-n4000-octopus.txt
HTML log: https://storage.kernelci.org//cip-gitlab/ci-pavel-linux-test/v4.4-st5-1479-ga84d0db6dfc6/x86_64/x86_64_defconfig+x86-chromebook/gcc-10/lab-collabora/ltp-ipc-hp-x360-12b-n4000-octopus.html
Rootfs: http://storage.kernelci.org/images/rootfs/debian/bullseye-ltp/20220311.1/amd64/initrd.cpio.gz


* ltp-ipc.login: https://kernelci.org/test/case/id/624452bfc84731803bae0799
failing since 13 days (last pass: v4.19.233-cip69-1019-g2e5815777e975, first fail: v4.4.302-18-ga78419826225)


cip-gitlab/ci/pavel/linux-test ltp-fcntl-locktests: 3 runs, 3 regressions (v4.4-st5-1479-ga84d0db6dfc6) #kernelci

kernelci.org bot <bot@...>
 

cip-gitlab/ci/pavel/linux-test ltp-fcntl-locktests: 3 runs, 3 regressions (v4.4-st5-1479-ga84d0db6dfc6)

Regressions Summary
-------------------

platform | arch | lab | compiler | defconfig | regressions
--------------------------+--------+---------------+----------+------------------------------+------------
asus-C433TA-AJ0005-rammus | x86_64 | lab-collabora | gcc-10 | x86_64_defcon...6-chromebook | 1
asus-C523NA-A20057-coral | x86_64 | lab-collabora | gcc-10 | x86_64_defcon...6-chromebook | 1
hp-11A-G6-EE-grunt | x86_64 | lab-collabora | gcc-10 | x86_64_defcon...6-chromebook | 1

Details: https://kernelci.org/test/job/cip-gitlab/branch/ci%2Fpavel%2Flinux-test/kernel/v4.4-st5-1479-ga84d0db6dfc6/plan/ltp-fcntl-locktests/

Test: ltp-fcntl-locktests
Tree: cip-gitlab
Branch: ci/pavel/linux-test
Describe: v4.4-st5-1479-ga84d0db6dfc6
URL: https://gitlab.com/cip-project/cip-kernel/linux-cip.git
SHA: a84d0db6dfc604c5de8b5446ea27ac9a039ae378

Test suite revisions:
ltp-tests
URL: https://github.com/linux-test-project/ltp.git
SHA: dc836ec4cd4e02e1346001f828c1f1988a8d7d54


Test Regressions
----------------


platform | arch | lab | compiler | defconfig | regressions
--------------------------+--------+---------------+----------+------------------------------+------------
asus-C433TA-AJ0005-rammus | x86_64 | lab-collabora | gcc-10 | x86_64_defcon...6-chromebook | 1

Details: https://kernelci.org/test/plan/id/62444cfb739058edb0ae068f

Results: 0 PASS, 1 FAIL, 0 SKIP
Full config: x86_64_defconfig+x86-chromebook
Compiler: gcc-10 (gcc (Debian 10.2.1-6) 10.2.1 20210110)
Plain log: https://storage.kernelci.org//cip-gitlab/ci-pavel-linux-test/v4.4-st5-1479-ga84d0db6dfc6/x86_64/x86_64_defconfig+x86-chromebook/gcc-10/lab-collabora/ltp-fcntl-locktests-asus-C433TA-AJ0005-rammus.txt
HTML log: https://storage.kernelci.org//cip-gitlab/ci-pavel-linux-test/v4.4-st5-1479-ga84d0db6dfc6/x86_64/x86_64_defconfig+x86-chromebook/gcc-10/lab-collabora/ltp-fcntl-locktests-asus-C433TA-AJ0005-rammus.html
Rootfs: http://storage.kernelci.org/images/rootfs/debian/bullseye-ltp/20220311.1/amd64/initrd.cpio.gz


* ltp-fcntl-locktests.login: https://kernelci.org/test/case/id/62444cfb739058edb0ae0690
failing since 15 days (last pass: v5.10.100-cip2-319-g7182f5032311, first fail: v4.19.233-cip69-1019-g2e5815777e975)



platform | arch | lab | compiler | defconfig | regressions
--------------------------+--------+---------------+----------+------------------------------+------------
asus-C523NA-A20057-coral | x86_64 | lab-collabora | gcc-10 | x86_64_defcon...6-chromebook | 1

Details: https://kernelci.org/test/plan/id/62449a23a8b53ae37fae069a

Results: 0 PASS, 1 FAIL, 0 SKIP
Full config: x86_64_defconfig+x86-chromebook
Compiler: gcc-10 (gcc (Debian 10.2.1-6) 10.2.1 20210110)
Plain log: https://storage.kernelci.org//cip-gitlab/ci-pavel-linux-test/v4.4-st5-1479-ga84d0db6dfc6/x86_64/x86_64_defconfig+x86-chromebook/gcc-10/lab-collabora/ltp-fcntl-locktests-asus-C523NA-A20057-coral.txt
HTML log: https://storage.kernelci.org//cip-gitlab/ci-pavel-linux-test/v4.4-st5-1479-ga84d0db6dfc6/x86_64/x86_64_defconfig+x86-chromebook/gcc-10/lab-collabora/ltp-fcntl-locktests-asus-C523NA-A20057-coral.html
Rootfs: http://storage.kernelci.org/images/rootfs/debian/bullseye-ltp/20220311.1/amd64/initrd.cpio.gz


* ltp-fcntl-locktests.login: https://kernelci.org/test/case/id/62449a23a8b53ae37fae069b
failing since 14 days (last pass: v4.19.233-cip69-1019-g2e5815777e975, first fail: v4.4.302-18-ga78419826225)



platform | arch | lab | compiler | defconfig | regressions
--------------------------+--------+---------------+----------+------------------------------+------------
hp-11A-G6-EE-grunt | x86_64 | lab-collabora | gcc-10 | x86_64_defcon...6-chromebook | 1

Details: https://kernelci.org/test/plan/id/62444fa0ee316cf133ae06a3

Results: 0 PASS, 1 FAIL, 0 SKIP
Full config: x86_64_defconfig+x86-chromebook
Compiler: gcc-10 (gcc (Debian 10.2.1-6) 10.2.1 20210110)
Plain log: https://storage.kernelci.org//cip-gitlab/ci-pavel-linux-test/v4.4-st5-1479-ga84d0db6dfc6/x86_64/x86_64_defconfig+x86-chromebook/gcc-10/lab-collabora/ltp-fcntl-locktests-hp-11A-G6-EE-grunt.txt
HTML log: https://storage.kernelci.org//cip-gitlab/ci-pavel-linux-test/v4.4-st5-1479-ga84d0db6dfc6/x86_64/x86_64_defconfig+x86-chromebook/gcc-10/lab-collabora/ltp-fcntl-locktests-hp-11A-G6-EE-grunt.html
Rootfs: http://storage.kernelci.org/images/rootfs/debian/bullseye-ltp/20220311.1/amd64/initrd.cpio.gz


* ltp-fcntl-locktests.login: https://kernelci.org/test/case/id/62444fa0ee316cf133ae06a4
failing since 13 days (last pass: v4.19.233-cip69-1019-g2e5815777e975, first fail: v4.4.302-18-ga78419826225)


cip-gitlab/ci/pavel/linux-test baseline-cip-nfs: 3 runs, 2 regressions (v4.4-st5-1479-ga84d0db6dfc6) #kernelci

kernelci.org bot <bot@...>
 

cip-gitlab/ci/pavel/linux-test baseline-cip-nfs: 3 runs, 2 regressions (v4.4-st5-1479-ga84d0db6dfc6)

Regressions Summary
-------------------

platform | arch | lab | compiler | defconfig | regressions
--------------------------+--------+---------------+----------+------------------------------+------------
hp-11A-G6-EE-grunt | x86_64 | lab-collabora | gcc-10 | x86_64_defcon...6-chromebook | 1
hp-x360-12b-n4000-octopus | x86_64 | lab-collabora | gcc-10 | x86_64_defcon...6-chromebook | 1

Details: https://kernelci.org/test/job/cip-gitlab/branch/ci%2Fpavel%2Flinux-test/kernel/v4.4-st5-1479-ga84d0db6dfc6/plan/baseline-cip-nfs/

Test: baseline-cip-nfs
Tree: cip-gitlab
Branch: ci/pavel/linux-test
Describe: v4.4-st5-1479-ga84d0db6dfc6
URL: https://gitlab.com/cip-project/cip-kernel/linux-cip.git
SHA: a84d0db6dfc604c5de8b5446ea27ac9a039ae378


Test Regressions
----------------


platform | arch | lab | compiler | defconfig | regressions
--------------------------+--------+---------------+----------+------------------------------+------------
hp-11A-G6-EE-grunt | x86_64 | lab-collabora | gcc-10 | x86_64_defcon...6-chromebook | 1

Details: https://kernelci.org/test/plan/id/62445035dccbf70f43ae068b

Results: 0 PASS, 1 FAIL, 0 SKIP
Full config: x86_64_defconfig+x86-chromebook
Compiler: gcc-10 (gcc (Debian 10.2.1-6) 10.2.1 20210110)
Plain log: https://storage.kernelci.org//cip-gitlab/ci-pavel-linux-test/v4.4-st5-1479-ga84d0db6dfc6/x86_64/x86_64_defconfig+x86-chromebook/gcc-10/lab-collabora/baseline-cip-nfs-hp-11A-G6-EE-grunt.txt
HTML log: https://storage.kernelci.org//cip-gitlab/ci-pavel-linux-test/v4.4-st5-1479-ga84d0db6dfc6/x86_64/x86_64_defconfig+x86-chromebook/gcc-10/lab-collabora/baseline-cip-nfs-hp-11A-G6-EE-grunt.html
Rootfs: https://storage.kernelci.org/images/rootfs/cip/20211105/qemu-amd64/cip-core-image-kernelci-cip-core-buster-qemu-amd64-initrd.img.gz


* baseline-cip-nfs.login: https://kernelci.org/test/case/id/62445035dccbf70f43ae068c
failing since 13 days (last pass: v4.19.233-cip69-1019-g2e5815777e975, first fail: v4.4.302-18-ga78419826225)



platform | arch | lab | compiler | defconfig | regressions
--------------------------+--------+---------------+----------+------------------------------+------------
hp-x360-12b-n4000-octopus | x86_64 | lab-collabora | gcc-10 | x86_64_defcon...6-chromebook | 1

Details: https://kernelci.org/test/plan/id/624451383403bc778dae06e6

Results: 0 PASS, 1 FAIL, 0 SKIP
Full config: x86_64_defconfig+x86-chromebook
Compiler: gcc-10 (gcc (Debian 10.2.1-6) 10.2.1 20210110)
Plain log: https://storage.kernelci.org//cip-gitlab/ci-pavel-linux-test/v4.4-st5-1479-ga84d0db6dfc6/x86_64/x86_64_defconfig+x86-chromebook/gcc-10/lab-collabora/baseline-cip-nfs-hp-x360-12b-n4000-octopus.txt
HTML log: https://storage.kernelci.org//cip-gitlab/ci-pavel-linux-test/v4.4-st5-1479-ga84d0db6dfc6/x86_64/x86_64_defconfig+x86-chromebook/gcc-10/lab-collabora/baseline-cip-nfs-hp-x360-12b-n4000-octopus.html
Rootfs: https://storage.kernelci.org/images/rootfs/cip/20211105/qemu-amd64/cip-core-image-kernelci-cip-core-buster-qemu-amd64-initrd.img.gz


* baseline-cip-nfs.login: https://kernelci.org/test/case/id/624451383403bc778dae06e7
failing since 13 days (last pass: v4.19.233-cip69-1019-g2e5815777e975, first fail: v4.4.302-18-ga78419826225)


cip-gitlab/ci/pavel/linux-test baseline-nfs: 10 runs, 6 regressions (v4.4-st5-1479-ga84d0db6dfc6) #kernelci

kernelci.org bot <bot@...>
 

cip-gitlab/ci/pavel/linux-test baseline-nfs: 10 runs, 6 regressions (v4.4-st5-1479-ga84d0db6dfc6)

Regressions Summary
-------------------

platform | arch | lab | compiler | defconfig | regressions
--------------------------+--------+---------------+----------+------------------------------+------------
asus-C433TA-AJ0005-rammus | x86_64 | lab-collabora | gcc-10 | x86_64_defcon...6-chromebook | 1
asus-C523NA-A20057-coral | x86_64 | lab-collabora | gcc-10 | x86_64_defcon...6-chromebook | 1
asus-cx9400-volteer | x86_64 | lab-collabora | gcc-10 | x86_64_defcon...6-chromebook | 1
hp-11A-G6-EE-grunt | x86_64 | lab-collabora | gcc-10 | x86_64_defcon...6-chromebook | 1
hp-x360-12b-n4000-octopus | x86_64 | lab-collabora | gcc-10 | x86_64_defcon...6-chromebook | 1
hp-x360-14-G1-sona | x86_64 | lab-collabora | gcc-10 | x86_64_defcon...6-chromebook | 1

Details: https://kernelci.org/test/job/cip-gitlab/branch/ci%2Fpavel%2Flinux-test/kernel/v4.4-st5-1479-ga84d0db6dfc6/plan/baseline-nfs/

Test: baseline-nfs
Tree: cip-gitlab
Branch: ci/pavel/linux-test
Describe: v4.4-st5-1479-ga84d0db6dfc6
URL: https://gitlab.com/cip-project/cip-kernel/linux-cip.git
SHA: a84d0db6dfc604c5de8b5446ea27ac9a039ae378


Test Regressions
----------------


platform | arch | lab | compiler | defconfig | regressions
--------------------------+--------+---------------+----------+------------------------------+------------
asus-C433TA-AJ0005-rammus | x86_64 | lab-collabora | gcc-10 | x86_64_defcon...6-chromebook | 1

Details: https://kernelci.org/test/plan/id/62444d59f3e3eb9238ae0680

Results: 0 PASS, 1 FAIL, 0 SKIP
Full config: x86_64_defconfig+x86-chromebook
Compiler: gcc-10 (gcc (Debian 10.2.1-6) 10.2.1 20210110)
Plain log: https://storage.kernelci.org//cip-gitlab/ci-pavel-linux-test/v4.4-st5-1479-ga84d0db6dfc6/x86_64/x86_64_defconfig+x86-chromebook/gcc-10/lab-collabora/baseline-nfs-asus-C433TA-AJ0005-rammus.txt
HTML log: https://storage.kernelci.org//cip-gitlab/ci-pavel-linux-test/v4.4-st5-1479-ga84d0db6dfc6/x86_64/x86_64_defconfig+x86-chromebook/gcc-10/lab-collabora/baseline-nfs-asus-C433TA-AJ0005-rammus.html
Rootfs: http://storage.kernelci.org/images/rootfs/debian/bullseye/20220311.1/amd64/initrd.cpio.gz


* baseline-nfs.login: https://kernelci.org/test/case/id/62444d59f3e3eb9238ae0681
failing since 13 days (last pass: v4.19.233-cip69-1019-g2e5815777e975, first fail: v4.4.302-18-ga78419826225)



platform | arch | lab | compiler | defconfig | regressions
--------------------------+--------+---------------+----------+------------------------------+------------
asus-C523NA-A20057-coral | x86_64 | lab-collabora | gcc-10 | x86_64_defcon...6-chromebook | 1

Details: https://kernelci.org/test/plan/id/62449b8c920328148cae0688

Results: 0 PASS, 1 FAIL, 0 SKIP
Full config: x86_64_defconfig+x86-chromebook
Compiler: gcc-10 (gcc (Debian 10.2.1-6) 10.2.1 20210110)
Plain log: https://storage.kernelci.org//cip-gitlab/ci-pavel-linux-test/v4.4-st5-1479-ga84d0db6dfc6/x86_64/x86_64_defconfig+x86-chromebook/gcc-10/lab-collabora/baseline-nfs-asus-C523NA-A20057-coral.txt
HTML log: https://storage.kernelci.org//cip-gitlab/ci-pavel-linux-test/v4.4-st5-1479-ga84d0db6dfc6/x86_64/x86_64_defconfig+x86-chromebook/gcc-10/lab-collabora/baseline-nfs-asus-C523NA-A20057-coral.html
Rootfs: http://storage.kernelci.org/images/rootfs/debian/bullseye/20220311.1/amd64/initrd.cpio.gz


* baseline-nfs.login: https://kernelci.org/test/case/id/62449b8c920328148cae0689
failing since 14 days (last pass: v4.19.233-cip69-1019-g2e5815777e975, first fail: v4.4.302-18-ga78419826225)



platform | arch | lab | compiler | defconfig | regressions
--------------------------+--------+---------------+----------+------------------------------+------------
asus-cx9400-volteer | x86_64 | lab-collabora | gcc-10 | x86_64_defcon...6-chromebook | 1

Details: https://kernelci.org/test/plan/id/62444dd1fd165c77d3ae0680

Results: 0 PASS, 1 FAIL, 0 SKIP
Full config: x86_64_defconfig+x86-chromebook
Compiler: gcc-10 (gcc (Debian 10.2.1-6) 10.2.1 20210110)
Plain log: https://storage.kernelci.org//cip-gitlab/ci-pavel-linux-test/v4.4-st5-1479-ga84d0db6dfc6/x86_64/x86_64_defconfig+x86-chromebook/gcc-10/lab-collabora/baseline-nfs-asus-cx9400-volteer.txt
HTML log: https://storage.kernelci.org//cip-gitlab/ci-pavel-linux-test/v4.4-st5-1479-ga84d0db6dfc6/x86_64/x86_64_defconfig+x86-chromebook/gcc-10/lab-collabora/baseline-nfs-asus-cx9400-volteer.html
Rootfs: http://storage.kernelci.org/images/rootfs/debian/bullseye/20220311.1/amd64/initrd.cpio.gz


* baseline-nfs.login: https://kernelci.org/test/case/id/62444dd1fd165c77d3ae0681
failing since 15 days (last pass: v5.10.100-cip2-319-g7182f5032311, first fail: v4.19.233-cip69-1019-g2e5815777e975)



platform | arch | lab | compiler | defconfig | regressions
--------------------------+--------+---------------+----------+------------------------------+------------
hp-11A-G6-EE-grunt | x86_64 | lab-collabora | gcc-10 | x86_64_defcon...6-chromebook | 1

Details: https://kernelci.org/test/plan/id/62444fe87c9d33e9aaae0693

Results: 0 PASS, 1 FAIL, 0 SKIP
Full config: x86_64_defconfig+x86-chromebook
Compiler: gcc-10 (gcc (Debian 10.2.1-6) 10.2.1 20210110)
Plain log: https://storage.kernelci.org//cip-gitlab/ci-pavel-linux-test/v4.4-st5-1479-ga84d0db6dfc6/x86_64/x86_64_defconfig+x86-chromebook/gcc-10/lab-collabora/baseline-nfs-hp-11A-G6-EE-grunt.txt
HTML log: https://storage.kernelci.org//cip-gitlab/ci-pavel-linux-test/v4.4-st5-1479-ga84d0db6dfc6/x86_64/x86_64_defconfig+x86-chromebook/gcc-10/lab-collabora/baseline-nfs-hp-11A-G6-EE-grunt.html
Rootfs: http://storage.kernelci.org/images/rootfs/debian/bullseye/20220311.1/amd64/initrd.cpio.gz


* baseline-nfs.login: https://kernelci.org/test/case/id/62444fe87c9d33e9aaae0694
failing since 13 days (last pass: v4.19.233-cip69-1019-g2e5815777e975, first fail: v4.4.302-18-ga78419826225)



platform | arch | lab | compiler | defconfig | regressions
--------------------------+--------+---------------+----------+------------------------------+------------
hp-x360-12b-n4000-octopus | x86_64 | lab-collabora | gcc-10 | x86_64_defcon...6-chromebook | 1

Details: https://kernelci.org/test/plan/id/624452a06f9b319aa6ae06a5

Results: 0 PASS, 1 FAIL, 0 SKIP
Full config: x86_64_defconfig+x86-chromebook
Compiler: gcc-10 (gcc (Debian 10.2.1-6) 10.2.1 20210110)
Plain log: https://storage.kernelci.org//cip-gitlab/ci-pavel-linux-test/v4.4-st5-1479-ga84d0db6dfc6/x86_64/x86_64_defconfig+x86-chromebook/gcc-10/lab-collabora/baseline-nfs-hp-x360-12b-n4000-octopus.txt
HTML log: https://storage.kernelci.org//cip-gitlab/ci-pavel-linux-test/v4.4-st5-1479-ga84d0db6dfc6/x86_64/x86_64_defconfig+x86-chromebook/gcc-10/lab-collabora/baseline-nfs-hp-x360-12b-n4000-octopus.html
Rootfs: http://storage.kernelci.org/images/rootfs/debian/bullseye/20220311.1/amd64/initrd.cpio.gz


* baseline-nfs.login: https://kernelci.org/test/case/id/624452a06f9b319aa6ae06a6
failing since 13 days (last pass: v4.19.233-cip69-1019-g2e5815777e975, first fail: v4.4.302-18-ga78419826225)



platform | arch | lab | compiler | defconfig | regressions
--------------------------+--------+---------------+----------+------------------------------+------------
hp-x360-14-G1-sona | x86_64 | lab-collabora | gcc-10 | x86_64_defcon...6-chromebook | 1

Details: https://kernelci.org/test/plan/id/624452d358ad669eb9ae067e

Results: 0 PASS, 1 FAIL, 0 SKIP
Full config: x86_64_defconfig+x86-chromebook
Compiler: gcc-10 (gcc (Debian 10.2.1-6) 10.2.1 20210110)
Plain log: https://storage.kernelci.org//cip-gitlab/ci-pavel-linux-test/v4.4-st5-1479-ga84d0db6dfc6/x86_64/x86_64_defconfig+x86-chromebook/gcc-10/lab-collabora/baseline-nfs-hp-x360-14-G1-sona.txt
HTML log: https://storage.kernelci.org//cip-gitlab/ci-pavel-linux-test/v4.4-st5-1479-ga84d0db6dfc6/x86_64/x86_64_defconfig+x86-chromebook/gcc-10/lab-collabora/baseline-nfs-hp-x360-14-G1-sona.html
Rootfs: http://storage.kernelci.org/images/rootfs/debian/bullseye/20220311.1/amd64/initrd.cpio.gz


* baseline-nfs.login: https://kernelci.org/test/case/id/624452d358ad669eb9ae067f
failing since 13 days (last pass: v4.19.233-cip69-1019-g2e5815777e975, first fail: v4.4.302-18-ga78419826225)


cip-gitlab/ci/pavel/linux-test baseline: 37 runs, 6 regressions (v4.4-st5-1479-ga84d0db6dfc6) #kernelci

kernelci.org bot <bot@...>
 

cip-gitlab/ci/pavel/linux-test baseline: 37 runs, 6 regressions (v4.4-st5-1479-ga84d0db6dfc6)

Regressions Summary
-------------------

platform | arch | lab | compiler | defconfig | regressions
--------------------------+--------+---------------+----------+------------------------------+------------
asus-C436FA-Flip-hatch | x86_64 | lab-collabora | gcc-10 | x86_64_defcon...6-chromebook | 1
asus-cx9400-volteer | x86_64 | lab-collabora | gcc-10 | x86_64_defcon...6-chromebook | 1
hp-x360-12b-n4000-octopus | x86_64 | lab-collabora | gcc-10 | x86_64_defcon...6-chromebook | 1
odroid-xu3 | arm | lab-collabora | gcc-10 | exynos_defconfig | 1
qemu_x86_64-uefi-mixed | x86_64 | lab-baylibre | gcc-10 | x86_64_defcon...6-chromebook | 1
qemu_x86_64-uefi-mixed | x86_64 | lab-broonie | gcc-10 | x86_64_defcon...6-chromebook | 1

Details: https://kernelci.org/test/job/cip-gitlab/branch/ci%2Fpavel%2Flinux-test/kernel/v4.4-st5-1479-ga84d0db6dfc6/plan/baseline/

Test: baseline
Tree: cip-gitlab
Branch: ci/pavel/linux-test
Describe: v4.4-st5-1479-ga84d0db6dfc6
URL: https://gitlab.com/cip-project/cip-kernel/linux-cip.git
SHA: a84d0db6dfc604c5de8b5446ea27ac9a039ae378


Test Regressions
----------------


platform | arch | lab | compiler | defconfig | regressions
--------------------------+--------+---------------+----------+------------------------------+------------
asus-C436FA-Flip-hatch | x86_64 | lab-collabora | gcc-10 | x86_64_defcon...6-chromebook | 1

Details: https://kernelci.org/test/plan/id/62444d8ee9b9a140d9ae0687

Results: 0 PASS, 1 FAIL, 0 SKIP
Full config: x86_64_defconfig+x86-chromebook
Compiler: gcc-10 (gcc (Debian 10.2.1-6) 10.2.1 20210110)
Plain log: https://storage.kernelci.org//cip-gitlab/ci-pavel-linux-test/v4.4-st5-1479-ga84d0db6dfc6/x86_64/x86_64_defconfig+x86-chromebook/gcc-10/lab-collabora/baseline-asus-C436FA-Flip-hatch.txt
HTML log: https://storage.kernelci.org//cip-gitlab/ci-pavel-linux-test/v4.4-st5-1479-ga84d0db6dfc6/x86_64/x86_64_defconfig+x86-chromebook/gcc-10/lab-collabora/baseline-asus-C436FA-Flip-hatch.html
Rootfs: http://storage.kernelci.org/images/rootfs/buildroot/buildroot-baseline/20220228.1/x86/rootfs.cpio.gz


* baseline.login: https://kernelci.org/test/case/id/62444d8ee9b9a140d9ae0688
failing since 15 days (last pass: v5.10.100-cip2-319-g7182f5032311, first fail: v4.19.233-cip69-1019-g2e5815777e975)



platform | arch | lab | compiler | defconfig | regressions
--------------------------+--------+---------------+----------+------------------------------+------------
asus-cx9400-volteer | x86_64 | lab-collabora | gcc-10 | x86_64_defcon...6-chromebook | 1

Details: https://kernelci.org/test/plan/id/62444da5e9b9a140d9ae06b9

Results: 0 PASS, 1 FAIL, 0 SKIP
Full config: x86_64_defconfig+x86-chromebook
Compiler: gcc-10 (gcc (Debian 10.2.1-6) 10.2.1 20210110)
Plain log: https://storage.kernelci.org//cip-gitlab/ci-pavel-linux-test/v4.4-st5-1479-ga84d0db6dfc6/x86_64/x86_64_defconfig+x86-chromebook/gcc-10/lab-collabora/baseline-asus-cx9400-volteer.txt
HTML log: https://storage.kernelci.org//cip-gitlab/ci-pavel-linux-test/v4.4-st5-1479-ga84d0db6dfc6/x86_64/x86_64_defconfig+x86-chromebook/gcc-10/lab-collabora/baseline-asus-cx9400-volteer.html
Rootfs: http://storage.kernelci.org/images/rootfs/buildroot/buildroot-baseline/20220228.1/x86/rootfs.cpio.gz


* baseline.login: https://kernelci.org/test/case/id/62444da5e9b9a140d9ae06ba
failing since 15 days (last pass: v5.10.100-cip2-319-g7182f5032311, first fail: v4.19.233-cip69-1019-g2e5815777e975)



platform | arch | lab | compiler | defconfig | regressions
--------------------------+--------+---------------+----------+------------------------------+------------
hp-x360-12b-n4000-octopus | x86_64 | lab-collabora | gcc-10 | x86_64_defcon...6-chromebook | 1

Details: https://kernelci.org/test/plan/id/62445404f7acdb61baae0689

Results: 0 PASS, 1 FAIL, 0 SKIP
Full config: x86_64_defconfig+x86-chromebook
Compiler: gcc-10 (gcc (Debian 10.2.1-6) 10.2.1 20210110)
Plain log: https://storage.kernelci.org//cip-gitlab/ci-pavel-linux-test/v4.4-st5-1479-ga84d0db6dfc6/x86_64/x86_64_defconfig+x86-chromebook/gcc-10/lab-collabora/baseline-hp-x360-12b-n4000-octopus.txt
HTML log: https://storage.kernelci.org//cip-gitlab/ci-pavel-linux-test/v4.4-st5-1479-ga84d0db6dfc6/x86_64/x86_64_defconfig+x86-chromebook/gcc-10/lab-collabora/baseline-hp-x360-12b-n4000-octopus.html
Rootfs: http://storage.kernelci.org/images/rootfs/buildroot/buildroot-baseline/20220228.1/x86/rootfs.cpio.gz


* baseline.login: https://kernelci.org/test/case/id/62445404f7acdb61baae068a
failing since 13 days (last pass: v4.19.233-cip69-1019-g2e5815777e975, first fail: v4.4.302-18-ga78419826225)



platform | arch | lab | compiler | defconfig | regressions
--------------------------+--------+---------------+----------+------------------------------+------------
odroid-xu3 | arm | lab-collabora | gcc-10 | exynos_defconfig | 1

Details: https://kernelci.org/test/plan/id/6244f08ff54ffa31bcae0693

Results: 4 PASS, 1 FAIL, 2 SKIP
Full config: exynos_defconfig
Compiler: gcc-10 (arm-linux-gnueabihf-gcc (Debian 10.2.1-6) 10.2.1 20210110)
Plain log: https://storage.kernelci.org//cip-gitlab/ci-pavel-linux-test/v4.4-st5-1479-ga84d0db6dfc6/arm/exynos_defconfig/gcc-10/lab-collabora/baseline-odroid-xu3.txt
HTML log: https://storage.kernelci.org//cip-gitlab/ci-pavel-linux-test/v4.4-st5-1479-ga84d0db6dfc6/arm/exynos_defconfig/gcc-10/lab-collabora/baseline-odroid-xu3.html
Rootfs: http://storage.kernelci.org/images/rootfs/buildroot/buildroot-baseline/20220228.1/armel/rootfs.cpio.gz


* baseline.bootrr.all-cpus-are-online: https://kernelci.org/test/case/id/6244f08ff54ffa31bcae0697
failing since 14 days (last pass: v4.19.233-cip69-1019-g2e5815777e975, first fail: v4.4.302-18-ga78419826225)

2022-03-31T00:06:25.645832 /lava-5980394/1/../bin/lava-test-case
2022-03-31T00:06:25.661620 [ 13.818364] <LAVA_SIGNAL_TESTCASE TEST_CASE_ID=all-cpus-are-online RESULT=fail>



platform | arch | lab | compiler | defconfig | regressions
--------------------------+--------+---------------+----------+------------------------------+------------
qemu_x86_64-uefi-mixed | x86_64 | lab-baylibre | gcc-10 | x86_64_defcon...6-chromebook | 1

Details: https://kernelci.org/test/plan/id/62444c2e44b6fd8a00ae068b

Results: 0 PASS, 1 FAIL, 0 SKIP
Full config: x86_64_defconfig+x86-chromebook
Compiler: gcc-10 (gcc (Debian 10.2.1-6) 10.2.1 20210110)
Plain log: https://storage.kernelci.org//cip-gitlab/ci-pavel-linux-test/v4.4-st5-1479-ga84d0db6dfc6/x86_64/x86_64_defconfig+x86-chromebook/gcc-10/lab-baylibre/baseline-qemu_x86_64-uefi-mixed.txt
HTML log: https://storage.kernelci.org//cip-gitlab/ci-pavel-linux-test/v4.4-st5-1479-ga84d0db6dfc6/x86_64/x86_64_defconfig+x86-chromebook/gcc-10/lab-baylibre/baseline-qemu_x86_64-uefi-mixed.html
Rootfs: http://storage.kernelci.org/images/rootfs/buildroot/buildroot-baseline/20220228.1/x86/rootfs.cpio.gz


* baseline.login: https://kernelci.org/test/case/id/62444c2e44b6fd8a00ae068c
failing since 15 days (last pass: v5.10.100-cip2-319-g7182f5032311, first fail: v4.19.233-cip69-1019-g2e5815777e975)



platform | arch | lab | compiler | defconfig | regressions
--------------------------+--------+---------------+----------+------------------------------+------------
qemu_x86_64-uefi-mixed | x86_64 | lab-broonie | gcc-10 | x86_64_defcon...6-chromebook | 1

Details: https://kernelci.org/test/plan/id/62444c5b449a6f9f43ae0690

Results: 0 PASS, 1 FAIL, 0 SKIP
Full config: x86_64_defconfig+x86-chromebook
Compiler: gcc-10 (gcc (Debian 10.2.1-6) 10.2.1 20210110)
Plain log: https://storage.kernelci.org//cip-gitlab/ci-pavel-linux-test/v4.4-st5-1479-ga84d0db6dfc6/x86_64/x86_64_defconfig+x86-chromebook/gcc-10/lab-broonie/baseline-qemu_x86_64-uefi-mixed.txt
HTML log: https://storage.kernelci.org//cip-gitlab/ci-pavel-linux-test/v4.4-st5-1479-ga84d0db6dfc6/x86_64/x86_64_defconfig+x86-chromebook/gcc-10/lab-broonie/baseline-qemu_x86_64-uefi-mixed.html
Rootfs: http://storage.kernelci.org/images/rootfs/buildroot/buildroot-baseline/20220228.1/x86/rootfs.cpio.gz


* baseline.login: https://kernelci.org/test/case/id/62444c5b449a6f9f43ae0691
failing since 15 days (last pass: v5.10.100-cip2-319-g7182f5032311, first fail: v4.19.233-cip69-1019-g2e5815777e975)


cip-gitlab/ci/pavel/linux-test build: 187 builds: 5 failed, 182 passed, 8 errors, 37 warnings (v4.4-st5-1479-ga84d0db6dfc6) #kernelci

kernelci.org bot <bot@...>
 

cip-gitlab/ci/pavel/linux-test build: 187 builds: 5 failed, 182 passed, 8 errors, 37 warnings (v4.4-st5-1479-ga84d0db6dfc6)

Full Build Summary: https://kernelci.org/build/cip-gitlab/branch/ci%2Fpavel%2Flinux-test/kernel/v4.4-st5-1479-ga84d0db6dfc6/

Tree: cip-gitlab
Branch: ci/pavel/linux-test
Git Describe: v4.4-st5-1479-ga84d0db6dfc6
Git Commit: a84d0db6dfc604c5de8b5446ea27ac9a039ae378
Git URL: https://gitlab.com/cip-project/cip-kernel/linux-cip.git
Built: 6 unique architectures

Build Failures Detected:

arm:
rpc_defconfig: (gcc-10) FAIL

mips:
fuloong2e_defconfig: (gcc-10) FAIL
ip27_defconfig: (gcc-10) FAIL
ip28_defconfig: (gcc-10) FAIL
lemote2f_defconfig: (gcc-10) FAIL

Errors and Warnings Detected:

arc:

arm64:
defconfig (gcc-10): 1 warning
defconfig+arm64-chromebook (gcc-10): 1 warning

arm:
clps711x_defconfig (gcc-10): 1 warning
davinci_all_defconfig (gcc-10): 1 warning
lpc32xx_defconfig (gcc-10): 1 warning
mini2440_defconfig (gcc-10): 1 warning
mxs_defconfig (gcc-10): 1 warning
omap1_defconfig (gcc-10): 1 warning
omap2plus_defconfig (gcc-10): 1 warning
rpc_defconfig (gcc-10): 4 errors
s3c2410_defconfig (gcc-10): 1 warning
s3c6400_defconfig (gcc-10): 2 warnings

i386:
i386_defconfig (gcc-10): 2 warnings

mips:
fuloong2e_defconfig (gcc-10): 2 errors
ip22_defconfig (gcc-10): 1 warning
lemote2f_defconfig (gcc-10): 2 errors
mtx1_defconfig (gcc-10): 3 warnings

x86_64:
allnoconfig (gcc-10): 4 warnings
tinyconfig (gcc-10): 3 warnings
x86_64_defconfig (gcc-10): 6 warnings
x86_64_defconfig+x86-chromebook (gcc-10): 6 warnings

Errors summary:

4 cc1: error: ‘-mloongson-mmi’ must be used with ‘-mhard-float’
2 arm-linux-gnueabihf-gcc: error: unrecognized -march target: armv3
2 arm-linux-gnueabihf-gcc: error: missing argument to ‘-march=’

Warnings summary:

7 arch/x86/kernel/process.c:456: Warning: no instruction mnemonic suffix given and no register operands; using default for `btr'
4 arch/x86/entry/entry_64.S:487: Warning: no instruction mnemonic suffix given and no register operands; using default for `btr'
4 arch/x86/entry/entry_64.S:1660: Warning: no instruction mnemonic suffix given and no register operands; using default for `sysret'
3 ld: warning: creating DT_TEXTREL in a PIE
3 drivers/tty/serial/samsung.c:1780:34: warning: array ‘s3c24xx_uart_dt_match’ assumed to have one element
2 sound/pci/echoaudio/echoaudio_dsp.c:647:9: warning: iteration 1073741824 invokes undefined behavior [-Waggressive-loop-optimizations]
2 ld: arch/x86/boot/compressed/head_64.o: warning: relocation in read-only section `.head.text'
2 drivers/net/ethernet/apm/xgene/xgene_enet_main.c:32:36: warning: array ‘xgene_enet_acpi_match’ assumed to have one element
1 sound/pci/echoaudio/echoaudio_dsp.c:658:9: warning: iteration 1073741824 invokes undefined behavior [-Waggressive-loop-optimizations]
1 ld: arch/x86/boot/compressed/head_32.o: warning: relocation in read-only section `.head.text'
1 drivers/net/ethernet/seeq/sgiseeq.c:804:26: warning: passing argument 5 of ‘dma_free_attrs’ makes pointer from integer without a cast [-Wint-conversion]
1 drivers/mmc/host/sdhci-s3c.c:429:34: warning: array ‘sdhci_s3c_dt_match’ assumed to have one element
1 drivers/gpio/gpio-omap.c:1161:34: warning: array ‘omap_gpio_match’ assumed to have one element
1 drivers/cpufreq/ti-cpufreq.c:250:24: warning: passing argument 1 of ‘PTR_ERR_OR_ZERO’ makes pointer from integer without a cast [-Wint-conversion]
1 arch/arm/mach-mxs/mach-mxs.c:285:26: warning: duplicate ‘const’ declaration specifier [-Wduplicate-decl-specifier]
1 arch/arm/mach-lpc32xx/phy3250.c:215:36: warning: duplicate ‘const’ declaration specifier [-Wduplicate-decl-specifier]
1 arch/arm/mach-davinci/da8xx-dt.c:23:34: warning: duplicate ‘const’ declaration specifier [-Wduplicate-decl-specifier]
1 arch/arm/mach-clps711x/board-autcpu12.c:163:26: warning: duplicate ‘const’ declaration specifier [-Wduplicate-decl-specifier]

================================================================================

Detailed per-defconfig build reports:

--------------------------------------------------------------------------------
acs5k_defconfig (arm, gcc-10) — PASS, 0 errors, 0 warnings, 0 section mismatches

--------------------------------------------------------------------------------
acs5k_tiny_defconfig (arm, gcc-10) — PASS, 0 errors, 0 warnings, 0 section mismatches

--------------------------------------------------------------------------------
allnoconfig (i386, gcc-10) — PASS, 0 errors, 0 warnings, 0 section mismatches

--------------------------------------------------------------------------------
allnoconfig (arm, gcc-10) — PASS, 0 errors, 0 warnings, 0 section mismatches

--------------------------------------------------------------------------------
allnoconfig (mips, gcc-10) — PASS, 0 errors, 0 warnings, 0 section mismatches

--------------------------------------------------------------------------------
allnoconfig (x86_64, gcc-10) — PASS, 0 errors, 4 warnings, 0 section mismatches

Warnings:
arch/x86/entry/entry_64.S:487: Warning: no instruction mnemonic suffix given and no register operands; using default for `btr'
arch/x86/entry/entry_64.S:1660: Warning: no instruction mnemonic suffix given and no register operands; using default for `sysret'
arch/x86/kernel/process.c:456: Warning: no instruction mnemonic suffix given and no register operands; using default for `btr'
arch/x86/kernel/process.c:456: Warning: no instruction mnemonic suffix given and no register operands; using default for `btr'

--------------------------------------------------------------------------------
allnoconfig (arc, gcc-10) — PASS, 0 errors, 0 warnings, 0 section mismatches

--------------------------------------------------------------------------------
am200epdkit_defconfig (arm, gcc-10) — PASS, 0 errors, 0 warnings, 0 section mismatches

--------------------------------------------------------------------------------
ar7_defconfig (mips, gcc-10) — PASS, 0 errors, 0 warnings, 0 section mismatches

--------------------------------------------------------------------------------
assabet_defconfig (arm, gcc-10) — PASS, 0 errors, 0 warnings, 0 section mismatches

--------------------------------------------------------------------------------
at91_dt_defconfig (arm, gcc-10) — PASS, 0 errors, 0 warnings, 0 section mismatches

--------------------------------------------------------------------------------
ath79_defconfig (mips, gcc-10) — PASS, 0 errors, 0 warnings, 0 section mismatches

--------------------------------------------------------------------------------
axm55xx_defconfig (arm, gcc-10) — PASS, 0 errors, 0 warnings, 0 section mismatches

--------------------------------------------------------------------------------
axs103_defconfig (arc, gcc-10) — PASS, 0 errors, 0 warnings, 0 section mismatches

--------------------------------------------------------------------------------
axs103_smp_defconfig (arc, gcc-10) — PASS, 0 errors, 0 warnings, 0 section mismatches

--------------------------------------------------------------------------------
badge4_defconfig (arm, gcc-10) — PASS, 0 errors, 0 warnings, 0 section mismatches

--------------------------------------------------------------------------------
bcm2835_defconfig (arm, gcc-10) — PASS, 0 errors, 0 warnings, 0 section mismatches

--------------------------------------------------------------------------------
bcm47xx_defconfig (mips, gcc-10) — PASS, 0 errors, 0 warnings, 0 section mismatches

--------------------------------------------------------------------------------
bcm63xx_defconfig (mips, gcc-10) — PASS, 0 errors, 0 warnings, 0 section mismatches

--------------------------------------------------------------------------------
bcm_defconfig (arm, gcc-10) — PASS, 0 errors, 0 warnings, 0 section mismatches

--------------------------------------------------------------------------------
bigsur_defconfig (mips, gcc-10) — PASS, 0 errors, 0 warnings, 0 section mismatches

--------------------------------------------------------------------------------
bmips_be_defconfig (mips, gcc-10) — PASS, 0 errors, 0 warnings, 0 section mismatches

--------------------------------------------------------------------------------
bmips_stb_defconfig (mips, gcc-10) — PASS, 0 errors, 0 warnings, 0 section mismatches

--------------------------------------------------------------------------------
capcella_defconfig (mips, gcc-10) — PASS, 0 errors, 0 warnings, 0 section mismatches

--------------------------------------------------------------------------------
cavium_octeon_defconfig (mips, gcc-10) — PASS, 0 errors, 0 warnings, 0 section mismatches

--------------------------------------------------------------------------------
cerfcube_defconfig (arm, gcc-10) — PASS, 0 errors, 0 warnings, 0 section mismatches

--------------------------------------------------------------------------------
ci20_defconfig (mips, gcc-10) — PASS, 0 errors, 0 warnings, 0 section mismatches

--------------------------------------------------------------------------------
clps711x_defconfig (arm, gcc-10) — PASS, 0 errors, 1 warning, 0 section mismatches

Warnings:
arch/arm/mach-clps711x/board-autcpu12.c:163:26: warning: duplicate ‘const’ declaration specifier [-Wduplicate-decl-specifier]

--------------------------------------------------------------------------------
cm_x2xx_defconfig (arm, gcc-10) — PASS, 0 errors, 0 warnings, 0 section mismatches

--------------------------------------------------------------------------------
cm_x300_defconfig (arm, gcc-10) — PASS, 0 errors, 0 warnings, 0 section mismatches

--------------------------------------------------------------------------------
cobalt_defconfig (mips, gcc-10) — PASS, 0 errors, 0 warnings, 0 section mismatches

--------------------------------------------------------------------------------
colibri_pxa270_defconfig (arm, gcc-10) — PASS, 0 errors, 0 warnings, 0 section mismatches

--------------------------------------------------------------------------------
colibri_pxa300_defconfig (arm, gcc-10) — PASS, 0 errors, 0 warnings, 0 section mismatches

--------------------------------------------------------------------------------
collie_defconfig (arm, gcc-10) — PASS, 0 errors, 0 warnings, 0 section mismatches

--------------------------------------------------------------------------------
corgi_defconfig (arm, gcc-10) — PASS, 0 errors, 0 warnings, 0 section mismatches

--------------------------------------------------------------------------------
davinci_all_defconfig (arm, gcc-10) — PASS, 0 errors, 1 warning, 0 section mismatches

Warnings:
arch/arm/mach-davinci/da8xx-dt.c:23:34: warning: duplicate ‘const’ declaration specifier [-Wduplicate-decl-specifier]

--------------------------------------------------------------------------------
db1xxx_defconfig (mips, gcc-10) — PASS, 0 errors, 0 warnings, 0 section mismatches

--------------------------------------------------------------------------------
decstation_defconfig (mips, gcc-10) — PASS, 0 errors, 0 warnings, 0 section mismatches

--------------------------------------------------------------------------------
defconfig (arm64, gcc-10) — PASS, 0 errors, 1 warning, 0 section mismatches

Warnings:
drivers/net/ethernet/apm/xgene/xgene_enet_main.c:32:36: warning: array ‘xgene_enet_acpi_match’ assumed to have one element

--------------------------------------------------------------------------------
defconfig+arm64-chromebook (arm64, gcc-10) — PASS, 0 errors, 1 warning, 0 section mismatches

Warnings:
drivers/net/ethernet/apm/xgene/xgene_enet_main.c:32:36: warning: array ‘xgene_enet_acpi_match’ assumed to have one element

--------------------------------------------------------------------------------
dove_defconfig (arm, gcc-10) — PASS, 0 errors, 0 warnings, 0 section mismatches

--------------------------------------------------------------------------------
e55_defconfig (mips, gcc-10) — PASS, 0 errors, 0 warnings, 0 section mismatches

--------------------------------------------------------------------------------
ebsa110_defconfig (arm, gcc-10) — PASS, 0 errors, 0 warnings, 0 section mismatches

--------------------------------------------------------------------------------
efm32_defconfig (arm, gcc-10) — PASS, 0 errors, 0 warnings, 0 section mismatches

--------------------------------------------------------------------------------
em_x270_defconfig (arm, gcc-10) — PASS, 0 errors, 0 warnings, 0 section mismatches

--------------------------------------------------------------------------------
ep93xx_defconfig (arm, gcc-10) — PASS, 0 errors, 0 warnings, 0 section mismatches

--------------------------------------------------------------------------------
eseries_pxa_defconfig (arm, gcc-10) — PASS, 0 errors, 0 warnings, 0 section mismatches

--------------------------------------------------------------------------------
exynos_defconfig (arm, gcc-10) — PASS, 0 errors, 0 warnings, 0 section mismatches

--------------------------------------------------------------------------------
ezx_defconfig (arm, gcc-10) — PASS, 0 errors, 0 warnings, 0 section mismatches

--------------------------------------------------------------------------------
footbridge_defconfig (arm, gcc-10) — PASS, 0 errors, 0 warnings, 0 section mismatches

--------------------------------------------------------------------------------
fuloong2e_defconfig (mips, gcc-10) — FAIL, 2 errors, 0 warnings, 0 section mismatches

Errors:
cc1: error: ‘-mloongson-mmi’ must be used with ‘-mhard-float’
cc1: error: ‘-mloongson-mmi’ must be used with ‘-mhard-float’

--------------------------------------------------------------------------------
gpr_defconfig (mips, gcc-10) — PASS, 0 errors, 0 warnings, 0 section mismatches

--------------------------------------------------------------------------------
h3600_defconfig (arm, gcc-10) — PASS, 0 errors, 0 warnings, 0 section mismatches

--------------------------------------------------------------------------------
h5000_defconfig (arm, gcc-10) — PASS, 0 errors, 0 warnings, 0 section mismatches

--------------------------------------------------------------------------------
hackkit_defconfig (arm, gcc-10) — PASS, 0 errors, 0 warnings, 0 section mismatches

--------------------------------------------------------------------------------
hisi_defconfig (arm, gcc-10) — PASS, 0 errors, 0 warnings, 0 section mismatches

--------------------------------------------------------------------------------
i386_defconfig (i386, gcc-10) — PASS, 0 errors, 2 warnings, 0 section mismatches

Warnings:
ld: arch/x86/boot/compressed/head_32.o: warning: relocation in read-only section `.head.text'
ld: warning: creating DT_TEXTREL in a PIE

--------------------------------------------------------------------------------
imote2_defconfig (arm, gcc-10) — PASS, 0 errors, 0 warnings, 0 section mismatches

--------------------------------------------------------------------------------
imx_v4_v5_defconfig (arm, gcc-10) — PASS, 0 errors, 0 warnings, 0 section mismatches

--------------------------------------------------------------------------------
imx_v6_v7_defconfig (arm, gcc-10) — PASS, 0 errors, 0 warnings, 0 section mismatches

--------------------------------------------------------------------------------
integrator_defconfig (arm, gcc-10) — PASS, 0 errors, 0 warnings, 0 section mismatches

--------------------------------------------------------------------------------
iop13xx_defconfig (arm, gcc-10) — PASS, 0 errors, 0 warnings, 0 section mismatches

--------------------------------------------------------------------------------
iop32x_defconfig (arm, gcc-10) — PASS, 0 errors, 0 warnings, 0 section mismatches

--------------------------------------------------------------------------------
iop33x_defconfig (arm, gcc-10) — PASS, 0 errors, 0 warnings, 0 section mismatches

--------------------------------------------------------------------------------
ip22_defconfig (mips, gcc-10) — PASS, 0 errors, 1 warning, 0 section mismatches

Warnings:
drivers/net/ethernet/seeq/sgiseeq.c:804:26: warning: passing argument 5 of ‘dma_free_attrs’ makes pointer from integer without a cast [-Wint-conversion]

--------------------------------------------------------------------------------
ip27_defconfig (mips, gcc-10) — FAIL, 0 errors, 0 warnings, 0 section mismatches

--------------------------------------------------------------------------------
ip28_defconfig (mips, gcc-10) — FAIL, 0 errors, 0 warnings, 0 section mismatches

--------------------------------------------------------------------------------
ip32_defconfig (mips, gcc-10) — PASS, 0 errors, 0 warnings, 0 section mismatches

--------------------------------------------------------------------------------
ixp4xx_defconfig (arm, gcc-10) — PASS, 0 errors, 0 warnings, 0 section mismatches

--------------------------------------------------------------------------------
jazz_defconfig (mips, gcc-10) — PASS, 0 errors, 0 warnings, 0 section mismatches

--------------------------------------------------------------------------------
jmr3927_defconfig (mips, gcc-10) — PASS, 0 errors, 0 warnings, 0 section mismatches

--------------------------------------------------------------------------------
jornada720_defconfig (arm, gcc-10) — PASS, 0 errors, 0 warnings, 0 section mismatches

--------------------------------------------------------------------------------
keystone_defconfig (arm, gcc-10) — PASS, 0 errors, 0 warnings, 0 section mismatches

--------------------------------------------------------------------------------
ks8695_defconfig (arm, gcc-10) — PASS, 0 errors, 0 warnings, 0 section mismatches

--------------------------------------------------------------------------------
lart_defconfig (arm, gcc-10) — PASS, 0 errors, 0 warnings, 0 section mismatches

--------------------------------------------------------------------------------
lasat_defconfig (mips, gcc-10) — PASS, 0 errors, 0 warnings, 0 section mismatches

--------------------------------------------------------------------------------
lemote2f_defconfig (mips, gcc-10) — FAIL, 2 errors, 0 warnings, 0 section mismatches

Errors:
cc1: error: ‘-mloongson-mmi’ must be used with ‘-mhard-float’
cc1: error: ‘-mloongson-mmi’ must be used with ‘-mhard-float’

--------------------------------------------------------------------------------
loongson3_defconfig (mips, gcc-10) — PASS, 0 errors, 0 warnings, 0 section mismatches

--------------------------------------------------------------------------------
lpc18xx_defconfig (arm, gcc-10) — PASS, 0 errors, 0 warnings, 0 section mismatches

--------------------------------------------------------------------------------
lpc32xx_defconfig (arm, gcc-10) — PASS, 0 errors, 1 warning, 0 section mismatches

Warnings:
arch/arm/mach-lpc32xx/phy3250.c:215:36: warning: duplicate ‘const’ declaration specifier [-Wduplicate-decl-specifier]

--------------------------------------------------------------------------------
lpd270_defconfig (arm, gcc-10) — PASS, 0 errors, 0 warnings, 0 section mismatches

--------------------------------------------------------------------------------
ls1b_defconfig (mips, gcc-10) — PASS, 0 errors, 0 warnings, 0 section mismatches

--------------------------------------------------------------------------------
lubbock_defconfig (arm, gcc-10) — PASS, 0 errors, 0 warnings, 0 section mismatches

--------------------------------------------------------------------------------
magician_defconfig (arm, gcc-10) — PASS, 0 errors, 0 warnings, 0 section mismatches

--------------------------------------------------------------------------------
mainstone_defconfig (arm, gcc-10) — PASS, 0 errors, 0 warnings, 0 section mismatches

--------------------------------------------------------------------------------
malta_defconfig (mips, gcc-10) — PASS, 0 errors, 0 warnings, 0 section mismatches

--------------------------------------------------------------------------------
malta_kvm_defconfig (mips, gcc-10) — PASS, 0 errors, 0 warnings, 0 section mismatches

--------------------------------------------------------------------------------
malta_kvm_guest_defconfig (mips, gcc-10) — PASS, 0 errors, 0 warnings, 0 section mismatches

--------------------------------------------------------------------------------
malta_qemu_32r6_defconfig (mips, gcc-10) — PASS, 0 errors, 0 warnings, 0 section mismatches

--------------------------------------------------------------------------------
maltaaprp_defconfig (mips, gcc-10) — PASS, 0 errors, 0 warnings, 0 section mismatches

--------------------------------------------------------------------------------
maltasmvp_defconfig (mips, gcc-10) — PASS, 0 errors, 0 warnings, 0 section mismatches

--------------------------------------------------------------------------------
maltasmvp_eva_defconfig (mips, gcc-10) — PASS, 0 errors, 0 warnings, 0 section mismatches

--------------------------------------------------------------------------------
maltaup_defconfig (mips, gcc-10) — PASS, 0 errors, 0 warnings, 0 section mismatches

--------------------------------------------------------------------------------
maltaup_xpa_defconfig (mips, gcc-10) — PASS, 0 errors, 0 warnings, 0 section mismatches

--------------------------------------------------------------------------------
markeins_defconfig (mips, gcc-10) — PASS, 0 errors, 0 warnings, 0 section mismatches

--------------------------------------------------------------------------------
mini2440_defconfig (arm, gcc-10) — PASS, 0 errors, 1 warning, 0 section mismatches

Warnings:
drivers/tty/serial/samsung.c:1780:34: warning: array ‘s3c24xx_uart_dt_match’ assumed to have one element

--------------------------------------------------------------------------------
mips_paravirt_defconfig (mips, gcc-10) — PASS, 0 errors, 0 warnings, 0 section mismatches

--------------------------------------------------------------------------------
mmp2_defconfig (arm, gcc-10) — PASS, 0 errors, 0 warnings, 0 section mismatches

--------------------------------------------------------------------------------
mpc30x_defconfig (mips, gcc-10) — PASS, 0 errors, 0 warnings, 0 section mismatches

--------------------------------------------------------------------------------
msp71xx_defconfig (mips, gcc-10) — PASS, 0 errors, 0 warnings, 0 section mismatches

--------------------------------------------------------------------------------
mtx1_defconfig (mips, gcc-10) — PASS, 0 errors, 3 warnings, 0 section mismatches

Warnings:
sound/pci/echoaudio/echoaudio_dsp.c:647:9: warning: iteration 1073741824 invokes undefined behavior [-Waggressive-loop-optimizations]
sound/pci/echoaudio/echoaudio_dsp.c:658:9: warning: iteration 1073741824 invokes undefined behavior [-Waggressive-loop-optimizations]
sound/pci/echoaudio/echoaudio_dsp.c:647:9: warning: iteration 1073741824 invokes undefined behavior [-Waggressive-loop-optimizations]

--------------------------------------------------------------------------------
multi_v5_defconfig (arm, gcc-10) — PASS, 0 errors, 0 warnings, 0 section mismatches

--------------------------------------------------------------------------------
multi_v7_defconfig (arm, gcc-10) — PASS, 0 errors, 0 warnings, 0 section mismatches

--------------------------------------------------------------------------------
mv78xx0_defconfig (arm, gcc-10) — PASS, 0 errors, 0 warnings, 0 section mismatches

--------------------------------------------------------------------------------
mvebu_v5_defconfig (arm, gcc-10) — PASS, 0 errors, 0 warnings, 0 section mismatches

--------------------------------------------------------------------------------
mvebu_v7_defconfig (arm, gcc-10) — PASS, 0 errors, 0 warnings, 0 section mismatches

--------------------------------------------------------------------------------
mxs_defconfig (arm, gcc-10) — PASS, 0 errors, 1 warning, 0 section mismatches

Warnings:
arch/arm/mach-mxs/mach-mxs.c:285:26: warning: duplicate ‘const’ declaration specifier [-Wduplicate-decl-specifier]

--------------------------------------------------------------------------------
neponset_defconfig (arm, gcc-10) — PASS, 0 errors, 0 warnings, 0 section mismatches

--------------------------------------------------------------------------------
netwinder_defconfig (arm, gcc-10) — PASS, 0 errors, 0 warnings, 0 section mismatches

--------------------------------------------------------------------------------
netx_defconfig (arm, gcc-10) — PASS, 0 errors, 0 warnings, 0 section mismatches

--------------------------------------------------------------------------------
nhk8815_defconfig (arm, gcc-10) — PASS, 0 errors, 0 warnings, 0 section mismatches

--------------------------------------------------------------------------------
nlm_xlp_defconfig (mips, gcc-10) — PASS, 0 errors, 0 warnings, 0 section mismatches

--------------------------------------------------------------------------------
nlm_xlr_defconfig (mips, gcc-10) — PASS, 0 errors, 0 warnings, 0 section mismatches

--------------------------------------------------------------------------------
nsim_hs_defconfig (arc, gcc-10) — PASS, 0 errors, 0 warnings, 0 section mismatches

--------------------------------------------------------------------------------
nsim_hs_smp_defconfig (arc, gcc-10) — PASS, 0 errors, 0 warnings, 0 section mismatches

--------------------------------------------------------------------------------
nsimosci_hs_defconfig (arc, gcc-10) — PASS, 0 errors, 0 warnings, 0 section mismatches

--------------------------------------------------------------------------------
nsimosci_hs_smp_defconfig (arc, gcc-10) — PASS, 0 errors, 0 warnings, 0 section mismatches

--------------------------------------------------------------------------------
nuc910_defconfig (arm, gcc-10) — PASS, 0 errors, 0 warnings, 0 section mismatches

--------------------------------------------------------------------------------
nuc950_defconfig (arm, gcc-10) — PASS, 0 errors, 0 warnings, 0 section mismatches

--------------------------------------------------------------------------------
nuc960_defconfig (arm, gcc-10) — PASS, 0 errors, 0 warnings, 0 section mismatches

--------------------------------------------------------------------------------
omap1_defconfig (arm, gcc-10) — PASS, 0 errors, 1 warning, 0 section mismatches

Warnings:
drivers/gpio/gpio-omap.c:1161:34: warning: array ‘omap_gpio_match’ assumed to have one element

--------------------------------------------------------------------------------
omap2plus_defconfig (arm, gcc-10) — PASS, 0 errors, 1 warning, 0 section mismatches

Warnings:
drivers/cpufreq/ti-cpufreq.c:250:24: warning: passing argument 1 of ‘PTR_ERR_OR_ZERO’ makes pointer from integer without a cast [-Wint-conversion]

--------------------------------------------------------------------------------
orion5x_defconfig (arm, gcc-10) — PASS, 0 errors, 0 warnings, 0 section mismatches

--------------------------------------------------------------------------------
palmz72_defconfig (arm, gcc-10) — PASS, 0 errors, 0 warnings, 0 section mismatches

--------------------------------------------------------------------------------
pcm027_defconfig (arm, gcc-10) — PASS, 0 errors, 0 warnings, 0 section mismatches

--------------------------------------------------------------------------------
pleb_defconfig (arm, gcc-10) — PASS, 0 errors, 0 warnings, 0 section mismatches

--------------------------------------------------------------------------------
pnx8335_stb225_defconfig (mips, gcc-10) — PASS, 0 errors, 0 warnings, 0 section mismatches

--------------------------------------------------------------------------------
prima2_defconfig (arm, gcc-10) — PASS, 0 errors, 0 warnings, 0 section mismatches

--------------------------------------------------------------------------------
pxa168_defconfig (arm, gcc-10) — PASS, 0 errors, 0 warnings, 0 section mismatches

--------------------------------------------------------------------------------
pxa255-idp_defconfig (arm, gcc-10) — PASS, 0 errors, 0 warnings, 0 section mismatches

--------------------------------------------------------------------------------
pxa3xx_defconfig (arm, gcc-10) — PASS, 0 errors, 0 warnings, 0 section mismatches

--------------------------------------------------------------------------------
pxa910_defconfig (arm, gcc-10) — PASS, 0 errors, 0 warnings, 0 section mismatches

--------------------------------------------------------------------------------
qcom_defconfig (arm, gcc-10) — PASS, 0 errors, 0 warnings, 0 section mismatches

--------------------------------------------------------------------------------
qi_lb60_defconfig (mips, gcc-10) — PASS, 0 errors, 0 warnings, 0 section mismatches

--------------------------------------------------------------------------------
raumfeld_defconfig (arm, gcc-10) — PASS, 0 errors, 0 warnings, 0 section mismatches

--------------------------------------------------------------------------------
rb532_defconfig (mips, gcc-10) — PASS, 0 errors, 0 warnings, 0 section mismatches

--------------------------------------------------------------------------------
rbtx49xx_defconfig (mips, gcc-10) — PASS, 0 errors, 0 warnings, 0 section mismatches

--------------------------------------------------------------------------------
realview-smp_defconfig (arm, gcc-10) — PASS, 0 errors, 0 warnings, 0 section mismatches

--------------------------------------------------------------------------------
realview_defconfig (arm, gcc-10) — PASS, 0 errors, 0 warnings, 0 section mismatches

--------------------------------------------------------------------------------
rm200_defconfig (mips, gcc-10) — PASS, 0 errors, 0 warnings, 0 section mismatches

--------------------------------------------------------------------------------
rpc_defconfig (arm, gcc-10) — FAIL, 4 errors, 0 warnings, 0 section mismatches

Errors:
arm-linux-gnueabihf-gcc: error: unrecognized -march target: armv3
arm-linux-gnueabihf-gcc: error: missing argument to ‘-march=’
arm-linux-gnueabihf-gcc: error: unrecognized -march target: armv3
arm-linux-gnueabihf-gcc: error: missing argument to ‘-march=’

--------------------------------------------------------------------------------
rt305x_defconfig (mips, gcc-10) — PASS, 0 errors, 0 warnings, 0 section mismatches

--------------------------------------------------------------------------------
s3c2410_defconfig (arm, gcc-10) — PASS, 0 errors, 1 warning, 0 section mismatches

Warnings:
drivers/tty/serial/samsung.c:1780:34: warning: array ‘s3c24xx_uart_dt_match’ assumed to have one element

--------------------------------------------------------------------------------
s3c6400_defconfig (arm, gcc-10) — PASS, 0 errors, 2 warnings, 0 section mismatches

Warnings:
drivers/mmc/host/sdhci-s3c.c:429:34: warning: array ‘sdhci_s3c_dt_match’ assumed to have one element
drivers/tty/serial/samsung.c:1780:34: warning: array ‘s3c24xx_uart_dt_match’ assumed to have one element

--------------------------------------------------------------------------------
s5pv210_defconfig (arm, gcc-10) — PASS, 0 errors, 0 warnings, 0 section mismatches

--------------------------------------------------------------------------------
sama5_defconfig (arm, gcc-10) — PASS, 0 errors, 0 warnings, 0 section mismatches

--------------------------------------------------------------------------------
sb1250_swarm_defconfig (mips, gcc-10) — PASS, 0 errors, 0 warnings, 0 section mismatches

--------------------------------------------------------------------------------
sead3_defconfig (mips, gcc-10) — PASS, 0 errors, 0 warnings, 0 section mismatches

--------------------------------------------------------------------------------
sead3micro_defconfig (mips, gcc-10) — PASS, 0 errors, 0 warnings, 0 section mismatches

--------------------------------------------------------------------------------
shannon_defconfig (arm, gcc-10) — PASS, 0 errors, 0 warnings, 0 section mismatches

--------------------------------------------------------------------------------
shmobile_defconfig (arm, gcc-10) — PASS, 0 errors, 0 warnings, 0 section mismatches

--------------------------------------------------------------------------------
simpad_defconfig (arm, gcc-10) — PASS, 0 errors, 0 warnings, 0 section mismatches

--------------------------------------------------------------------------------
socfpga_defconfig (arm, gcc-10) — PASS, 0 errors, 0 warnings, 0 section mismatches

--------------------------------------------------------------------------------
spear13xx_defconfig (arm, gcc-10) — PASS, 0 errors, 0 warnings, 0 section mismatches

--------------------------------------------------------------------------------
spear3xx_defconfig (arm, gcc-10) — PASS, 0 errors, 0 warnings, 0 section mismatches

--------------------------------------------------------------------------------
spear6xx_defconfig (arm, gcc-10) — PASS, 0 errors, 0 warnings, 0 section mismatches

--------------------------------------------------------------------------------
spitz_defconfig (arm, gcc-10) — PASS, 0 errors, 0 warnings, 0 section mismatches

--------------------------------------------------------------------------------
stm32_defconfig (arm, gcc-10) — PASS, 0 errors, 0 warnings, 0 section mismatches

--------------------------------------------------------------------------------
sunxi_defconfig (arm, gcc-10) — PASS, 0 errors, 0 warnings, 0 section mismatches

--------------------------------------------------------------------------------
tb0219_defconfig (mips, gcc-10) — PASS, 0 errors, 0 warnings, 0 section mismatches

--------------------------------------------------------------------------------
tb0226_defconfig (mips, gcc-10) — PASS, 0 errors, 0 warnings, 0 section mismatches

--------------------------------------------------------------------------------
tb0287_defconfig (mips, gcc-10) — PASS, 0 errors, 0 warnings, 0 section mismatches

--------------------------------------------------------------------------------
tct_hammer_defconfig (arm, gcc-10) — PASS, 0 errors, 0 warnings, 0 section mismatches

--------------------------------------------------------------------------------
tegra_defconfig (arm, gcc-10) — PASS, 0 errors, 0 warnings, 0 section mismatches

--------------------------------------------------------------------------------
tinyconfig (arm, gcc-10) — PASS, 0 errors, 0 warnings, 0 section mismatches

--------------------------------------------------------------------------------
tinyconfig (x86_64, gcc-10) — PASS, 0 errors, 3 warnings, 0 section mismatches

Warnings:
arch/x86/entry/entry_64.S:487: Warning: no instruction mnemonic suffix given and no register operands; using default for `btr'
arch/x86/entry/entry_64.S:1660: Warning: no instruction mnemonic suffix given and no register operands; using default for `sysret'
arch/x86/kernel/process.c:456: Warning: no instruction mnemonic suffix given and no register operands; using default for `btr'

--------------------------------------------------------------------------------
tinyconfig (mips, gcc-10) — PASS, 0 errors, 0 warnings, 0 section mismatches

--------------------------------------------------------------------------------
tinyconfig (i386, gcc-10) — PASS, 0 errors, 0 warnings, 0 section mismatches

--------------------------------------------------------------------------------
tinyconfig (arc, gcc-10) — PASS, 0 errors, 0 warnings, 0 section mismatches

--------------------------------------------------------------------------------
trizeps4_defconfig (arm, gcc-10) — PASS, 0 errors, 0 warnings, 0 section mismatches

--------------------------------------------------------------------------------
u300_defconfig (arm, gcc-10) — PASS, 0 errors, 0 warnings, 0 section mismatches

--------------------------------------------------------------------------------
u8500_defconfig (arm, gcc-10) — PASS, 0 errors, 0 warnings, 0 section mismatches

--------------------------------------------------------------------------------
vdk_hs38_defconfig (arc, gcc-10) — PASS, 0 errors, 0 warnings, 0 section mismatches

--------------------------------------------------------------------------------
vdk_hs38_smp_defconfig (arc, gcc-10) — PASS, 0 errors, 0 warnings, 0 section mismatches

--------------------------------------------------------------------------------
versatile_defconfig (arm, gcc-10) — PASS, 0 errors, 0 warnings, 0 section mismatches

--------------------------------------------------------------------------------
vexpress_defconfig (arm, gcc-10) — PASS, 0 errors, 0 warnings, 0 section mismatches

--------------------------------------------------------------------------------
vf610m4_defconfig (arm, gcc-10) — PASS, 0 errors, 0 warnings, 0 section mismatches

--------------------------------------------------------------------------------
viper_defconfig (arm, gcc-10) — PASS, 0 errors, 0 warnings, 0 section mismatches

--------------------------------------------------------------------------------
vt8500_v6_v7_defconfig (arm, gcc-10) — PASS, 0 errors, 0 warnings, 0 section mismatches

--------------------------------------------------------------------------------
workpad_defconfig (mips, gcc-10) — PASS, 0 errors, 0 warnings, 0 section mismatches

--------------------------------------------------------------------------------
x86_64_defconfig (x86_64, gcc-10) — PASS, 0 errors, 6 warnings, 0 section mismatches

Warnings:
arch/x86/entry/entry_64.S:487: Warning: no instruction mnemonic suffix given and no register operands; using default for `btr'
arch/x86/entry/entry_64.S:1660: Warning: no instruction mnemonic suffix given and no register operands; using default for `sysret'
arch/x86/kernel/process.c:456: Warning: no instruction mnemonic suffix given and no register operands; using default for `btr'
arch/x86/kernel/process.c:456: Warning: no instruction mnemonic suffix given and no register operands; using default for `btr'
ld: arch/x86/boot/compressed/head_64.o: warning: relocation in read-only section `.head.text'
ld: warning: creating DT_TEXTREL in a PIE

--------------------------------------------------------------------------------
x86_64_defconfig+x86-chromebook (x86_64, gcc-10) — PASS, 0 errors, 6 warnings, 0 section mismatches

Warnings:
arch/x86/entry/entry_64.S:487: Warning: no instruction mnemonic suffix given and no register operands; using default for `btr'
arch/x86/entry/entry_64.S:1660: Warning: no instruction mnemonic suffix given and no register operands; using default for `sysret'
arch/x86/kernel/process.c:456: Warning: no instruction mnemonic suffix given and no register operands; using default for `btr'
arch/x86/kernel/process.c:456: Warning: no instruction mnemonic suffix given and no register operands; using default for `btr'
ld: arch/x86/boot/compressed/head_64.o: warning: relocation in read-only section `.head.text'
ld: warning: creating DT_TEXTREL in a PIE

--------------------------------------------------------------------------------
xcep_defconfig (arm, gcc-10) — PASS, 0 errors, 0 warnings, 0 section mismatches

--------------------------------------------------------------------------------
xilfpga_defconfig (mips, gcc-10) — PASS, 0 errors, 0 warnings, 0 section mismatches

--------------------------------------------------------------------------------
xway_defconfig (mips, gcc-10) — PASS, 0 errors, 0 warnings, 0 section mismatches

--------------------------------------------------------------------------------
zeus_defconfig (arm, gcc-10) — PASS, 0 errors, 0 warnings, 0 section mismatches

--------------------------------------------------------------------------------
zx_defconfig (arm, gcc-10) — PASS, 0 errors, 0 warnings, 0 section mismatches

---
For more info write to <info@...>


Re: [RESEND PATCH 5.10.y-cip 00/40] Add SD/eMMC support for Renesas RZ/G2L SoC

Pavel Machek
 

Hi!

This patch series adds support for SD/eMMC on Renesas RZ/G2L SoC and
enables this interfaces on Renesas RZ/G2L SMARC EVK.

All the patches have been cherry picked from v5.17 release.

Resending as I had missed a patch (0001) earlier, reset of the patches
havent been changed. And also for some reason patches didnt make into
patchwork.
Testing was successful and the review only uncovered small details, so
I applied and pushed the series. Thanks!

Best regards,
Pavel
--
DENX Software Engineering GmbH, Managing Director: Wolfgang Denk
HRB 165235 Munich, Office: Kirchenstr.5, D-82194 Groebenzell, Germany


[RESEND PATCH 5.10.y-cip 40/40] arm64: dts: renesas: rzg2l-smarc: Enable microSD on SMARC platform

Lad Prabhakar
 

From: Biju Das <biju.das.jz@...>

commit 34cdc0edfe8f6d660e3c4c47d10f5506d08f09e1 upstream.

This patch enables microSD card slot connected to SDHI1 on RZ/G2L SMARC
platform.

Signed-off-by: Biju Das <biju.das.jz@...>
Link: https://lore.kernel.org/r/20211010142520.21976-3-biju.das.jz@bp.renesas.com
Signed-off-by: Geert Uytterhoeven <geert+renesas@...>
[PL: Manually applied the changes]
Signed-off-by: Lad Prabhakar <prabhakar.mahadev-lad.rj@...>
---
arch/arm64/boot/dts/renesas/rzg2l-smarc.dtsi | 62 ++++++++++++++++++++
1 file changed, 62 insertions(+)

diff --git a/arch/arm64/boot/dts/renesas/rzg2l-smarc.dtsi b/arch/arm64/boot/dts/renesas/rzg2l-smarc.dtsi
index 70aca5d0306d..0cd7da8af1d4 100644
--- a/arch/arm64/boot/dts/renesas/rzg2l-smarc.dtsi
+++ b/arch/arm64/boot/dts/renesas/rzg2l-smarc.dtsi
@@ -31,6 +31,16 @@
regulator-min-microvolt = <5000000>;
regulator-max-microvolt = <5000000>;
};
+
+ vccq_sdhi1: regulator-vccq-sdhi1 {
+ compatible = "regulator-gpio";
+ regulator-name = "SDHI1 VccQ";
+ regulator-min-microvolt = <1800000>;
+ regulator-max-microvolt = <3300000>;
+ gpios = <&pinctrl RZG2L_GPIO(39, 1) GPIO_ACTIVE_HIGH>;
+ gpios-states = <1>;
+ states = <3300000 1>, <1800000 0>;
+ };
};

&canfd {
@@ -149,6 +159,45 @@
<RZG2L_PORT_PINMUX(48, 4, 1)>; /* RTS# */
};

+ sd1-pwr-en-hog {
+ gpio-hog;
+ gpios = <RZG2L_GPIO(39, 2) GPIO_ACTIVE_HIGH>;
+ output-high;
+ line-name = "sd1_pwr_en";
+ };
+
+ sdhi1_pins: sd1 {
+ sd1_data {
+ pins = "SD1_DATA0", "SD1_DATA1", "SD1_DATA2", "SD1_DATA3";
+ power-source = <3300>;
+ };
+
+ sd1_ctrl {
+ pins = "SD1_CLK", "SD1_CMD";
+ power-source = <3300>;
+ };
+
+ sd1_mux {
+ pinmux = <RZG2L_PORT_PINMUX(19, 0, 1)>; /* SD1_CD */
+ };
+ };
+
+ sdhi1_pins_uhs: sd1_uhs {
+ sd1_data_uhs {
+ pins = "SD1_DATA0", "SD1_DATA1", "SD1_DATA2", "SD1_DATA3";
+ power-source = <1800>;
+ };
+
+ sd1_ctrl_uhs {
+ pins = "SD1_CLK", "SD1_CMD";
+ power-source = <1800>;
+ };
+
+ sd1_mux_uhs {
+ pinmux = <RZG2L_PORT_PINMUX(19, 0, 1)>; /* SD1_CD */
+ };
+ };
+
usb0_pins: usb0 {
pinmux = <RZG2L_PORT_PINMUX(4, 0, 1)>, /* VBUS */
<RZG2L_PORT_PINMUX(5, 0, 1)>, /* OVC */
@@ -184,6 +233,19 @@
};
#endif

+&sdhi1 {
+ pinctrl-0 = <&sdhi1_pins>;
+ pinctrl-1 = <&sdhi1_pins_uhs>;
+ pinctrl-names = "default", "state_uhs";
+
+ vmmc-supply = <&reg_3p3v>;
+ vqmmc-supply = <&vccq_sdhi1>;
+ bus-width = <4>;
+ sd-uhs-sdr50;
+ sd-uhs-sdr104;
+ status = "okay";
+};
+
&usb2_phy0 {
pinctrl-0 = <&usb0_pins>;
pinctrl-names = "default";
--
2.17.1


[RESEND PATCH 5.10.y-cip 39/40] arm64: dts: renesas: rzg2l-smarc-som: Enable eMMC on SMARC platform

Lad Prabhakar
 

From: Biju Das <biju.das.jz@...>

commit a60a311cb8d0cddaaeb1eee22bfd76138e6b5ad6 upstream.

RZ/G2L SoM has both 64 GB eMMC and microSD connected to SDHI0.

Both these interfaces are mutually exclusive and the SD0 device
selection is based on the XOR between GPIO_SD0_DEV_SEL and SW1[2]
switch position.

This patch sets GPIO_SD0_DEV_SEL to high in DT. Use the below switch
setting logic for device selection between eMMC and microSD slot
connected to SDHI0.

Set SW1[2] to position 2/OFF for selecting eMMC
Set SW1[2] to position 3/ON for selecting microSD

This patch enables eMMC on RZ/G2L SMARC platform by default.

Signed-off-by: Biju Das <biju.das.jz@...>
Link: https://lore.kernel.org/r/20211010142520.21976-2-biju.das.jz@bp.renesas.com
Signed-off-by: Geert Uytterhoeven <geert+renesas@...>
[PL: Manually applied the changes]
Signed-off-by: Lad Prabhakar <prabhakar.mahadev-lad.rj@...>
---
.../boot/dts/renesas/rzg2l-smarc-som.dtsi | 143 ++++++++++++++++++
1 file changed, 143 insertions(+)

diff --git a/arch/arm64/boot/dts/renesas/rzg2l-smarc-som.dtsi b/arch/arm64/boot/dts/renesas/rzg2l-smarc-som.dtsi
index 9804ca0fd528..c496c3bf212b 100644
--- a/arch/arm64/boot/dts/renesas/rzg2l-smarc-som.dtsi
+++ b/arch/arm64/boot/dts/renesas/rzg2l-smarc-som.dtsi
@@ -5,8 +5,19 @@
* Copyright (C) 2021 Renesas Electronics Corp.
*/

+#include <dt-bindings/gpio/gpio.h>
#include <dt-bindings/pinctrl/rzg2l-pinctrl.h>

+/* SW1[2] should be at position 2/OFF to enable 64 GB eMMC */
+#define EMMC 1
+
+/*
+ * To enable uSD card on CN3,
+ * SW1[2] should be at position 3/ON.
+ * Disable eMMC by setting "#define EMMC 0" above.
+ */
+#define SDHI (!EMMC)
+
/ {
aliases {
ethernet0 = &eth0;
@@ -22,6 +33,36 @@
/* first 128MB is reserved for secure area. */
reg = <0x0 0x48000000 0x0 0x78000000>;
};
+
+ reg_1p8v: regulator0 {
+ compatible = "regulator-fixed";
+ regulator-name = "fixed-1.8V";
+ regulator-min-microvolt = <1800000>;
+ regulator-max-microvolt = <1800000>;
+ regulator-boot-on;
+ regulator-always-on;
+ };
+
+ reg_3p3v: regulator1 {
+ compatible = "regulator-fixed";
+ regulator-name = "fixed-3.3V";
+ regulator-min-microvolt = <3300000>;
+ regulator-max-microvolt = <3300000>;
+ regulator-boot-on;
+ regulator-always-on;
+ };
+
+ vccq_sdhi0: regulator-vccq-sdhi0 {
+ compatible = "regulator-gpio";
+
+ regulator-name = "SDHI0 VccQ";
+ regulator-min-microvolt = <1800000>;
+ regulator-max-microvolt = <3300000>;
+ states = <3300000 1>, <1800000 0>;
+ regulator-boot-on;
+ gpios = <&pinctrl RZG2L_GPIO(39, 0) GPIO_ACTIVE_HIGH>;
+ regulator-always-on;
+ };
};

&adc {
@@ -130,6 +171,13 @@
<RZG2L_PORT_PINMUX(36, 0, 1)>; /* ET1_RXD3 */
};

+ gpio-sd0-pwr-en-hog {
+ gpio-hog;
+ gpios = <RZG2L_GPIO(4, 1) GPIO_ACTIVE_HIGH>;
+ output-high;
+ line-name = "gpio_sd0_pwr_en";
+ };
+
qspi0_pins: qspi0 {
qspi0-data {
pins = "QSPI0_IO0", "QSPI0_IO1", "QSPI0_IO2", "QSPI0_IO3";
@@ -141,6 +189,70 @@
power-source = <1800>;
};
};
+
+ /*
+ * SD0 device selection is XOR between GPIO_SD0_DEV_SEL and SW1[2]
+ * The below switch logic can be used to select the device between
+ * eMMC and microSD, after setting GPIO_SD0_DEV_SEL to high in DT.
+ * SW1[2] should be at position 2/OFF to enable 64 GB eMMC
+ * SW1[2] should be at position 3/ON to enable uSD card CN3
+ */
+ sd0-dev-sel-hog {
+ gpio-hog;
+ gpios = <RZG2L_GPIO(41, 1) GPIO_ACTIVE_HIGH>;
+ output-high;
+ line-name = "sd0_dev_sel";
+ };
+
+ sdhi0_emmc_pins: sd0emmc {
+ sd0_emmc_data {
+ pins = "SD0_DATA0", "SD0_DATA1", "SD0_DATA2", "SD0_DATA3",
+ "SD0_DATA4", "SD0_DATA5", "SD0_DATA6", "SD0_DATA7";
+ power-source = <1800>;
+ };
+
+ sd0_emmc_ctrl {
+ pins = "SD0_CLK", "SD0_CMD";
+ power-source = <1800>;
+ };
+
+ sd0_emmc_rst {
+ pins = "SD0_RST#";
+ power-source = <1800>;
+ };
+ };
+
+ sdhi0_pins: sd0 {
+ sd0_data {
+ pins = "SD0_DATA0", "SD0_DATA1", "SD0_DATA2", "SD0_DATA3";
+ power-source = <3300>;
+ };
+
+ sd0_ctrl {
+ pins = "SD0_CLK", "SD0_CMD";
+ power-source = <3300>;
+ };
+
+ sd0_mux {
+ pinmux = <RZG2L_PORT_PINMUX(47, 0, 2)>; /* SD0_CD */
+ };
+ };
+
+ sdhi0_pins_uhs: sd0_uhs {
+ sd0_data_uhs {
+ pins = "SD0_DATA0", "SD0_DATA1", "SD0_DATA2", "SD0_DATA3";
+ power-source = <1800>;
+ };
+
+ sd0_ctrl_uhs {
+ pins = "SD0_CLK", "SD0_CMD";
+ power-source = <1800>;
+ };
+
+ sd0_mux_uhs {
+ pinmux = <RZG2L_PORT_PINMUX(47, 0, 2)>; /* SD0_CD */
+ };
+ };
};

&sbc {
@@ -170,3 +282,34 @@
};
};
};
+
+#if SDHI
+&sdhi0 {
+ pinctrl-0 = <&sdhi0_pins>;
+ pinctrl-1 = <&sdhi0_pins_uhs>;
+ pinctrl-names = "default", "state_uhs";
+
+ vmmc-supply = <&reg_3p3v>;
+ vqmmc-supply = <&vccq_sdhi0>;
+ bus-width = <4>;
+ sd-uhs-sdr50;
+ sd-uhs-sdr104;
+ status = "okay";
+};
+#endif
+
+#if EMMC
+&sdhi0 {
+ pinctrl-0 = <&sdhi0_emmc_pins>;
+ pinctrl-1 = <&sdhi0_emmc_pins>;
+ pinctrl-names = "default", "state_uhs";
+
+ vmmc-supply = <&reg_3p3v>;
+ vqmmc-supply = <&reg_1p8v>;
+ bus-width = <8>;
+ mmc-hs200-1_8v;
+ non-removable;
+ fixed-emmc-driver-type = <1>;
+ status = "okay";
+};
+#endif
--
2.17.1


[RESEND PATCH 5.10.y-cip 38/40] arm64: dts: renesas: r9a07g044: Add SDHI nodes

Lad Prabhakar
 

From: Biju Das <biju.das.jz@...>

commit a83ad872f4ba6b9fbf81b9f70d6ff6d61d74bf7e upstream.

Add SDHI{0, 1} nodes to RZ/G2L SoC DTSI.

Signed-off-by: Biju Das <biju.das.jz@...>
Link: https://lore.kernel.org/r/20211007155451.10654-2-biju.das.jz@bp.renesas.com
Signed-off-by: Geert Uytterhoeven <geert+renesas@...>
Signed-off-by: Lad Prabhakar <prabhakar.mahadev-lad.rj@...>
---
arch/arm64/boot/dts/renesas/r9a07g044.dtsi | 32 ++++++++++++++++++++++
1 file changed, 32 insertions(+)

diff --git a/arch/arm64/boot/dts/renesas/r9a07g044.dtsi b/arch/arm64/boot/dts/renesas/r9a07g044.dtsi
index ebe155ccd721..468a3d8cbd1f 100644
--- a/arch/arm64/boot/dts/renesas/r9a07g044.dtsi
+++ b/arch/arm64/boot/dts/renesas/r9a07g044.dtsi
@@ -460,6 +460,38 @@
interrupts = <GIC_PPI 9 IRQ_TYPE_LEVEL_LOW>;
};

+ sdhi0: mmc@11c00000 {
+ compatible = "renesas,sdhi-r9a07g044",
+ "renesas,rcar-gen3-sdhi";
+ reg = <0x0 0x11c00000 0 0x10000>;
+ interrupts = <GIC_SPI 104 IRQ_TYPE_LEVEL_HIGH>,
+ <GIC_SPI 105 IRQ_TYPE_LEVEL_HIGH>;
+ clocks = <&cpg CPG_MOD R9A07G044_SDHI0_IMCLK>,
+ <&cpg CPG_MOD R9A07G044_SDHI0_IMCLK2>,
+ <&cpg CPG_MOD R9A07G044_SDHI0_CLK_HS>,
+ <&cpg CPG_MOD R9A07G044_SDHI0_ACLK>;
+ clock-names = "imclk", "imclk2", "clk_hs", "aclk";
+ resets = <&cpg R9A07G044_SDHI0_IXRST>;
+ power-domains = <&cpg>;
+ status = "disabled";
+ };
+
+ sdhi1: mmc@11c10000 {
+ compatible = "renesas,sdhi-r9a07g044",
+ "renesas,rcar-gen3-sdhi";
+ reg = <0x0 0x11c10000 0 0x10000>;
+ interrupts = <GIC_SPI 106 IRQ_TYPE_LEVEL_HIGH>,
+ <GIC_SPI 107 IRQ_TYPE_LEVEL_HIGH>;
+ clocks = <&cpg CPG_MOD R9A07G044_SDHI1_IMCLK>,
+ <&cpg CPG_MOD R9A07G044_SDHI1_IMCLK2>,
+ <&cpg CPG_MOD R9A07G044_SDHI1_CLK_HS>,
+ <&cpg CPG_MOD R9A07G044_SDHI1_ACLK>;
+ clock-names = "imclk", "imclk2", "clk_hs", "aclk";
+ resets = <&cpg R9A07G044_SDHI1_IXRST>;
+ power-domains = <&cpg>;
+ status = "disabled";
+ };
+
eth0: ethernet@11c20000 {
compatible = "renesas,r9a07g044-gbeth",
"renesas,rzg2l-gbeth";
--
2.17.1


[RESEND PATCH 5.10.y-cip 37/40] dt-bindings: mmc: renesas,sdhi: Rename RZ/G2L clocks

Lad Prabhakar
 

From: Biju Das <biju.das.jz@...>

commit 217c7d1840b5377543eff84fe28409d0bd4d3433 upstream.

Rename the below RZ/G2L clocks to match with the clock names used in
R-Car Gen2 and later generations.

imclk->core
clk_hs->clkh
imclk2->cd

This changes will avoid using fallback for RZ/G2L high speed clock,
if "clkh" is not used in device tree and also the code changes in
driver related to this clocks.

Signed-off-by: Biju Das <biju.das.jz@...>
Reviewed-by: Wolfram Sang <wsa+renesas@...>
Acked-by: Ulf Hansson <ulf.hansson@...>
Link: https://lore.kernel.org/r/20211122103905.14439-2-biju.das.jz@bp.renesas.com
Signed-off-by: Geert Uytterhoeven <geert+renesas@...>
Signed-off-by: Lad Prabhakar <prabhakar.mahadev-lad.rj@...>
---
.../devicetree/bindings/mmc/renesas,sdhi.yaml | 10 +++++-----
1 file changed, 5 insertions(+), 5 deletions(-)

diff --git a/Documentation/devicetree/bindings/mmc/renesas,sdhi.yaml b/Documentation/devicetree/bindings/mmc/renesas,sdhi.yaml
index c20ee9e5b8e8..3aeff9036628 100644
--- a/Documentation/devicetree/bindings/mmc/renesas,sdhi.yaml
+++ b/Documentation/devicetree/bindings/mmc/renesas,sdhi.yaml
@@ -112,17 +112,17 @@ allOf:
clocks:
items:
- description: IMCLK, SDHI channel main clock1.
+ - description: CLK_HS, SDHI channel High speed clock which operates
+ 4 times that of SDHI channel main clock1.
- description: IMCLK2, SDHI channel main clock2. When this clock is
turned off, external SD card detection cannot be
detected.
- - description: CLK_HS, SDHI channel High speed clock which operates
- 4 times that of SDHI channel main clock1.
- description: ACLK, SDHI channel bus clock.
clock-names:
items:
- - const: imclk
- - const: imclk2
- - const: clk_hs
+ - const: core
+ - const: clkh
+ - const: cd
- const: aclk
required:
- clock-names
--
2.17.1


[RESEND PATCH 5.10.y-cip 36/40] dt-bindings: mmc: renesas,sdhi: Add optional SDnH clock

Lad Prabhakar
 

From: Wolfram Sang <wsa+renesas@...>

commit e051025efac3929ca7e3e2f2c8860d3447366ebc upstream.

This only applies to R-Car Gen2 and later generations, so we need to
distinguish.

Signed-off-by: Wolfram Sang <wsa+renesas@...>
Acked-by: Ulf Hansson <ulf.hansson@...>
Link: https://lore.kernel.org/r/20211115160600.4455-1-wsa+renesas@sang-engineering.com
Signed-off-by: Geert Uytterhoeven <geert+renesas@...>
Signed-off-by: Lad Prabhakar <prabhakar.mahadev-lad.rj@...>
---
.../devicetree/bindings/mmc/renesas,sdhi.yaml | 38 ++++++++++++++-----
1 file changed, 29 insertions(+), 9 deletions(-)

diff --git a/Documentation/devicetree/bindings/mmc/renesas,sdhi.yaml b/Documentation/devicetree/bindings/mmc/renesas,sdhi.yaml
index 77b1bb907497..c20ee9e5b8e8 100644
--- a/Documentation/devicetree/bindings/mmc/renesas,sdhi.yaml
+++ b/Documentation/devicetree/bindings/mmc/renesas,sdhi.yaml
@@ -128,15 +128,35 @@ allOf:
- clock-names
- resets
else:
- properties:
- clocks:
- minItems: 1
- maxItems: 2
- clock-names:
- minItems: 1
- items:
- - const: core
- - const: cd
+ if:
+ properties:
+ compatible:
+ contains:
+ enum:
+ - renesas,rcar-gen2-sdhi
+ - renesas,rcar-gen3-sdhi
+ then:
+ properties:
+ clocks:
+ minItems: 1
+ maxItems: 3
+ clock-names:
+ minItems: 1
+ uniqueItems: true
+ items:
+ - const: core
+ - enum: [ clkh, cd ]
+ - const: cd
+ else:
+ properties:
+ clocks:
+ minItems: 1
+ maxItems: 2
+ clock-names:
+ minItems: 1
+ items:
+ - const: core
+ - const: cd

- if:
properties:
--
2.17.1


[RESEND PATCH 5.10.y-cip 35/40] dt-bindings: mmc: renesas,sdhi: Document RZ/G2L bindings

Lad Prabhakar
 

From: Biju Das <biju.das.jz@...>

commit bfadee4554c3782bfbc5943866bd2ad44d631e50 upstream.

Document RZ/G2L SDHI controller bindings.

Signed-off-by: Biju Das <biju.das.jz@...>
Reviewed-by: Lad Prabhakar <prabhakar.mahadev-lad.rj@...>
Reviewed-by: Rob Herring <robh@...>
Link: https://lore.kernel.org/r/20210817090313.31858-3-biju.das.jz@bp.renesas.com
Signed-off-by: Ulf Hansson <ulf.hansson@...>
[PL: Manually applied the changes]
Signed-off-by: Lad Prabhakar <prabhakar.mahadev-lad.rj@...>
---
.../devicetree/bindings/mmc/renesas,sdhi.yaml | 71 +++++++++++++------
1 file changed, 51 insertions(+), 20 deletions(-)

diff --git a/Documentation/devicetree/bindings/mmc/renesas,sdhi.yaml b/Documentation/devicetree/bindings/mmc/renesas,sdhi.yaml
index 16050b29bc89..77b1bb907497 100644
--- a/Documentation/devicetree/bindings/mmc/renesas,sdhi.yaml
+++ b/Documentation/devicetree/bindings/mmc/renesas,sdhi.yaml
@@ -44,18 +44,19 @@ properties:
- const: renesas,sdhi-mmc-r8a77470 # RZ/G1C (SDHI/MMC IP)
- items:
- enum:
- - renesas,sdhi-r8a774a1 # RZ/G2M
- - renesas,sdhi-r8a774b1 # RZ/G2N
- - renesas,sdhi-r8a774c0 # RZ/G2E
- - renesas,sdhi-r8a774e1 # RZ/G2H
- - renesas,sdhi-r8a7795 # R-Car H3
- - renesas,sdhi-r8a7796 # R-Car M3-W
- - renesas,sdhi-r8a77961 # R-Car M3-W+
- - renesas,sdhi-r8a77965 # R-Car M3-N
- - renesas,sdhi-r8a77970 # R-Car V3M
- - renesas,sdhi-r8a77980 # R-Car V3H
- - renesas,sdhi-r8a77990 # R-Car E3
- - renesas,sdhi-r8a77995 # R-Car D3
+ - renesas,sdhi-r8a774a1 # RZ/G2M
+ - renesas,sdhi-r8a774b1 # RZ/G2N
+ - renesas,sdhi-r8a774c0 # RZ/G2E
+ - renesas,sdhi-r8a774e1 # RZ/G2H
+ - renesas,sdhi-r8a7795 # R-Car H3
+ - renesas,sdhi-r8a7796 # R-Car M3-W
+ - renesas,sdhi-r8a77961 # R-Car M3-W+
+ - renesas,sdhi-r8a77965 # R-Car M3-N
+ - renesas,sdhi-r8a77970 # R-Car V3M
+ - renesas,sdhi-r8a77980 # R-Car V3H
+ - renesas,sdhi-r8a77990 # R-Car E3
+ - renesas,sdhi-r8a77995 # R-Car D3
+ - renesas,sdhi-r9a07g044 # RZ/G2{L,LC}
- const: renesas,rcar-gen3-sdhi # R-Car Gen3 or RZ/G2

reg:
@@ -65,15 +66,9 @@ properties:
minItems: 1
maxItems: 3

- clocks:
- minItems: 1
- maxItems: 2
+ clocks: true

- clock-names:
- minItems: 1
- items:
- - const: core
- - const: cd
+ clock-names: true

dmas:
minItems: 4
@@ -107,6 +102,42 @@ properties:
allOf:
- $ref: "mmc-controller.yaml"

+ - if:
+ properties:
+ compatible:
+ contains:
+ const: renesas,sdhi-r9a07g044
+ then:
+ properties:
+ clocks:
+ items:
+ - description: IMCLK, SDHI channel main clock1.
+ - description: IMCLK2, SDHI channel main clock2. When this clock is
+ turned off, external SD card detection cannot be
+ detected.
+ - description: CLK_HS, SDHI channel High speed clock which operates
+ 4 times that of SDHI channel main clock1.
+ - description: ACLK, SDHI channel bus clock.
+ clock-names:
+ items:
+ - const: imclk
+ - const: imclk2
+ - const: clk_hs
+ - const: aclk
+ required:
+ - clock-names
+ - resets
+ else:
+ properties:
+ clocks:
+ minItems: 1
+ maxItems: 2
+ clock-names:
+ minItems: 1
+ items:
+ - const: core
+ - const: cd
+
- if:
properties:
compatible:
--
2.17.1


[RESEND PATCH 5.10.y-cip 34/40] dt-bindings: mmc: renesas,sdhi: Fix dtbs-check warning

Lad Prabhakar
 

From: Biju Das <biju.das.jz@...>

commit 4aba5dc71eae041aa1a9240de10ad2e30e9f32dd upstream.

Fix dtbs-check warning pinctrl-names:0:'default' was expected
for r8a77470-iwg23s-sbc.dts file.

Signed-off-by: Biju Das <biju.das.jz@...>
Reviewed-by: Lad Prabhakar <prabhakar.mahadev-lad.rj@...>
Reviewed-by: Rob Herring <robh@...>
Link: https://lore.kernel.org/r/20210817090313.31858-2-biju.das.jz@bp.renesas.com
Signed-off-by: Ulf Hansson <ulf.hansson@...>
Signed-off-by: Lad Prabhakar <prabhakar.mahadev-lad.rj@...>
---
.../devicetree/bindings/mmc/renesas,sdhi.yaml | 60 ++++++++++++-------
1 file changed, 37 insertions(+), 23 deletions(-)

diff --git a/Documentation/devicetree/bindings/mmc/renesas,sdhi.yaml b/Documentation/devicetree/bindings/mmc/renesas,sdhi.yaml
index 21afaf9e7676..16050b29bc89 100644
--- a/Documentation/devicetree/bindings/mmc/renesas,sdhi.yaml
+++ b/Documentation/devicetree/bindings/mmc/renesas,sdhi.yaml
@@ -9,9 +9,6 @@ title: Renesas SDHI SD/MMC controller
maintainers:
- Wolfram Sang <wsa+renesas@...>

-allOf:
- - $ref: "mmc-controller.yaml"
-
properties:
compatible:
oneOf:
@@ -103,14 +100,46 @@ properties:
pinctrl-1:
maxItems: 1

- pinctrl-names:
- minItems: 1
- items:
- - const: default
- - const: state_uhs
+ pinctrl-names: true

max-frequency: true

+allOf:
+ - $ref: "mmc-controller.yaml"
+
+ - if:
+ properties:
+ compatible:
+ contains:
+ const: renesas,sdhi-mmc-r8a77470
+ then:
+ properties:
+ pinctrl-names:
+ items:
+ - const: state_uhs
+ else:
+ properties:
+ pinctrl-names:
+ minItems: 1
+ items:
+ - const: default
+ - const: state_uhs
+
+ - if:
+ properties:
+ compatible:
+ contains:
+ enum:
+ - renesas,sdhi-r7s72100
+ - renesas,sdhi-r7s9210
+ then:
+ required:
+ - clock-names
+ description:
+ The internal card detection logic that exists in these controllers is
+ sectioned off to be run by a separate second clock source to allow
+ the main core clock to be turned off to save power.
+
required:
- compatible
- reg
@@ -118,21 +147,6 @@ required:
- clocks
- power-domains

-if:
- properties:
- compatible:
- contains:
- enum:
- - renesas,sdhi-r7s72100
- - renesas,sdhi-r7s9210
-then:
- required:
- - clock-names
- description:
- The internal card detection logic that exists in these controllers is
- sectioned off to be run by a separate second clock source to allow
- the main core clock to be turned off to save power.
-
unevaluatedProperties: false

examples:
--
2.17.1


[RESEND PATCH 5.10.y-cip 33/40] dt-bindings: Drop redundant minItems/maxItems

Lad Prabhakar
 

From: Rob Herring <robh@...>

commit 972d6a7dcec3ad3226661034c5d8cb2d30585157 upstream.

If a property has an 'items' list, then a 'minItems' or 'maxItems' with the
same size as the list is redundant and can be dropped. Note that is DT
schema specific behavior and not standard json-schema behavior. The tooling
will fixup the final schema adding any unspecified minItems/maxItems.

This condition is partially checked with the meta-schema already, but
only if both 'minItems' and 'maxItems' are equal to the 'items' length.
An improved meta-schema is pending.

Cc: Jens Axboe <axboe@...>
Cc: Stephen Boyd <sboyd@...>
Cc: Herbert Xu <herbert@...>
Cc: "David S. Miller" <davem@...>
Cc: David Airlie <airlied@...>
Cc: Daniel Vetter <daniel@...>
Cc: Bartosz Golaszewski <bgolaszewski@...>
Cc: Kamal Dasu <kdasu.kdev@...>
Cc: Lars-Peter Clausen <lars@...>
Cc: Thomas Gleixner <tglx@...>
Cc: Marc Zyngier <maz@...>
Cc: Joerg Roedel <joro@...>
Cc: Mauro Carvalho Chehab <mchehab@...>
Cc: Krzysztof Kozlowski <krzysztof.kozlowski@...>
Cc: Jakub Kicinski <kuba@...>
Cc: Wolfgang Grandegger <wg@...>
Cc: Andrew Lunn <andrew@...>
Cc: Vivien Didelot <vivien.didelot@...>
Cc: Vladimir Oltean <olteanv@...>
Cc: Bjorn Helgaas <bhelgaas@...>
Cc: Kishon Vijay Abraham I <kishon@...>
Cc: Linus Walleij <linus.walleij@...>
Cc: "Uwe Kleine-König" <u.kleine-koenig@...>
Cc: Lee Jones <lee.jones@...>
Cc: Ohad Ben-Cohen <ohad@...>
Cc: Mathieu Poirier <mathieu.poirier@...>
Cc: Paul Walmsley <paul.walmsley@...>
Cc: Palmer Dabbelt <palmer@...>
Cc: Albert Ou <aou@...>
Cc: Alessandro Zummo <a.zummo@...>
Cc: Alexandre Belloni <alexandre.belloni@...>
Cc: Zhang Rui <rui.zhang@...>
Cc: Daniel Lezcano <daniel.lezcano@...>
Cc: Wim Van Sebroeck <wim@...>
Cc: Guenter Roeck <linux@...>
Signed-off-by: Rob Herring <robh@...>
Acked-by: Marc Kleine-Budde <mkl@...>
Acked-by: Ulf Hansson <ulf.hansson@...> # for MMC
Acked-by: Jassi Brar <jassisinghbrar@...>
Acked-By: Vinod Koul <vkoul@...>
Reviewed-by: Greg Kroah-Hartman <gregkh@...>
Reviewed-by: Arnaud Pouliquen <arnaud.pouliquen@...>
Acked-by: Mark Brown <broonie@...>
Acked-by: Philipp Zabel <p.zabel@...>
Acked-by: Wolfram Sang <wsa@...> # for I2C
Acked-by: Jonathan Cameron <Jonathan.Cameron@...>
Link: https://lore.kernel.org/r/20210615191543.1043414-1-robh@kernel.org
[PL: Only applies changes to renesas,sdhi.yaml]
Signed-off-by: Lad Prabhakar <prabhakar.mahadev-lad.rj@...>
---
Documentation/devicetree/bindings/mmc/renesas,sdhi.yaml | 2 --
1 file changed, 2 deletions(-)

diff --git a/Documentation/devicetree/bindings/mmc/renesas,sdhi.yaml b/Documentation/devicetree/bindings/mmc/renesas,sdhi.yaml
index 6c13703b31db..21afaf9e7676 100644
--- a/Documentation/devicetree/bindings/mmc/renesas,sdhi.yaml
+++ b/Documentation/devicetree/bindings/mmc/renesas,sdhi.yaml
@@ -74,7 +74,6 @@ properties:

clock-names:
minItems: 1
- maxItems: 2
items:
- const: core
- const: cd
@@ -106,7 +105,6 @@ properties:

pinctrl-names:
minItems: 1
- maxItems: 2
items:
- const: default
- const: state_uhs
--
2.17.1

2201 - 2220 of 10161