Date   

cip-gitlab/ci/iwamatsu/linux-5.10.y-cip-rc kselftest-lkdtm: 7 runs, 2 regressions (v5.10.121-cip9-272-g3fb28d4c623b) #kernelci

kernelci.org bot <bot@...>
 

cip-gitlab/ci/iwamatsu/linux-5.10.y-cip-rc kselftest-lkdtm: 7 runs, 2 regressions (v5.10.121-cip9-272-g3fb28d4c623b)

Regressions Summary
-------------------

platform | arch | lab | compiler | defconfig | regressions
--------------------------+--------+---------------+----------+------------------------------+------------
asus-C433TA-AJ0005-rammus | x86_64 | lab-collabora | gcc-10 | x86_64_defcon...ok+kselftest | 1
hp-11A-G6-EE-grunt | x86_64 | lab-collabora | gcc-10 | x86_64_defcon...ok+kselftest | 1

Details: https://kernelci.org/test/job/cip-gitlab/branch/ci%2Fiwamatsu%2Flinux-5.10.y-cip-rc/kernel/v5.10.121-cip9-272-g3fb28d4c623b/plan/kselftest-lkdtm/

Test: kselftest-lkdtm
Tree: cip-gitlab
Branch: ci/iwamatsu/linux-5.10.y-cip-rc
Describe: v5.10.121-cip9-272-g3fb28d4c623b
URL: https://gitlab.com/cip-project/cip-kernel/linux-cip.git
SHA: 3fb28d4c623b354373a844dd48f16cb4f005388e


Test Regressions
----------------


platform | arch | lab | compiler | defconfig | regressions
--------------------------+--------+---------------+----------+------------------------------+------------
asus-C433TA-AJ0005-rammus | x86_64 | lab-collabora | gcc-10 | x86_64_defcon...ok+kselftest | 1

Details: https://kernelci.org/test/plan/id/62b5dd35ce7a5befe0a39bcd

Results: 37 PASS, 17 FAIL, 25 SKIP
Full config: x86_64_defconfig+x86-chromebook+kselftest
Compiler: gcc-10 (gcc (Debian 10.2.1-6) 10.2.1 20210110)
Plain log: https://storage.kernelci.org//cip-gitlab/ci-iwamatsu-linux-5.10.y-cip-rc/v5.10.121-cip9-272-g3fb28d4c623b/x86_64/x86_64_defconfig+x86-chromebook+kselftest/gcc-10/lab-collabora/kselftest-lkdtm-asus-C433TA-AJ0005-rammus.txt
HTML log: https://storage.kernelci.org//cip-gitlab/ci-iwamatsu-linux-5.10.y-cip-rc/v5.10.121-cip9-272-g3fb28d4c623b/x86_64/x86_64_defconfig+x86-chromebook+kselftest/gcc-10/lab-collabora/kselftest-lkdtm-asus-C433TA-AJ0005-rammus.html
Rootfs: http://storage.kernelci.org/images/rootfs/debian/bullseye-kselftest/20220610.0/amd64/initrd.cpio.gz


* kselftest-lkdtm.lkdtm_USERCOPY_STACK_FRAME_FROM_sh: https://kernelci.org/test/case/id/62b5dd35ce7a5befe0a39bd3
new failure (last pass: v5.10.118-465-g0af29783a3c9)



platform | arch | lab | compiler | defconfig | regressions
--------------------------+--------+---------------+----------+------------------------------+------------
hp-11A-G6-EE-grunt | x86_64 | lab-collabora | gcc-10 | x86_64_defcon...ok+kselftest | 1

Details: https://kernelci.org/test/plan/id/62b5dd330cbb9f056aa39bfd

Results: 36 PASS, 18 FAIL, 25 SKIP
Full config: x86_64_defconfig+x86-chromebook+kselftest
Compiler: gcc-10 (gcc (Debian 10.2.1-6) 10.2.1 20210110)
Plain log: https://storage.kernelci.org//cip-gitlab/ci-iwamatsu-linux-5.10.y-cip-rc/v5.10.121-cip9-272-g3fb28d4c623b/x86_64/x86_64_defconfig+x86-chromebook+kselftest/gcc-10/lab-collabora/kselftest-lkdtm-hp-11A-G6-EE-grunt.txt
HTML log: https://storage.kernelci.org//cip-gitlab/ci-iwamatsu-linux-5.10.y-cip-rc/v5.10.121-cip9-272-g3fb28d4c623b/x86_64/x86_64_defconfig+x86-chromebook+kselftest/gcc-10/lab-collabora/kselftest-lkdtm-hp-11A-G6-EE-grunt.html
Rootfs: http://storage.kernelci.org/images/rootfs/debian/bullseye-kselftest/20220610.0/amd64/initrd.cpio.gz


* kselftest-lkdtm.lkdtm_USERCOPY_STACK_FRAME_FROM_sh: https://kernelci.org/test/case/id/62b5dd330cbb9f056aa39c03
new failure (last pass: v5.10.118-465-g0af29783a3c9)


cip-gitlab/ci/iwamatsu/linux-5.10.y-cip-rc kselftest-lib: 10 runs, 1 regressions (v5.10.121-cip9-272-g3fb28d4c623b) #kernelci

kernelci.org bot <bot@...>
 

cip-gitlab/ci/iwamatsu/linux-5.10.y-cip-rc kselftest-lib: 10 runs, 1 regressions (v5.10.121-cip9-272-g3fb28d4c623b)

Regressions Summary
-------------------

platform | arch | lab | compiler | defconfig | regressions
-------------------------+-------+---------+----------+---------------------+------------
r8a774a1-hihope-rzg2m-ex | arm64 | lab-cip | gcc-10 | defconfig+kselftest | 1

Details: https://kernelci.org/test/job/cip-gitlab/branch/ci%2Fiwamatsu%2Flinux-5.10.y-cip-rc/kernel/v5.10.121-cip9-272-g3fb28d4c623b/plan/kselftest-lib/

Test: kselftest-lib
Tree: cip-gitlab
Branch: ci/iwamatsu/linux-5.10.y-cip-rc
Describe: v5.10.121-cip9-272-g3fb28d4c623b
URL: https://gitlab.com/cip-project/cip-kernel/linux-cip.git
SHA: 3fb28d4c623b354373a844dd48f16cb4f005388e


Test Regressions
----------------


platform | arch | lab | compiler | defconfig | regressions
-------------------------+-------+---------+----------+---------------------+------------
r8a774a1-hihope-rzg2m-ex | arm64 | lab-cip | gcc-10 | defconfig+kselftest | 1

Details: https://kernelci.org/test/plan/id/62b5deb1648d50c65ca39c77

Results: 0 PASS, 1 FAIL, 0 SKIP
Full config: defconfig+kselftest
Compiler: gcc-10 (aarch64-linux-gnu-gcc (Debian 10.2.1-6) 10.2.1 20210110)
Plain log: https://storage.kernelci.org//cip-gitlab/ci-iwamatsu-linux-5.10.y-cip-rc/v5.10.121-cip9-272-g3fb28d4c623b/arm64/defconfig+kselftest/gcc-10/lab-cip/kselftest-lib-r8a774a1-hihope-rzg2m-ex.txt
HTML log: https://storage.kernelci.org//cip-gitlab/ci-iwamatsu-linux-5.10.y-cip-rc/v5.10.121-cip9-272-g3fb28d4c623b/arm64/defconfig+kselftest/gcc-10/lab-cip/kselftest-lib-r8a774a1-hihope-rzg2m-ex.html
Rootfs: http://storage.kernelci.org/images/rootfs/debian/bullseye-kselftest/20220610.0/arm64/initrd.cpio.gz


* kselftest-lib.login: https://kernelci.org/test/case/id/62b5deb1648d50c65ca39c78
new failure (last pass: v5.10.118-465-g0af29783a3c9)


cip-gitlab/ci/iwamatsu/linux-5.10.y-cip-rc kselftest-filesystems: 10 runs, 1 regressions (v5.10.121-cip9-272-g3fb28d4c623b) #kernelci

kernelci.org bot <bot@...>
 

cip-gitlab/ci/iwamatsu/linux-5.10.y-cip-rc kselftest-filesystems: 10 runs, 1 regressions (v5.10.121-cip9-272-g3fb28d4c623b)

Regressions Summary
-------------------

platform | arch | lab | compiler | defconfig | regressions
-------------------------+-------+---------+----------+-----------+------------
r8a774a1-hihope-rzg2m-ex | arm64 | lab-cip | gcc-10 | defconfig | 1

Details: https://kernelci.org/test/job/cip-gitlab/branch/ci%2Fiwamatsu%2Flinux-5.10.y-cip-rc/kernel/v5.10.121-cip9-272-g3fb28d4c623b/plan/kselftest-filesystems/

Test: kselftest-filesystems
Tree: cip-gitlab
Branch: ci/iwamatsu/linux-5.10.y-cip-rc
Describe: v5.10.121-cip9-272-g3fb28d4c623b
URL: https://gitlab.com/cip-project/cip-kernel/linux-cip.git
SHA: 3fb28d4c623b354373a844dd48f16cb4f005388e


Test Regressions
----------------


platform | arch | lab | compiler | defconfig | regressions
-------------------------+-------+---------+----------+-----------+------------
r8a774a1-hihope-rzg2m-ex | arm64 | lab-cip | gcc-10 | defconfig | 1

Details: https://kernelci.org/test/plan/id/62b5e0ae441b20474da39bdd

Results: 0 PASS, 1 FAIL, 0 SKIP
Full config: defconfig
Compiler: gcc-10 (aarch64-linux-gnu-gcc (Debian 10.2.1-6) 10.2.1 20210110)
Plain log: https://storage.kernelci.org//cip-gitlab/ci-iwamatsu-linux-5.10.y-cip-rc/v5.10.121-cip9-272-g3fb28d4c623b/arm64/defconfig/gcc-10/lab-cip/kselftest-filesystems-r8a774a1-hihope-rzg2m-ex.txt
HTML log: https://storage.kernelci.org//cip-gitlab/ci-iwamatsu-linux-5.10.y-cip-rc/v5.10.121-cip9-272-g3fb28d4c623b/arm64/defconfig/gcc-10/lab-cip/kselftest-filesystems-r8a774a1-hihope-rzg2m-ex.html
Rootfs: http://storage.kernelci.org/images/rootfs/debian/bullseye-kselftest/20220610.0/arm64/initrd.cpio.gz


* kselftest-filesystems.login: https://kernelci.org/test/case/id/62b5e0ae441b20474da39bde
new failure (last pass: v5.10.118-465-g0af29783a3c9)


cip-gitlab/ci/iwamatsu/linux-5.10.y-cip-rc kselftest-futex: 10 runs, 1 regressions (v5.10.121-cip9-272-g3fb28d4c623b) #kernelci

kernelci.org bot <bot@...>
 

cip-gitlab/ci/iwamatsu/linux-5.10.y-cip-rc kselftest-futex: 10 runs, 1 regressions (v5.10.121-cip9-272-g3fb28d4c623b)

Regressions Summary
-------------------

platform | arch | lab | compiler | defconfig | regressions
-----------------------------+-------+--------------+----------+-----------+------------
meson-gxl-s905x-libretech-cc | arm64 | lab-baylibre | gcc-10 | defconfig | 1

Details: https://kernelci.org/test/job/cip-gitlab/branch/ci%2Fiwamatsu%2Flinux-5.10.y-cip-rc/kernel/v5.10.121-cip9-272-g3fb28d4c623b/plan/kselftest-futex/

Test: kselftest-futex
Tree: cip-gitlab
Branch: ci/iwamatsu/linux-5.10.y-cip-rc
Describe: v5.10.121-cip9-272-g3fb28d4c623b
URL: https://gitlab.com/cip-project/cip-kernel/linux-cip.git
SHA: 3fb28d4c623b354373a844dd48f16cb4f005388e


Test Regressions
----------------


platform | arch | lab | compiler | defconfig | regressions
-----------------------------+-------+--------------+----------+-----------+------------
meson-gxl-s905x-libretech-cc | arm64 | lab-baylibre | gcc-10 | defconfig | 1

Details: https://kernelci.org/test/plan/id/62b5e07e0fda546712a39bfc

Results: 0 PASS, 1 FAIL, 0 SKIP
Full config: defconfig
Compiler: gcc-10 (aarch64-linux-gnu-gcc (Debian 10.2.1-6) 10.2.1 20210110)
Plain log: https://storage.kernelci.org//cip-gitlab/ci-iwamatsu-linux-5.10.y-cip-rc/v5.10.121-cip9-272-g3fb28d4c623b/arm64/defconfig/gcc-10/lab-baylibre/kselftest-futex-meson-gxl-s905x-libretech-cc.txt
HTML log: https://storage.kernelci.org//cip-gitlab/ci-iwamatsu-linux-5.10.y-cip-rc/v5.10.121-cip9-272-g3fb28d4c623b/arm64/defconfig/gcc-10/lab-baylibre/kselftest-futex-meson-gxl-s905x-libretech-cc.html
Rootfs: http://storage.kernelci.org/images/rootfs/debian/bullseye-kselftest/20220610.0/arm64/initrd.cpio.gz


* kselftest-futex.login: https://kernelci.org/test/case/id/62b5e07e0fda546712a39bfd
new failure (last pass: v5.10.118-465-g0af29783a3c9)


cip-gitlab/ci/iwamatsu/linux-5.10.y-cip-rc baseline: 150 runs, 17 regressions (v5.10.121-cip9-272-g3fb28d4c623b) #kernelci

kernelci.org bot <bot@...>
 

cip-gitlab/ci/iwamatsu/linux-5.10.y-cip-rc baseline: 150 runs, 17 regressions (v5.10.121-cip9-272-g3fb28d4c623b)

Regressions Summary
-------------------

platform | arch | lab | compiler | defconfig | regressions
---------------------------+-------+---------------+----------+----------------------------+------------
qemu_arm64-virt-gicv2 | arm64 | lab-baylibre | gcc-10 | defconfig | 1
qemu_arm64-virt-gicv2 | arm64 | lab-baylibre | gcc-10 | defconfig+arm64-chromebook | 1
qemu_arm64-virt-gicv2 | arm64 | lab-broonie | gcc-10 | defconfig | 1
qemu_arm64-virt-gicv2 | arm64 | lab-broonie | gcc-10 | defconfig+arm64-chromebook | 1
qemu_arm64-virt-gicv2-uefi | arm64 | lab-baylibre | gcc-10 | defconfig | 1
qemu_arm64-virt-gicv2-uefi | arm64 | lab-baylibre | gcc-10 | defconfig+arm64-chromebook | 1
qemu_arm64-virt-gicv2-uefi | arm64 | lab-broonie | gcc-10 | defconfig | 1
qemu_arm64-virt-gicv2-uefi | arm64 | lab-broonie | gcc-10 | defconfig+arm64-chromebook | 1
qemu_arm64-virt-gicv3 | arm64 | lab-baylibre | gcc-10 | defconfig | 1
qemu_arm64-virt-gicv3 | arm64 | lab-baylibre | gcc-10 | defconfig+arm64-chromebook | 1
qemu_arm64-virt-gicv3 | arm64 | lab-broonie | gcc-10 | defconfig | 1
qemu_arm64-virt-gicv3 | arm64 | lab-broonie | gcc-10 | defconfig+arm64-chromebook | 1
qemu_arm64-virt-gicv3-uefi | arm64 | lab-baylibre | gcc-10 | defconfig | 1
qemu_arm64-virt-gicv3-uefi | arm64 | lab-baylibre | gcc-10 | defconfig+arm64-chromebook | 1
qemu_arm64-virt-gicv3-uefi | arm64 | lab-broonie | gcc-10 | defconfig | 1
qemu_arm64-virt-gicv3-uefi | arm64 | lab-broonie | gcc-10 | defconfig+arm64-chromebook | 1
rk3399-gru-kevin | arm64 | lab-collabora | gcc-10 | defconfig+arm64-chromebook | 1

Details: https://kernelci.org/test/job/cip-gitlab/branch/ci%2Fiwamatsu%2Flinux-5.10.y-cip-rc/kernel/v5.10.121-cip9-272-g3fb28d4c623b/plan/baseline/

Test: baseline
Tree: cip-gitlab
Branch: ci/iwamatsu/linux-5.10.y-cip-rc
Describe: v5.10.121-cip9-272-g3fb28d4c623b
URL: https://gitlab.com/cip-project/cip-kernel/linux-cip.git
SHA: 3fb28d4c623b354373a844dd48f16cb4f005388e


Test Regressions
----------------


platform | arch | lab | compiler | defconfig | regressions
---------------------------+-------+---------------+----------+----------------------------+------------
qemu_arm64-virt-gicv2 | arm64 | lab-baylibre | gcc-10 | defconfig | 1

Details: https://kernelci.org/test/plan/id/62b5dfe12187b284eda39be0

Results: 0 PASS, 1 FAIL, 0 SKIP
Full config: defconfig
Compiler: gcc-10 (aarch64-linux-gnu-gcc (Debian 10.2.1-6) 10.2.1 20210110)
Plain log: https://storage.kernelci.org//cip-gitlab/ci-iwamatsu-linux-5.10.y-cip-rc/v5.10.121-cip9-272-g3fb28d4c623b/arm64/defconfig/gcc-10/lab-baylibre/baseline-qemu_arm64-virt-gicv2.txt
HTML log: https://storage.kernelci.org//cip-gitlab/ci-iwamatsu-linux-5.10.y-cip-rc/v5.10.121-cip9-272-g3fb28d4c623b/arm64/defconfig/gcc-10/lab-baylibre/baseline-qemu_arm64-virt-gicv2.html
Rootfs: http://storage.kernelci.org/images/rootfs/buildroot/buildroot-baseline/20220610.1/arm64/rootfs.cpio.gz


* baseline.login: https://kernelci.org/test/case/id/62b5dfe12187b284eda39be1
failing since 45 days (last pass: v5.10.112-cip6-88-gf3397cadb2dd6, first fail: v5.10.112-cip6-218-g8253434cd56a)



platform | arch | lab | compiler | defconfig | regressions
---------------------------+-------+---------------+----------+----------------------------+------------
qemu_arm64-virt-gicv2 | arm64 | lab-baylibre | gcc-10 | defconfig+arm64-chromebook | 1

Details: https://kernelci.org/test/plan/id/62b5e0073862fd16e4a39bfa

Results: 0 PASS, 1 FAIL, 0 SKIP
Full config: defconfig+arm64-chromebook
Compiler: gcc-10 (aarch64-linux-gnu-gcc (Debian 10.2.1-6) 10.2.1 20210110)
Plain log: https://storage.kernelci.org//cip-gitlab/ci-iwamatsu-linux-5.10.y-cip-rc/v5.10.121-cip9-272-g3fb28d4c623b/arm64/defconfig+arm64-chromebook/gcc-10/lab-baylibre/baseline-qemu_arm64-virt-gicv2.txt
HTML log: https://storage.kernelci.org//cip-gitlab/ci-iwamatsu-linux-5.10.y-cip-rc/v5.10.121-cip9-272-g3fb28d4c623b/arm64/defconfig+arm64-chromebook/gcc-10/lab-baylibre/baseline-qemu_arm64-virt-gicv2.html
Rootfs: http://storage.kernelci.org/images/rootfs/buildroot/buildroot-baseline/20220610.1/arm64/rootfs.cpio.gz


* baseline.login: https://kernelci.org/test/case/id/62b5e0073862fd16e4a39bfb
failing since 43 days (last pass: v5.10.112-cip6-88-gf3397cadb2dd6, first fail: v5.10.112-cip6-289-g2969e096d186)



platform | arch | lab | compiler | defconfig | regressions
---------------------------+-------+---------------+----------+----------------------------+------------
qemu_arm64-virt-gicv2 | arm64 | lab-broonie | gcc-10 | defconfig | 1

Details: https://kernelci.org/test/plan/id/62b5dfa0d04a1aecbaa39bdf

Results: 0 PASS, 1 FAIL, 0 SKIP
Full config: defconfig
Compiler: gcc-10 (aarch64-linux-gnu-gcc (Debian 10.2.1-6) 10.2.1 20210110)
Plain log: https://storage.kernelci.org//cip-gitlab/ci-iwamatsu-linux-5.10.y-cip-rc/v5.10.121-cip9-272-g3fb28d4c623b/arm64/defconfig/gcc-10/lab-broonie/baseline-qemu_arm64-virt-gicv2.txt
HTML log: https://storage.kernelci.org//cip-gitlab/ci-iwamatsu-linux-5.10.y-cip-rc/v5.10.121-cip9-272-g3fb28d4c623b/arm64/defconfig/gcc-10/lab-broonie/baseline-qemu_arm64-virt-gicv2.html
Rootfs: http://storage.kernelci.org/images/rootfs/buildroot/buildroot-baseline/20220610.1/arm64/rootfs.cpio.gz


* baseline.login: https://kernelci.org/test/case/id/62b5dfa0d04a1aecbaa39be0
failing since 45 days (last pass: v5.10.112-cip6-88-gf3397cadb2dd6, first fail: v5.10.112-cip6-218-g8253434cd56a)



platform | arch | lab | compiler | defconfig | regressions
---------------------------+-------+---------------+----------+----------------------------+------------
qemu_arm64-virt-gicv2 | arm64 | lab-broonie | gcc-10 | defconfig+arm64-chromebook | 1

Details: https://kernelci.org/test/plan/id/62b5e11ce14e0e2e16a39bef

Results: 0 PASS, 1 FAIL, 0 SKIP
Full config: defconfig+arm64-chromebook
Compiler: gcc-10 (aarch64-linux-gnu-gcc (Debian 10.2.1-6) 10.2.1 20210110)
Plain log: https://storage.kernelci.org//cip-gitlab/ci-iwamatsu-linux-5.10.y-cip-rc/v5.10.121-cip9-272-g3fb28d4c623b/arm64/defconfig+arm64-chromebook/gcc-10/lab-broonie/baseline-qemu_arm64-virt-gicv2.txt
HTML log: https://storage.kernelci.org//cip-gitlab/ci-iwamatsu-linux-5.10.y-cip-rc/v5.10.121-cip9-272-g3fb28d4c623b/arm64/defconfig+arm64-chromebook/gcc-10/lab-broonie/baseline-qemu_arm64-virt-gicv2.html
Rootfs: http://storage.kernelci.org/images/rootfs/buildroot/buildroot-baseline/20220610.1/arm64/rootfs.cpio.gz


* baseline.login: https://kernelci.org/test/case/id/62b5e11ce14e0e2e16a39bf0
failing since 43 days (last pass: v5.10.112-cip6-88-gf3397cadb2dd6, first fail: v5.10.112-cip6-289-g2969e096d186)



platform | arch | lab | compiler | defconfig | regressions
---------------------------+-------+---------------+----------+----------------------------+------------
qemu_arm64-virt-gicv2-uefi | arm64 | lab-baylibre | gcc-10 | defconfig | 1

Details: https://kernelci.org/test/plan/id/62b5dfdfaffe897e93a39c83

Results: 0 PASS, 1 FAIL, 0 SKIP
Full config: defconfig
Compiler: gcc-10 (aarch64-linux-gnu-gcc (Debian 10.2.1-6) 10.2.1 20210110)
Plain log: https://storage.kernelci.org//cip-gitlab/ci-iwamatsu-linux-5.10.y-cip-rc/v5.10.121-cip9-272-g3fb28d4c623b/arm64/defconfig/gcc-10/lab-baylibre/baseline-qemu_arm64-virt-gicv2-uefi.txt
HTML log: https://storage.kernelci.org//cip-gitlab/ci-iwamatsu-linux-5.10.y-cip-rc/v5.10.121-cip9-272-g3fb28d4c623b/arm64/defconfig/gcc-10/lab-baylibre/baseline-qemu_arm64-virt-gicv2-uefi.html
Rootfs: http://storage.kernelci.org/images/rootfs/buildroot/buildroot-baseline/20220610.1/arm64/rootfs.cpio.gz


* baseline.login: https://kernelci.org/test/case/id/62b5dfdfaffe897e93a39c84
failing since 45 days (last pass: v5.10.112-cip6-88-gf3397cadb2dd6, first fail: v5.10.112-cip6-218-g8253434cd56a)



platform | arch | lab | compiler | defconfig | regressions
---------------------------+-------+---------------+----------+----------------------------+------------
qemu_arm64-virt-gicv2-uefi | arm64 | lab-baylibre | gcc-10 | defconfig+arm64-chromebook | 1

Details: https://kernelci.org/test/plan/id/62b5dff23862fd16e4a39bcd

Results: 0 PASS, 1 FAIL, 0 SKIP
Full config: defconfig+arm64-chromebook
Compiler: gcc-10 (aarch64-linux-gnu-gcc (Debian 10.2.1-6) 10.2.1 20210110)
Plain log: https://storage.kernelci.org//cip-gitlab/ci-iwamatsu-linux-5.10.y-cip-rc/v5.10.121-cip9-272-g3fb28d4c623b/arm64/defconfig+arm64-chromebook/gcc-10/lab-baylibre/baseline-qemu_arm64-virt-gicv2-uefi.txt
HTML log: https://storage.kernelci.org//cip-gitlab/ci-iwamatsu-linux-5.10.y-cip-rc/v5.10.121-cip9-272-g3fb28d4c623b/arm64/defconfig+arm64-chromebook/gcc-10/lab-baylibre/baseline-qemu_arm64-virt-gicv2-uefi.html
Rootfs: http://storage.kernelci.org/images/rootfs/buildroot/buildroot-baseline/20220610.1/arm64/rootfs.cpio.gz


* baseline.login: https://kernelci.org/test/case/id/62b5dff23862fd16e4a39bce
failing since 43 days (last pass: v5.10.112-cip6-88-gf3397cadb2dd6, first fail: v5.10.112-cip6-289-g2969e096d186)



platform | arch | lab | compiler | defconfig | regressions
---------------------------+-------+---------------+----------+----------------------------+------------
qemu_arm64-virt-gicv2-uefi | arm64 | lab-broonie | gcc-10 | defconfig | 1

Details: https://kernelci.org/test/plan/id/62b5dfb4d04a1aecbaa39bf4

Results: 0 PASS, 1 FAIL, 0 SKIP
Full config: defconfig
Compiler: gcc-10 (aarch64-linux-gnu-gcc (Debian 10.2.1-6) 10.2.1 20210110)
Plain log: https://storage.kernelci.org//cip-gitlab/ci-iwamatsu-linux-5.10.y-cip-rc/v5.10.121-cip9-272-g3fb28d4c623b/arm64/defconfig/gcc-10/lab-broonie/baseline-qemu_arm64-virt-gicv2-uefi.txt
HTML log: https://storage.kernelci.org//cip-gitlab/ci-iwamatsu-linux-5.10.y-cip-rc/v5.10.121-cip9-272-g3fb28d4c623b/arm64/defconfig/gcc-10/lab-broonie/baseline-qemu_arm64-virt-gicv2-uefi.html
Rootfs: http://storage.kernelci.org/images/rootfs/buildroot/buildroot-baseline/20220610.1/arm64/rootfs.cpio.gz


* baseline.login: https://kernelci.org/test/case/id/62b5dfb4d04a1aecbaa39bf5
failing since 45 days (last pass: v5.10.112-cip6-88-gf3397cadb2dd6, first fail: v5.10.112-cip6-218-g8253434cd56a)



platform | arch | lab | compiler | defconfig | regressions
---------------------------+-------+---------------+----------+----------------------------+------------
qemu_arm64-virt-gicv2-uefi | arm64 | lab-broonie | gcc-10 | defconfig+arm64-chromebook | 1

Details: https://kernelci.org/test/plan/id/62b5e108e14e0e2e16a39bdc

Results: 0 PASS, 1 FAIL, 0 SKIP
Full config: defconfig+arm64-chromebook
Compiler: gcc-10 (aarch64-linux-gnu-gcc (Debian 10.2.1-6) 10.2.1 20210110)
Plain log: https://storage.kernelci.org//cip-gitlab/ci-iwamatsu-linux-5.10.y-cip-rc/v5.10.121-cip9-272-g3fb28d4c623b/arm64/defconfig+arm64-chromebook/gcc-10/lab-broonie/baseline-qemu_arm64-virt-gicv2-uefi.txt
HTML log: https://storage.kernelci.org//cip-gitlab/ci-iwamatsu-linux-5.10.y-cip-rc/v5.10.121-cip9-272-g3fb28d4c623b/arm64/defconfig+arm64-chromebook/gcc-10/lab-broonie/baseline-qemu_arm64-virt-gicv2-uefi.html
Rootfs: http://storage.kernelci.org/images/rootfs/buildroot/buildroot-baseline/20220610.1/arm64/rootfs.cpio.gz


* baseline.login: https://kernelci.org/test/case/id/62b5e108e14e0e2e16a39bdd
failing since 43 days (last pass: v5.10.112-cip6-88-gf3397cadb2dd6, first fail: v5.10.112-cip6-289-g2969e096d186)



platform | arch | lab | compiler | defconfig | regressions
---------------------------+-------+---------------+----------+----------------------------+------------
qemu_arm64-virt-gicv3 | arm64 | lab-baylibre | gcc-10 | defconfig | 1

Details: https://kernelci.org/test/plan/id/62b5dfe3affe897e93a39c8a

Results: 0 PASS, 1 FAIL, 0 SKIP
Full config: defconfig
Compiler: gcc-10 (aarch64-linux-gnu-gcc (Debian 10.2.1-6) 10.2.1 20210110)
Plain log: https://storage.kernelci.org//cip-gitlab/ci-iwamatsu-linux-5.10.y-cip-rc/v5.10.121-cip9-272-g3fb28d4c623b/arm64/defconfig/gcc-10/lab-baylibre/baseline-qemu_arm64-virt-gicv3.txt
HTML log: https://storage.kernelci.org//cip-gitlab/ci-iwamatsu-linux-5.10.y-cip-rc/v5.10.121-cip9-272-g3fb28d4c623b/arm64/defconfig/gcc-10/lab-baylibre/baseline-qemu_arm64-virt-gicv3.html
Rootfs: http://storage.kernelci.org/images/rootfs/buildroot/buildroot-baseline/20220610.1/arm64/rootfs.cpio.gz


* baseline.login: https://kernelci.org/test/case/id/62b5dfe3affe897e93a39c8b
failing since 45 days (last pass: v5.10.112-cip6-88-gf3397cadb2dd6, first fail: v5.10.112-cip6-218-g8253434cd56a)



platform | arch | lab | compiler | defconfig | regressions
---------------------------+-------+---------------+----------+----------------------------+------------
qemu_arm64-virt-gicv3 | arm64 | lab-baylibre | gcc-10 | defconfig+arm64-chromebook | 1

Details: https://kernelci.org/test/plan/id/62b5e0063862fd16e4a39bee

Results: 0 PASS, 1 FAIL, 0 SKIP
Full config: defconfig+arm64-chromebook
Compiler: gcc-10 (aarch64-linux-gnu-gcc (Debian 10.2.1-6) 10.2.1 20210110)
Plain log: https://storage.kernelci.org//cip-gitlab/ci-iwamatsu-linux-5.10.y-cip-rc/v5.10.121-cip9-272-g3fb28d4c623b/arm64/defconfig+arm64-chromebook/gcc-10/lab-baylibre/baseline-qemu_arm64-virt-gicv3.txt
HTML log: https://storage.kernelci.org//cip-gitlab/ci-iwamatsu-linux-5.10.y-cip-rc/v5.10.121-cip9-272-g3fb28d4c623b/arm64/defconfig+arm64-chromebook/gcc-10/lab-baylibre/baseline-qemu_arm64-virt-gicv3.html
Rootfs: http://storage.kernelci.org/images/rootfs/buildroot/buildroot-baseline/20220610.1/arm64/rootfs.cpio.gz


* baseline.login: https://kernelci.org/test/case/id/62b5e0063862fd16e4a39bef
failing since 43 days (last pass: v5.10.112-cip6-88-gf3397cadb2dd6, first fail: v5.10.112-cip6-289-g2969e096d186)



platform | arch | lab | compiler | defconfig | regressions
---------------------------+-------+---------------+----------+----------------------------+------------
qemu_arm64-virt-gicv3 | arm64 | lab-broonie | gcc-10 | defconfig | 1

Details: https://kernelci.org/test/plan/id/62b5dfb7affe897e93a39bcd

Results: 0 PASS, 1 FAIL, 0 SKIP
Full config: defconfig
Compiler: gcc-10 (aarch64-linux-gnu-gcc (Debian 10.2.1-6) 10.2.1 20210110)
Plain log: https://storage.kernelci.org//cip-gitlab/ci-iwamatsu-linux-5.10.y-cip-rc/v5.10.121-cip9-272-g3fb28d4c623b/arm64/defconfig/gcc-10/lab-broonie/baseline-qemu_arm64-virt-gicv3.txt
HTML log: https://storage.kernelci.org//cip-gitlab/ci-iwamatsu-linux-5.10.y-cip-rc/v5.10.121-cip9-272-g3fb28d4c623b/arm64/defconfig/gcc-10/lab-broonie/baseline-qemu_arm64-virt-gicv3.html
Rootfs: http://storage.kernelci.org/images/rootfs/buildroot/buildroot-baseline/20220610.1/arm64/rootfs.cpio.gz


* baseline.login: https://kernelci.org/test/case/id/62b5dfb7affe897e93a39bce
failing since 45 days (last pass: v5.10.112-cip6-88-gf3397cadb2dd6, first fail: v5.10.112-cip6-218-g8253434cd56a)



platform | arch | lab | compiler | defconfig | regressions
---------------------------+-------+---------------+----------+----------------------------+------------
qemu_arm64-virt-gicv3 | arm64 | lab-broonie | gcc-10 | defconfig+arm64-chromebook | 1

Details: https://kernelci.org/test/plan/id/62b5dfdcaffe897e93a39c7d

Results: 0 PASS, 1 FAIL, 0 SKIP
Full config: defconfig+arm64-chromebook
Compiler: gcc-10 (aarch64-linux-gnu-gcc (Debian 10.2.1-6) 10.2.1 20210110)
Plain log: https://storage.kernelci.org//cip-gitlab/ci-iwamatsu-linux-5.10.y-cip-rc/v5.10.121-cip9-272-g3fb28d4c623b/arm64/defconfig+arm64-chromebook/gcc-10/lab-broonie/baseline-qemu_arm64-virt-gicv3.txt
HTML log: https://storage.kernelci.org//cip-gitlab/ci-iwamatsu-linux-5.10.y-cip-rc/v5.10.121-cip9-272-g3fb28d4c623b/arm64/defconfig+arm64-chromebook/gcc-10/lab-broonie/baseline-qemu_arm64-virt-gicv3.html
Rootfs: http://storage.kernelci.org/images/rootfs/buildroot/buildroot-baseline/20220610.1/arm64/rootfs.cpio.gz


* baseline.login: https://kernelci.org/test/case/id/62b5dfdcaffe897e93a39c7e
failing since 43 days (last pass: v5.10.112-cip6-88-gf3397cadb2dd6, first fail: v5.10.112-cip6-289-g2969e096d186)



platform | arch | lab | compiler | defconfig | regressions
---------------------------+-------+---------------+----------+----------------------------+------------
qemu_arm64-virt-gicv3-uefi | arm64 | lab-baylibre | gcc-10 | defconfig | 1

Details: https://kernelci.org/test/plan/id/62b5dfe29ec7bd9535a39bcd

Results: 0 PASS, 1 FAIL, 0 SKIP
Full config: defconfig
Compiler: gcc-10 (aarch64-linux-gnu-gcc (Debian 10.2.1-6) 10.2.1 20210110)
Plain log: https://storage.kernelci.org//cip-gitlab/ci-iwamatsu-linux-5.10.y-cip-rc/v5.10.121-cip9-272-g3fb28d4c623b/arm64/defconfig/gcc-10/lab-baylibre/baseline-qemu_arm64-virt-gicv3-uefi.txt
HTML log: https://storage.kernelci.org//cip-gitlab/ci-iwamatsu-linux-5.10.y-cip-rc/v5.10.121-cip9-272-g3fb28d4c623b/arm64/defconfig/gcc-10/lab-baylibre/baseline-qemu_arm64-virt-gicv3-uefi.html
Rootfs: http://storage.kernelci.org/images/rootfs/buildroot/buildroot-baseline/20220610.1/arm64/rootfs.cpio.gz


* baseline.login: https://kernelci.org/test/case/id/62b5dfe29ec7bd9535a39bce
failing since 45 days (last pass: v5.10.112-cip6-88-gf3397cadb2dd6, first fail: v5.10.112-cip6-218-g8253434cd56a)



platform | arch | lab | compiler | defconfig | regressions
---------------------------+-------+---------------+----------+----------------------------+------------
qemu_arm64-virt-gicv3-uefi | arm64 | lab-baylibre | gcc-10 | defconfig+arm64-chromebook | 1

Details: https://kernelci.org/test/plan/id/62b5e1464ceb587dd5a39bdf

Results: 0 PASS, 1 FAIL, 0 SKIP
Full config: defconfig+arm64-chromebook
Compiler: gcc-10 (aarch64-linux-gnu-gcc (Debian 10.2.1-6) 10.2.1 20210110)
Plain log: https://storage.kernelci.org//cip-gitlab/ci-iwamatsu-linux-5.10.y-cip-rc/v5.10.121-cip9-272-g3fb28d4c623b/arm64/defconfig+arm64-chromebook/gcc-10/lab-baylibre/baseline-qemu_arm64-virt-gicv3-uefi.txt
HTML log: https://storage.kernelci.org//cip-gitlab/ci-iwamatsu-linux-5.10.y-cip-rc/v5.10.121-cip9-272-g3fb28d4c623b/arm64/defconfig+arm64-chromebook/gcc-10/lab-baylibre/baseline-qemu_arm64-virt-gicv3-uefi.html
Rootfs: http://storage.kernelci.org/images/rootfs/buildroot/buildroot-baseline/20220610.1/arm64/rootfs.cpio.gz


* baseline.login: https://kernelci.org/test/case/id/62b5e1464ceb587dd5a39be0
failing since 43 days (last pass: v5.10.112-cip6-88-gf3397cadb2dd6, first fail: v5.10.112-cip6-289-g2969e096d186)



platform | arch | lab | compiler | defconfig | regressions
---------------------------+-------+---------------+----------+----------------------------+------------
qemu_arm64-virt-gicv3-uefi | arm64 | lab-broonie | gcc-10 | defconfig | 1

Details: https://kernelci.org/test/plan/id/62b5dfb6d04a1aecbaa39bf8

Results: 0 PASS, 1 FAIL, 0 SKIP
Full config: defconfig
Compiler: gcc-10 (aarch64-linux-gnu-gcc (Debian 10.2.1-6) 10.2.1 20210110)
Plain log: https://storage.kernelci.org//cip-gitlab/ci-iwamatsu-linux-5.10.y-cip-rc/v5.10.121-cip9-272-g3fb28d4c623b/arm64/defconfig/gcc-10/lab-broonie/baseline-qemu_arm64-virt-gicv3-uefi.txt
HTML log: https://storage.kernelci.org//cip-gitlab/ci-iwamatsu-linux-5.10.y-cip-rc/v5.10.121-cip9-272-g3fb28d4c623b/arm64/defconfig/gcc-10/lab-broonie/baseline-qemu_arm64-virt-gicv3-uefi.html
Rootfs: http://storage.kernelci.org/images/rootfs/buildroot/buildroot-baseline/20220610.1/arm64/rootfs.cpio.gz


* baseline.login: https://kernelci.org/test/case/id/62b5dfb6d04a1aecbaa39bf9
failing since 45 days (last pass: v5.10.112-cip6-88-gf3397cadb2dd6, first fail: v5.10.112-cip6-218-g8253434cd56a)



platform | arch | lab | compiler | defconfig | regressions
---------------------------+-------+---------------+----------+----------------------------+------------
qemu_arm64-virt-gicv3-uefi | arm64 | lab-broonie | gcc-10 | defconfig+arm64-chromebook | 1

Details: https://kernelci.org/test/plan/id/62b5e11d0833dfdc5fa39bd8

Results: 0 PASS, 1 FAIL, 0 SKIP
Full config: defconfig+arm64-chromebook
Compiler: gcc-10 (aarch64-linux-gnu-gcc (Debian 10.2.1-6) 10.2.1 20210110)
Plain log: https://storage.kernelci.org//cip-gitlab/ci-iwamatsu-linux-5.10.y-cip-rc/v5.10.121-cip9-272-g3fb28d4c623b/arm64/defconfig+arm64-chromebook/gcc-10/lab-broonie/baseline-qemu_arm64-virt-gicv3-uefi.txt
HTML log: https://storage.kernelci.org//cip-gitlab/ci-iwamatsu-linux-5.10.y-cip-rc/v5.10.121-cip9-272-g3fb28d4c623b/arm64/defconfig+arm64-chromebook/gcc-10/lab-broonie/baseline-qemu_arm64-virt-gicv3-uefi.html
Rootfs: http://storage.kernelci.org/images/rootfs/buildroot/buildroot-baseline/20220610.1/arm64/rootfs.cpio.gz


* baseline.login: https://kernelci.org/test/case/id/62b5e11d0833dfdc5fa39bd9
failing since 43 days (last pass: v5.10.112-cip6-88-gf3397cadb2dd6, first fail: v5.10.112-cip6-289-g2969e096d186)



platform | arch | lab | compiler | defconfig | regressions
---------------------------+-------+---------------+----------+----------------------------+------------
rk3399-gru-kevin | arm64 | lab-collabora | gcc-10 | defconfig+arm64-chromebook | 1

Details: https://kernelci.org/test/plan/id/62b5dee76d8a300343a39bf7

Results: 90 PASS, 2 FAIL, 0 SKIP
Full config: defconfig+arm64-chromebook
Compiler: gcc-10 (aarch64-linux-gnu-gcc (Debian 10.2.1-6) 10.2.1 20210110)
Plain log: https://storage.kernelci.org//cip-gitlab/ci-iwamatsu-linux-5.10.y-cip-rc/v5.10.121-cip9-272-g3fb28d4c623b/arm64/defconfig+arm64-chromebook/gcc-10/lab-collabora/baseline-rk3399-gru-kevin.txt
HTML log: https://storage.kernelci.org//cip-gitlab/ci-iwamatsu-linux-5.10.y-cip-rc/v5.10.121-cip9-272-g3fb28d4c623b/arm64/defconfig+arm64-chromebook/gcc-10/lab-collabora/baseline-rk3399-gru-kevin.html
Rootfs: http://storage.kernelci.org/images/rootfs/buildroot/buildroot-baseline/20220610.1/arm64/rootfs.cpio.gz


* baseline.bootrr.rockchip-i2s1-probed: https://kernelci.org/test/case/id/62b5dee76d8a300343a39c19
failing since 107 days (last pass: v5.10.100-cip2-319-gcbff87047566, first fail: v5.10.100-cip2-425-g0a0d92194f39)

2022-06-24T15:57:09.208800 <8>[ 32.875684] <LAVA_SIGNAL_TESTCASE TEST_CASE_ID=rockchip-i2s0-probed RESULT=pass>
2022-06-24T15:57:10.230393 /lava-6677599/1/../bin/lava-test-case
2022-06-24T15:57:10.241142 <8>[ 33.910579] <LAVA_SIGNAL_TESTCASE TEST_CASE_ID=rockchip-i2s1-probed RESULT=fail>


cip-gitlab/ci/iwamatsu/linux-5.10.y-cip-rc baseline-nfs: 38 runs, 3 regressions (v5.10.121-cip9-272-g3fb28d4c623b) #kernelci

kernelci.org bot <bot@...>
 

cip-gitlab/ci/iwamatsu/linux-5.10.y-cip-rc baseline-nfs: 38 runs, 3 regressions (v5.10.121-cip9-272-g3fb28d4c623b)

Regressions Summary
-------------------

platform | arch | lab | compiler | defconfig | regressions
-----------------------+--------+---------------+----------+------------------------------+------------
asus-C436FA-Flip-hatch | x86_64 | lab-collabora | gcc-10 | x86_64_defcon...6-chromebook | 1
bcm2711-rpi-4-b | arm64 | lab-collabora | gcc-10 | defconfig | 1
rk3399-gru-kevin | arm64 | lab-collabora | gcc-10 | defconfig+arm64-chromebook | 1

Details: https://kernelci.org/test/job/cip-gitlab/branch/ci%2Fiwamatsu%2Flinux-5.10.y-cip-rc/kernel/v5.10.121-cip9-272-g3fb28d4c623b/plan/baseline-nfs/

Test: baseline-nfs
Tree: cip-gitlab
Branch: ci/iwamatsu/linux-5.10.y-cip-rc
Describe: v5.10.121-cip9-272-g3fb28d4c623b
URL: https://gitlab.com/cip-project/cip-kernel/linux-cip.git
SHA: 3fb28d4c623b354373a844dd48f16cb4f005388e


Test Regressions
----------------


platform | arch | lab | compiler | defconfig | regressions
-----------------------+--------+---------------+----------+------------------------------+------------
asus-C436FA-Flip-hatch | x86_64 | lab-collabora | gcc-10 | x86_64_defcon...6-chromebook | 1

Details: https://kernelci.org/test/plan/id/62b5dd190cbb9f056aa39bd7

Results: 0 PASS, 1 FAIL, 0 SKIP
Full config: x86_64_defconfig+x86-chromebook
Compiler: gcc-10 (gcc (Debian 10.2.1-6) 10.2.1 20210110)
Plain log: https://storage.kernelci.org//cip-gitlab/ci-iwamatsu-linux-5.10.y-cip-rc/v5.10.121-cip9-272-g3fb28d4c623b/x86_64/x86_64_defconfig+x86-chromebook/gcc-10/lab-collabora/baseline-nfs-asus-C436FA-Flip-hatch.txt
HTML log: https://storage.kernelci.org//cip-gitlab/ci-iwamatsu-linux-5.10.y-cip-rc/v5.10.121-cip9-272-g3fb28d4c623b/x86_64/x86_64_defconfig+x86-chromebook/gcc-10/lab-collabora/baseline-nfs-asus-C436FA-Flip-hatch.html
Rootfs: http://storage.kernelci.org/images/rootfs/debian/bullseye/20220610.0/amd64/initrd.cpio.gz


* baseline-nfs.login: https://kernelci.org/test/case/id/62b5dd190cbb9f056aa39bd8
new failure (last pass: v5.10.118-cip8-218-g9c4d612b27204)



platform | arch | lab | compiler | defconfig | regressions
-----------------------+--------+---------------+----------+------------------------------+------------
bcm2711-rpi-4-b | arm64 | lab-collabora | gcc-10 | defconfig | 1

Details: https://kernelci.org/test/plan/id/62b5deee369a2b198fa39c18

Results: 0 PASS, 1 FAIL, 0 SKIP
Full config: defconfig
Compiler: gcc-10 (aarch64-linux-gnu-gcc (Debian 10.2.1-6) 10.2.1 20210110)
Plain log: https://storage.kernelci.org//cip-gitlab/ci-iwamatsu-linux-5.10.y-cip-rc/v5.10.121-cip9-272-g3fb28d4c623b/arm64/defconfig/gcc-10/lab-collabora/baseline-nfs-bcm2711-rpi-4-b.txt
HTML log: https://storage.kernelci.org//cip-gitlab/ci-iwamatsu-linux-5.10.y-cip-rc/v5.10.121-cip9-272-g3fb28d4c623b/arm64/defconfig/gcc-10/lab-collabora/baseline-nfs-bcm2711-rpi-4-b.html
Rootfs: http://storage.kernelci.org/images/rootfs/debian/bullseye/20220610.0/arm64/initrd.cpio.gz


* baseline-nfs.login: https://kernelci.org/test/case/id/62b5deee369a2b198fa39c19
new failure (last pass: v5.10.118-465-g0af29783a3c9)



platform | arch | lab | compiler | defconfig | regressions
-----------------------+--------+---------------+----------+------------------------------+------------
rk3399-gru-kevin | arm64 | lab-collabora | gcc-10 | defconfig+arm64-chromebook | 1

Details: https://kernelci.org/test/plan/id/62b5def8f3bfe7f836a39bd8

Results: 84 PASS, 4 FAIL, 0 SKIP
Full config: defconfig+arm64-chromebook
Compiler: gcc-10 (aarch64-linux-gnu-gcc (Debian 10.2.1-6) 10.2.1 20210110)
Plain log: https://storage.kernelci.org//cip-gitlab/ci-iwamatsu-linux-5.10.y-cip-rc/v5.10.121-cip9-272-g3fb28d4c623b/arm64/defconfig+arm64-chromebook/gcc-10/lab-collabora/baseline-nfs-rk3399-gru-kevin.txt
HTML log: https://storage.kernelci.org//cip-gitlab/ci-iwamatsu-linux-5.10.y-cip-rc/v5.10.121-cip9-272-g3fb28d4c623b/arm64/defconfig+arm64-chromebook/gcc-10/lab-collabora/baseline-nfs-rk3399-gru-kevin.html
Rootfs: http://storage.kernelci.org/images/rootfs/debian/bullseye/20220610.0/arm64/initrd.cpio.gz


* baseline-nfs.bootrr.rockchip-i2s1-probed: https://kernelci.org/test/case/id/62b5def9f3bfe7f836a39bfa
failing since 107 days (last pass: v5.10.100-cip2-319-gcbff87047566, first fail: v5.10.100-cip2-425-g0a0d92194f39)

2022-06-24T15:57:23.135002 <8>[ 36.477898] <LAVA_SIGNAL_TESTCASE TEST_CASE_ID=rockchip-i2s0-probed RESULT=pass>
2022-06-24T15:57:24.134550 <4>[ 37.476414] cdn-dp fec00000.dp: Direct firmware load for rockchip/dptx.bin failed with error -2
2022-06-24T15:57:24.144129 <4>[ 37.487065] cdn-dp fec00000.dp: Falling back to sysfs fallback for: rockchip/dptx.bin
2022-06-24T15:57:24.170819 /lava-6677592/1/../bin/lava-test-case
2022-06-24T15:57:24.205468 <8>[ 37.548803] <LAVA_SIGNAL_TESTCASE TEST_CASE_ID=rockchip-i2s1-probed RESULT=fail>


cip-gitlab/ci/iwamatsu/linux-5.10.y-cip-rc build: 168 builds: 3 failed, 165 passed, 4 errors, 10 warnings (v5.10.121-cip9-272-g3fb28d4c623b) #kernelci

kernelci.org bot <bot@...>
 

cip-gitlab/ci/iwamatsu/linux-5.10.y-cip-rc build: 168 builds: 3 failed, 165 passed, 4 errors, 10 warnings (v5.10.121-cip9-272-g3fb28d4c623b)

Full Build Summary: https://kernelci.org/build/cip-gitlab/branch/ci%2Fiwamatsu%2Flinux-5.10.y-cip-rc/kernel/v5.10.121-cip9-272-g3fb28d4c623b/

Tree: cip-gitlab
Branch: ci/iwamatsu/linux-5.10.y-cip-rc
Git Describe: v5.10.121-cip9-272-g3fb28d4c623b
Git Commit: 3fb28d4c623b354373a844dd48f16cb4f005388e
Git URL: https://gitlab.com/cip-project/cip-kernel/linux-cip.git
Built: 7 unique architectures

Build Failures Detected:

arm:
rpc_defconfig: (gcc-10) FAIL

mips:
ip27_defconfig: (gcc-10) FAIL
ip28_defconfig: (gcc-10) FAIL

Errors and Warnings Detected:

arc:

arm64:

arm:
rpc_defconfig (gcc-10): 4 errors

i386:

mips:
32r2el_defconfig (gcc-10): 1 warning
decstation_64_defconfig (gcc-10): 1 warning
decstation_defconfig (gcc-10): 1 warning
decstation_r4k_defconfig (gcc-10): 1 warning
lemote2f_defconfig (gcc-10): 1 warning
rm200_defconfig (gcc-10): 1 warning

riscv:
rv32_defconfig (gcc-10): 4 warnings

x86_64:

Errors summary:

2 arm-linux-gnueabihf-gcc: error: unrecognized -march target: armv3m
2 arm-linux-gnueabihf-gcc: error: missing argument to ‘-march=’

Warnings summary:

3 kernel/rcu/tasks.h:710:13: warning: ‘show_rcu_tasks_rude_gp_kthread’ defined but not used [-Wunused-function]
2 <stdin>:830:2: warning: #warning syscall fstat64 not implemented [-Wcpp]
2 <stdin>:1127:2: warning: #warning syscall fstatat64 not implemented [-Wcpp]
1 net/mac80211/mlme.c:4349:1: warning: the frame size of 1040 bytes is larger than 1024 bytes [-Wframe-larger-than=]
1 drivers/block/paride/bpck.c:32: warning: "PC" redefined
1 WARNING: modpost: Symbol info of vmlinux is missing. Unresolved symbol check will be entirely skipped.

================================================================================

Detailed per-defconfig build reports:

--------------------------------------------------------------------------------
32r2el_defconfig (mips, gcc-10) — PASS, 0 errors, 1 warning, 0 section mismatches

Warnings:
WARNING: modpost: Symbol info of vmlinux is missing. Unresolved symbol check will be entirely skipped.

--------------------------------------------------------------------------------
allnoconfig (arc, gcc-10) — PASS, 0 errors, 0 warnings, 0 section mismatches

--------------------------------------------------------------------------------
allnoconfig (i386, gcc-10) — PASS, 0 errors, 0 warnings, 0 section mismatches

--------------------------------------------------------------------------------
allnoconfig (x86_64, gcc-10) — PASS, 0 errors, 0 warnings, 0 section mismatches

--------------------------------------------------------------------------------
am200epdkit_defconfig (arm, gcc-10) — PASS, 0 errors, 0 warnings, 0 section mismatches

--------------------------------------------------------------------------------
ar7_defconfig (mips, gcc-10) — PASS, 0 errors, 0 warnings, 0 section mismatches

--------------------------------------------------------------------------------
aspeed_g4_defconfig (arm, gcc-10) — PASS, 0 errors, 0 warnings, 0 section mismatches

--------------------------------------------------------------------------------
aspeed_g5_defconfig (arm, gcc-10) — PASS, 0 errors, 0 warnings, 0 section mismatches

--------------------------------------------------------------------------------
assabet_defconfig (arm, gcc-10) — PASS, 0 errors, 0 warnings, 0 section mismatches

--------------------------------------------------------------------------------
at91_dt_defconfig (arm, gcc-10) — PASS, 0 errors, 0 warnings, 0 section mismatches

--------------------------------------------------------------------------------
ath25_defconfig (mips, gcc-10) — PASS, 0 errors, 0 warnings, 0 section mismatches

--------------------------------------------------------------------------------
ath79_defconfig (mips, gcc-10) — PASS, 0 errors, 0 warnings, 0 section mismatches

--------------------------------------------------------------------------------
axs103_smp_defconfig (arc, gcc-10) — PASS, 0 errors, 0 warnings, 0 section mismatches

--------------------------------------------------------------------------------
badge4_defconfig (arm, gcc-10) — PASS, 0 errors, 0 warnings, 0 section mismatches

--------------------------------------------------------------------------------
bcm2835_defconfig (arm, gcc-10) — PASS, 0 errors, 0 warnings, 0 section mismatches

--------------------------------------------------------------------------------
bcm47xx_defconfig (mips, gcc-10) — PASS, 0 errors, 0 warnings, 0 section mismatches

--------------------------------------------------------------------------------
bcm63xx_defconfig (mips, gcc-10) — PASS, 0 errors, 0 warnings, 0 section mismatches

--------------------------------------------------------------------------------
bigsur_defconfig (mips, gcc-10) — PASS, 0 errors, 0 warnings, 0 section mismatches

--------------------------------------------------------------------------------
bmips_stb_defconfig (mips, gcc-10) — PASS, 0 errors, 0 warnings, 0 section mismatches

--------------------------------------------------------------------------------
capcella_defconfig (mips, gcc-10) — PASS, 0 errors, 0 warnings, 0 section mismatches

--------------------------------------------------------------------------------
cavium_octeon_defconfig (mips, gcc-10) — PASS, 0 errors, 0 warnings, 0 section mismatches

--------------------------------------------------------------------------------
cerfcube_defconfig (arm, gcc-10) — PASS, 0 errors, 0 warnings, 0 section mismatches

--------------------------------------------------------------------------------
ci20_defconfig (mips, gcc-10) — PASS, 0 errors, 0 warnings, 0 section mismatches

--------------------------------------------------------------------------------
cm_x300_defconfig (arm, gcc-10) — PASS, 0 errors, 0 warnings, 0 section mismatches

--------------------------------------------------------------------------------
cobalt_defconfig (mips, gcc-10) — PASS, 0 errors, 0 warnings, 0 section mismatches

--------------------------------------------------------------------------------
colibri_pxa270_defconfig (arm, gcc-10) — PASS, 0 errors, 0 warnings, 0 section mismatches

--------------------------------------------------------------------------------
colibri_pxa300_defconfig (arm, gcc-10) — PASS, 0 errors, 0 warnings, 0 section mismatches

--------------------------------------------------------------------------------
collie_defconfig (arm, gcc-10) — PASS, 0 errors, 0 warnings, 0 section mismatches

--------------------------------------------------------------------------------
corgi_defconfig (arm, gcc-10) — PASS, 0 errors, 0 warnings, 0 section mismatches

--------------------------------------------------------------------------------
cu1830-neo_defconfig (mips, gcc-10) — PASS, 0 errors, 0 warnings, 0 section mismatches

--------------------------------------------------------------------------------
davinci_all_defconfig (arm, gcc-10) — PASS, 0 errors, 0 warnings, 0 section mismatches

--------------------------------------------------------------------------------
db1xxx_defconfig (mips, gcc-10) — PASS, 0 errors, 0 warnings, 0 section mismatches

--------------------------------------------------------------------------------
decstation_64_defconfig (mips, gcc-10) — PASS, 0 errors, 1 warning, 0 section mismatches

Warnings:
kernel/rcu/tasks.h:710:13: warning: ‘show_rcu_tasks_rude_gp_kthread’ defined but not used [-Wunused-function]

--------------------------------------------------------------------------------
decstation_defconfig (mips, gcc-10) — PASS, 0 errors, 1 warning, 0 section mismatches

Warnings:
kernel/rcu/tasks.h:710:13: warning: ‘show_rcu_tasks_rude_gp_kthread’ defined but not used [-Wunused-function]

--------------------------------------------------------------------------------
decstation_r4k_defconfig (mips, gcc-10) — PASS, 0 errors, 1 warning, 0 section mismatches

Warnings:
kernel/rcu/tasks.h:710:13: warning: ‘show_rcu_tasks_rude_gp_kthread’ defined but not used [-Wunused-function]

--------------------------------------------------------------------------------
defconfig (riscv, gcc-10) — PASS, 0 errors, 0 warnings, 0 section mismatches

--------------------------------------------------------------------------------
defconfig (arm64, gcc-10) — PASS, 0 errors, 0 warnings, 0 section mismatches

--------------------------------------------------------------------------------
defconfig+arm64-chromebook (arm64, gcc-10) — PASS, 0 errors, 0 warnings, 0 section mismatches

--------------------------------------------------------------------------------
defconfig+arm64-chromebook+kselftest (arm64, gcc-10) — PASS, 0 errors, 0 warnings, 0 section mismatches

--------------------------------------------------------------------------------
defconfig+kselftest (arm64, gcc-10) — PASS, 0 errors, 0 warnings, 0 section mismatches

--------------------------------------------------------------------------------
dove_defconfig (arm, gcc-10) — PASS, 0 errors, 0 warnings, 0 section mismatches

--------------------------------------------------------------------------------
e55_defconfig (mips, gcc-10) — PASS, 0 errors, 0 warnings, 0 section mismatches

--------------------------------------------------------------------------------
ebsa110_defconfig (arm, gcc-10) — PASS, 0 errors, 0 warnings, 0 section mismatches

--------------------------------------------------------------------------------
efm32_defconfig (arm, gcc-10) — PASS, 0 errors, 0 warnings, 0 section mismatches

--------------------------------------------------------------------------------
ep93xx_defconfig (arm, gcc-10) — PASS, 0 errors, 0 warnings, 0 section mismatches

--------------------------------------------------------------------------------
eseries_pxa_defconfig (arm, gcc-10) — PASS, 0 errors, 0 warnings, 0 section mismatches

--------------------------------------------------------------------------------
exynos_defconfig (arm, gcc-10) — PASS, 0 errors, 0 warnings, 0 section mismatches

--------------------------------------------------------------------------------
ezx_defconfig (arm, gcc-10) — PASS, 0 errors, 0 warnings, 0 section mismatches

--------------------------------------------------------------------------------
fuloong2e_defconfig (mips, gcc-10) — PASS, 0 errors, 0 warnings, 0 section mismatches

--------------------------------------------------------------------------------
gcw0_defconfig (mips, gcc-10) — PASS, 0 errors, 0 warnings, 0 section mismatches

--------------------------------------------------------------------------------
gpr_defconfig (mips, gcc-10) — PASS, 0 errors, 0 warnings, 0 section mismatches

--------------------------------------------------------------------------------
h3600_defconfig (arm, gcc-10) — PASS, 0 errors, 0 warnings, 0 section mismatches

--------------------------------------------------------------------------------
h5000_defconfig (arm, gcc-10) — PASS, 0 errors, 0 warnings, 0 section mismatches

--------------------------------------------------------------------------------
hackkit_defconfig (arm, gcc-10) — PASS, 0 errors, 0 warnings, 0 section mismatches

--------------------------------------------------------------------------------
haps_hs_smp_defconfig (arc, gcc-10) — PASS, 0 errors, 0 warnings, 0 section mismatches

--------------------------------------------------------------------------------
hisi_defconfig (arm, gcc-10) — PASS, 0 errors, 0 warnings, 0 section mismatches

--------------------------------------------------------------------------------
hsdk_defconfig (arc, gcc-10) — PASS, 0 errors, 0 warnings, 0 section mismatches

--------------------------------------------------------------------------------
i386_defconfig (i386, gcc-10) — PASS, 0 errors, 0 warnings, 0 section mismatches

--------------------------------------------------------------------------------
imote2_defconfig (arm, gcc-10) — PASS, 0 errors, 0 warnings, 0 section mismatches

--------------------------------------------------------------------------------
imx_v4_v5_defconfig (arm, gcc-10) — PASS, 0 errors, 0 warnings, 0 section mismatches

--------------------------------------------------------------------------------
imx_v6_v7_defconfig (arm, gcc-10) — PASS, 0 errors, 0 warnings, 0 section mismatches

--------------------------------------------------------------------------------
integrator_defconfig (arm, gcc-10) — PASS, 0 errors, 0 warnings, 0 section mismatches

--------------------------------------------------------------------------------
iop32x_defconfig (arm, gcc-10) — PASS, 0 errors, 0 warnings, 0 section mismatches

--------------------------------------------------------------------------------
ip22_defconfig (mips, gcc-10) — PASS, 0 errors, 0 warnings, 0 section mismatches

--------------------------------------------------------------------------------
ip27_defconfig (mips, gcc-10) — FAIL, 0 errors, 0 warnings, 0 section mismatches

--------------------------------------------------------------------------------
ip28_defconfig (mips, gcc-10) — FAIL, 0 errors, 0 warnings, 0 section mismatches

--------------------------------------------------------------------------------
ixp4xx_defconfig (arm, gcc-10) — PASS, 0 errors, 0 warnings, 0 section mismatches

--------------------------------------------------------------------------------
jazz_defconfig (mips, gcc-10) — PASS, 0 errors, 0 warnings, 0 section mismatches

--------------------------------------------------------------------------------
jornada720_defconfig (arm, gcc-10) — PASS, 0 errors, 0 warnings, 0 section mismatches

--------------------------------------------------------------------------------
keystone_defconfig (arm, gcc-10) — PASS, 0 errors, 0 warnings, 0 section mismatches

--------------------------------------------------------------------------------
lart_defconfig (arm, gcc-10) — PASS, 0 errors, 0 warnings, 0 section mismatches

--------------------------------------------------------------------------------
lemote2f_defconfig (mips, gcc-10) — PASS, 0 errors, 1 warning, 0 section mismatches

Warnings:
net/mac80211/mlme.c:4349:1: warning: the frame size of 1040 bytes is larger than 1024 bytes [-Wframe-larger-than=]

--------------------------------------------------------------------------------
lpc18xx_defconfig (arm, gcc-10) — PASS, 0 errors, 0 warnings, 0 section mismatches

--------------------------------------------------------------------------------
lpc32xx_defconfig (arm, gcc-10) — PASS, 0 errors, 0 warnings, 0 section mismatches

--------------------------------------------------------------------------------
lpd270_defconfig (arm, gcc-10) — PASS, 0 errors, 0 warnings, 0 section mismatches

--------------------------------------------------------------------------------
lubbock_defconfig (arm, gcc-10) — PASS, 0 errors, 0 warnings, 0 section mismatches

--------------------------------------------------------------------------------
magician_defconfig (arm, gcc-10) — PASS, 0 errors, 0 warnings, 0 section mismatches

--------------------------------------------------------------------------------
mainstone_defconfig (arm, gcc-10) — PASS, 0 errors, 0 warnings, 0 section mismatches

--------------------------------------------------------------------------------
malta_defconfig (mips, gcc-10) — PASS, 0 errors, 0 warnings, 0 section mismatches

--------------------------------------------------------------------------------
malta_kvm_defconfig (mips, gcc-10) — PASS, 0 errors, 0 warnings, 0 section mismatches

--------------------------------------------------------------------------------
malta_qemu_32r6_defconfig (mips, gcc-10) — PASS, 0 errors, 0 warnings, 0 section mismatches

--------------------------------------------------------------------------------
maltaaprp_defconfig (mips, gcc-10) — PASS, 0 errors, 0 warnings, 0 section mismatches

--------------------------------------------------------------------------------
maltasmvp_defconfig (mips, gcc-10) — PASS, 0 errors, 0 warnings, 0 section mismatches

--------------------------------------------------------------------------------
maltasmvp_eva_defconfig (mips, gcc-10) — PASS, 0 errors, 0 warnings, 0 section mismatches

--------------------------------------------------------------------------------
maltaup_defconfig (mips, gcc-10) — PASS, 0 errors, 0 warnings, 0 section mismatches

--------------------------------------------------------------------------------
maltaup_xpa_defconfig (mips, gcc-10) — PASS, 0 errors, 0 warnings, 0 section mismatches

--------------------------------------------------------------------------------
milbeaut_m10v_defconfig (arm, gcc-10) — PASS, 0 errors, 0 warnings, 0 section mismatches

--------------------------------------------------------------------------------
mini2440_defconfig (arm, gcc-10) — PASS, 0 errors, 0 warnings, 0 section mismatches

--------------------------------------------------------------------------------
mmp2_defconfig (arm, gcc-10) — PASS, 0 errors, 0 warnings, 0 section mismatches

--------------------------------------------------------------------------------
moxart_defconfig (arm, gcc-10) — PASS, 0 errors, 0 warnings, 0 section mismatches

--------------------------------------------------------------------------------
mpc30x_defconfig (mips, gcc-10) — PASS, 0 errors, 0 warnings, 0 section mismatches

--------------------------------------------------------------------------------
mps2_defconfig (arm, gcc-10) — PASS, 0 errors, 0 warnings, 0 section mismatches

--------------------------------------------------------------------------------
mtx1_defconfig (mips, gcc-10) — PASS, 0 errors, 0 warnings, 0 section mismatches

--------------------------------------------------------------------------------
multi_v4t_defconfig (arm, gcc-10) — PASS, 0 errors, 0 warnings, 0 section mismatches

--------------------------------------------------------------------------------
multi_v5_defconfig (arm, gcc-10) — PASS, 0 errors, 0 warnings, 0 section mismatches

--------------------------------------------------------------------------------
multi_v7_defconfig (arm, gcc-10) — PASS, 0 errors, 0 warnings, 0 section mismatches

--------------------------------------------------------------------------------
multi_v7_defconfig+kselftest (arm, gcc-10) — PASS, 0 errors, 0 warnings, 0 section mismatches

--------------------------------------------------------------------------------
mvebu_v5_defconfig (arm, gcc-10) — PASS, 0 errors, 0 warnings, 0 section mismatches

--------------------------------------------------------------------------------
mvebu_v7_defconfig (arm, gcc-10) — PASS, 0 errors, 0 warnings, 0 section mismatches

--------------------------------------------------------------------------------
mxs_defconfig (arm, gcc-10) — PASS, 0 errors, 0 warnings, 0 section mismatches

--------------------------------------------------------------------------------
neponset_defconfig (arm, gcc-10) — PASS, 0 errors, 0 warnings, 0 section mismatches

--------------------------------------------------------------------------------
netwinder_defconfig (arm, gcc-10) — PASS, 0 errors, 0 warnings, 0 section mismatches

--------------------------------------------------------------------------------
nhk8815_defconfig (arm, gcc-10) — PASS, 0 errors, 0 warnings, 0 section mismatches

--------------------------------------------------------------------------------
nlm_xlr_defconfig (mips, gcc-10) — PASS, 0 errors, 0 warnings, 0 section mismatches

--------------------------------------------------------------------------------
nommu_k210_defconfig (riscv, gcc-10) — PASS, 0 errors, 0 warnings, 0 section mismatches

--------------------------------------------------------------------------------
nsimosci_hs_defconfig (arc, gcc-10) — PASS, 0 errors, 0 warnings, 0 section mismatches

--------------------------------------------------------------------------------
nsimosci_hs_smp_defconfig (arc, gcc-10) — PASS, 0 errors, 0 warnings, 0 section mismatches

--------------------------------------------------------------------------------
omap1_defconfig (arm, gcc-10) — PASS, 0 errors, 0 warnings, 0 section mismatches

--------------------------------------------------------------------------------
omega2p_defconfig (mips, gcc-10) — PASS, 0 errors, 0 warnings, 0 section mismatches

--------------------------------------------------------------------------------
orion5x_defconfig (arm, gcc-10) — PASS, 0 errors, 0 warnings, 0 section mismatches

--------------------------------------------------------------------------------
oxnas_v6_defconfig (arm, gcc-10) — PASS, 0 errors, 0 warnings, 0 section mismatches

--------------------------------------------------------------------------------
palmz72_defconfig (arm, gcc-10) — PASS, 0 errors, 0 warnings, 0 section mismatches

--------------------------------------------------------------------------------
pcm027_defconfig (arm, gcc-10) — PASS, 0 errors, 0 warnings, 0 section mismatches

--------------------------------------------------------------------------------
pic32mzda_defconfig (mips, gcc-10) — PASS, 0 errors, 0 warnings, 0 section mismatches

--------------------------------------------------------------------------------
pleb_defconfig (arm, gcc-10) — PASS, 0 errors, 0 warnings, 0 section mismatches

--------------------------------------------------------------------------------
pxa168_defconfig (arm, gcc-10) — PASS, 0 errors, 0 warnings, 0 section mismatches

--------------------------------------------------------------------------------
pxa255-idp_defconfig (arm, gcc-10) — PASS, 0 errors, 0 warnings, 0 section mismatches

--------------------------------------------------------------------------------
pxa3xx_defconfig (arm, gcc-10) — PASS, 0 errors, 0 warnings, 0 section mismatches

--------------------------------------------------------------------------------
pxa910_defconfig (arm, gcc-10) — PASS, 0 errors, 0 warnings, 0 section mismatches

--------------------------------------------------------------------------------
pxa_defconfig (arm, gcc-10) — PASS, 0 errors, 0 warnings, 0 section mismatches

--------------------------------------------------------------------------------
qcom_defconfig (arm, gcc-10) — PASS, 0 errors, 0 warnings, 0 section mismatches

--------------------------------------------------------------------------------
qi_lb60_defconfig (mips, gcc-10) — PASS, 0 errors, 0 warnings, 0 section mismatches

--------------------------------------------------------------------------------
rb532_defconfig (mips, gcc-10) — PASS, 0 errors, 0 warnings, 0 section mismatches

--------------------------------------------------------------------------------
rbtx49xx_defconfig (mips, gcc-10) — PASS, 0 errors, 0 warnings, 0 section mismatches

--------------------------------------------------------------------------------
realview_defconfig (arm, gcc-10) — PASS, 0 errors, 0 warnings, 0 section mismatches

--------------------------------------------------------------------------------
rm200_defconfig (mips, gcc-10) — PASS, 0 errors, 1 warning, 0 section mismatches

Warnings:
drivers/block/paride/bpck.c:32: warning: "PC" redefined

--------------------------------------------------------------------------------
rpc_defconfig (arm, gcc-10) — FAIL, 4 errors, 0 warnings, 0 section mismatches

Errors:
arm-linux-gnueabihf-gcc: error: unrecognized -march target: armv3m
arm-linux-gnueabihf-gcc: error: missing argument to ‘-march=’
arm-linux-gnueabihf-gcc: error: unrecognized -march target: armv3m
arm-linux-gnueabihf-gcc: error: missing argument to ‘-march=’

--------------------------------------------------------------------------------
rs90_defconfig (mips, gcc-10) — PASS, 0 errors, 0 warnings, 0 section mismatches

--------------------------------------------------------------------------------
rt305x_defconfig (mips, gcc-10) — PASS, 0 errors, 0 warnings, 0 section mismatches

--------------------------------------------------------------------------------
rv32_defconfig (riscv, gcc-10) — PASS, 0 errors, 4 warnings, 0 section mismatches

Warnings:
<stdin>:830:2: warning: #warning syscall fstat64 not implemented [-Wcpp]
<stdin>:1127:2: warning: #warning syscall fstatat64 not implemented [-Wcpp]
<stdin>:830:2: warning: #warning syscall fstat64 not implemented [-Wcpp]
<stdin>:1127:2: warning: #warning syscall fstatat64 not implemented [-Wcpp]

--------------------------------------------------------------------------------
s3c6400_defconfig (arm, gcc-10) — PASS, 0 errors, 0 warnings, 0 section mismatches

--------------------------------------------------------------------------------
s5pv210_defconfig (arm, gcc-10) — PASS, 0 errors, 0 warnings, 0 section mismatches

--------------------------------------------------------------------------------
sama5_defconfig (arm, gcc-10) — PASS, 0 errors, 0 warnings, 0 section mismatches

--------------------------------------------------------------------------------
sb1250_swarm_defconfig (mips, gcc-10) — PASS, 0 errors, 0 warnings, 0 section mismatches

--------------------------------------------------------------------------------
shmobile_defconfig (arm, gcc-10) — PASS, 0 errors, 0 warnings, 0 section mismatches

--------------------------------------------------------------------------------
simpad_defconfig (arm, gcc-10) — PASS, 0 errors, 0 warnings, 0 section mismatches

--------------------------------------------------------------------------------
socfpga_defconfig (arm, gcc-10) — PASS, 0 errors, 0 warnings, 0 section mismatches

--------------------------------------------------------------------------------
spear13xx_defconfig (arm, gcc-10) — PASS, 0 errors, 0 warnings, 0 section mismatches

--------------------------------------------------------------------------------
spear3xx_defconfig (arm, gcc-10) — PASS, 0 errors, 0 warnings, 0 section mismatches

--------------------------------------------------------------------------------
spear6xx_defconfig (arm, gcc-10) — PASS, 0 errors, 0 warnings, 0 section mismatches

--------------------------------------------------------------------------------
spitz_defconfig (arm, gcc-10) — PASS, 0 errors, 0 warnings, 0 section mismatches

--------------------------------------------------------------------------------
stm32_defconfig (arm, gcc-10) — PASS, 0 errors, 0 warnings, 0 section mismatches

--------------------------------------------------------------------------------
sunxi_defconfig (arm, gcc-10) — PASS, 0 errors, 0 warnings, 0 section mismatches

--------------------------------------------------------------------------------
tango4_defconfig (arm, gcc-10) — PASS, 0 errors, 0 warnings, 0 section mismatches

--------------------------------------------------------------------------------
tb0219_defconfig (mips, gcc-10) — PASS, 0 errors, 0 warnings, 0 section mismatches

--------------------------------------------------------------------------------
tb0226_defconfig (mips, gcc-10) — PASS, 0 errors, 0 warnings, 0 section mismatches

--------------------------------------------------------------------------------
tb0287_defconfig (mips, gcc-10) — PASS, 0 errors, 0 warnings, 0 section mismatches

--------------------------------------------------------------------------------
tct_hammer_defconfig (arm, gcc-10) — PASS, 0 errors, 0 warnings, 0 section mismatches

--------------------------------------------------------------------------------
tinyconfig (i386, gcc-10) — PASS, 0 errors, 0 warnings, 0 section mismatches

--------------------------------------------------------------------------------
tinyconfig (x86_64, gcc-10) — PASS, 0 errors, 0 warnings, 0 section mismatches

--------------------------------------------------------------------------------
tinyconfig (arc, gcc-10) — PASS, 0 errors, 0 warnings, 0 section mismatches

--------------------------------------------------------------------------------
u300_defconfig (arm, gcc-10) — PASS, 0 errors, 0 warnings, 0 section mismatches

--------------------------------------------------------------------------------
u8500_defconfig (arm, gcc-10) — PASS, 0 errors, 0 warnings, 0 section mismatches

--------------------------------------------------------------------------------
vdk_hs38_defconfig (arc, gcc-10) — PASS, 0 errors, 0 warnings, 0 section mismatches

--------------------------------------------------------------------------------
vdk_hs38_smp_defconfig (arc, gcc-10) — PASS, 0 errors, 0 warnings, 0 section mismatches

--------------------------------------------------------------------------------
versatile_defconfig (arm, gcc-10) — PASS, 0 errors, 0 warnings, 0 section mismatches

--------------------------------------------------------------------------------
vf610m4_defconfig (arm, gcc-10) — PASS, 0 errors, 0 warnings, 0 section mismatches

--------------------------------------------------------------------------------
viper_defconfig (arm, gcc-10) — PASS, 0 errors, 0 warnings, 0 section mismatches

--------------------------------------------------------------------------------
vocore2_defconfig (mips, gcc-10) — PASS, 0 errors, 0 warnings, 0 section mismatches

--------------------------------------------------------------------------------
vt8500_v6_v7_defconfig (arm, gcc-10) — PASS, 0 errors, 0 warnings, 0 section mismatches

--------------------------------------------------------------------------------
workpad_defconfig (mips, gcc-10) — PASS, 0 errors, 0 warnings, 0 section mismatches

--------------------------------------------------------------------------------
x86_64_defconfig (x86_64, gcc-10) — PASS, 0 errors, 0 warnings, 0 section mismatches

--------------------------------------------------------------------------------
x86_64_defconfig+kselftest (x86_64, gcc-10) — PASS, 0 errors, 0 warnings, 0 section mismatches

--------------------------------------------------------------------------------
x86_64_defconfig+x86-chromebook (x86_64, gcc-10) — PASS, 0 errors, 0 warnings, 0 section mismatches

--------------------------------------------------------------------------------
x86_64_defconfig+x86-chromebook+kselftest (x86_64, gcc-10) — PASS, 0 errors, 0 warnings, 0 section mismatches

--------------------------------------------------------------------------------
xcep_defconfig (arm, gcc-10) — PASS, 0 errors, 0 warnings, 0 section mismatches

--------------------------------------------------------------------------------
zeus_defconfig (arm, gcc-10) — PASS, 0 errors, 0 warnings, 0 section mismatches

--------------------------------------------------------------------------------
zx_defconfig (arm, gcc-10) — PASS, 0 errors, 0 warnings, 0 section mismatches

---
For more info write to <info@...>


Re: How to increase the size of the rootfs in the isar-cip-core image

Venkata Pyla
 

Thanks Vijaikumar,

I am able to increase the rootfs size by using the variable 'ROOTFS_EXTRA'.

-----Original Message-----
From: cip-dev@... <cip-dev@...> On Behalf Of
Kanagarajan, Vijaikumar
Sent: 24 June 2022 10:44
To: cip-dev@...
Subject: Re: [cip-dev] How to increase the size of the rootfs in the isar-cip-core
image



From: cip-dev@... <cip-dev@...> On Behalf Of
Venkata Pyla
Sent: 23 June 2022 23:46
To: cip-dev@...
Subject: [cip-dev] How to increase the size of the rootfs in the isar-cip-core
image

Hi,

For my experiment, I am trying to increase the rootfs size in isar-cip-core image,
but I am unable to do.

I have tried the below variables but no luck:

+local_conf_header:
+    rootfs-image: |
+        IMAGE_ROOTFS_SIZE = "8392704"
+        IMAGE_OVERHEAD_FACTOR = "1.0"

and also below variable is not helpful.
+        IMAGE_ROOTFS_EXTRA_SPACE = "8392704"

Could anyone guide me how to do this.

Hi Venkata,

Can you try setting ROOTFS_EXTRA? Units are in MB.

https://github.com/ilbers/isar/blob/1000df8e98b9a5849a7897698039687fd0cdd
7d3/meta/classes/image.bbclass#L88

Thanks,
Vijai Kumar K


Thanks for your help.

Venkata.


Re: How to increase the size of the rootfs in the isar-cip-core image

Kanagarajan, Vijaikumar
 

From: cip-dev@... <cip-dev@...> On Behalf Of Venkata Pyla
Sent: 23 June 2022 23:46
To: cip-dev@...
Subject: [cip-dev] How to increase the size of the rootfs in the isar-cip-core image

Hi,
 
For my experiment, I am trying to increase the rootfs size in isar-cip-core image, but I am unable to do.
 
I have tried the below variables but no luck:
 
+local_conf_header:
+    rootfs-image: |
+        IMAGE_ROOTFS_SIZE = "8392704"
+        IMAGE_OVERHEAD_FACTOR = "1.0"
 
and also below variable is not helpful.
+        IMAGE_ROOTFS_EXTRA_SPACE = "8392704"
 
Could anyone guide me how to do this.

Hi Venkata,

Can you try setting ROOTFS_EXTRA? Units are in MB.

https://github.com/ilbers/isar/blob/1000df8e98b9a5849a7897698039687fd0cdd7d3/meta/classes/image.bbclass#L88

Thanks,
Vijai Kumar K


Thanks for your help.
 
Venkata.


How to increase the size of the rootfs in the isar-cip-core image

Venkata Pyla
 

Hi,

 

For my experiment, I am trying to increase the rootfs size in isar-cip-core image, but I am unable to do.

 

I have tried the below variables but no luck:

 

+local_conf_header:

+    rootfs-image: |

+        IMAGE_ROOTFS_SIZE = "8392704"

+        IMAGE_OVERHEAD_FACTOR = "1.0"

 

and also below variable is not helpful.

+        IMAGE_ROOTFS_EXTRA_SPACE = "8392704"

 

Could anyone guide me how to do this.

 

Thanks for your help.

 

Venkata.


KernelCI reports

Pavel Machek
 

Hi!

First... what I am currently using for testing: gitlab; I simply watch
for green ticks there. It takes ~15 minutes to get results. Red cross
in compile stage is pretty sure sign of build error. Red cross in
testing means I need to look at the results, but it is pretty easy to
see "network timeout" or "board unavailable" problems, and mostly I
can just hit retry and get the green tick.

What wories me about gitlab is that we have single board for 4.4-st,
and just two for 4.4-cip.

Now, kernelci.

https://ircbot.wl.linuxfoundation.org/meetings/cip/2022/06/cip.2022-06-23-12.01.html

I got this link in the irc meeting:

https://linux.kernelci.org/job/cip/

Lets start with build results.

linux-5.10.y-cip v5.10.121-cip9 bd24696dd7ad23517733728da675a00cd3073916 169 7 3

I click on "3" and get build error summary:

Errors Summary
2 arm-linux-gnueabihf-gcc: error: unrecognized -march target: armv3m
2 arm-linux-gnueabihf-gcc: error: missing argument to ‘-march=’

...but those are not kernel problems, that's buildsystem incompatible
with config or something like that. Nothing for me to solve.

Let me go through more:

linux-4.19.y-cip v4.19.246-cip75 38ce181ac6ca9f3decdd389cbfd0a38fecdb28c7 111 8 1
linux-4.19.y-cip v4.19.245-cip74 0be9d6774be9b192bcea6fddada917ae3d22f22e 106 7 1
linux-4.19.y-cip-rt v4.19.245-cip74-rt25 c80ee3077a4ce344cf1cffa23af767c9fd75d52c 181 16 6
linux-4.4.y-cip v4.4.302-cip69-296-g52de9431d314 52de9431d314a28c4aa66d8f81144c9958c11168 164 18 5
linux-5.10.y-cip-rt v5.10.109-cip5-rt4 b41186882eaf0137277045da13ea649577c42c11 177 8 3
linux-5.10.y-cip v5.10.112-cip6 c8f6747dcd02a8f87731c324f4bc37bd120a8982 180 7 3
linux-4.19.y-cip v4.19.239-cip72 fdf770b2db8080de95dcf74cc7547319034a4a56 0 0 120

That's 19 errors total + outlier of v4.19.239-cip72 with 120
errors. None of the 19 errors is real. KernelCI needs to fix their
configs/build environment.

120 errors are reported at https://linux.kernelci.org/build/cip/branch/linux-4.19.y-cip/kernel/v4.19.239-cip72/ . Wow. Except that I don't see that many errors there. I see lines such as

cm_x2xx_defconfig ‐ arm ‐ gcc-10 0 warnings 0 errors. When I click for details I get "No test results found".

https://linux.kernelci.org/build/id/6266a495d40dfd0dacff948c/

Nothing for me to debug, either, agreed? So lets look at test results.

Branch Kernel Commit Build Status Test Results Date
linux-5.10.y-cip v5.10.121-cip9 bd24696dd7ad23517733728da675a00cd3073916 169 7 3 2457 256 21 2022-06-12

21 failures.

If I click that, I can see that most regressions (11) are at baseline
test plan. The machine that looks relevant to us is
qemu_arm64-virt-gicv2 defconfig+arm64-chromebook --

https://linux.kernelci.org/test/job/cip/branch/linux-5.10.y-cip/kernel/v5.10.121-cip9/plan/baseline/

New regression, last pass: v5.10.112-cip6

I get to
https://linux.kernelci.org/test/case/id/62a333452713980006a39c13/
which looks quite useful, it lists successful run and failed run,
v5.10.121-cip9 fails while v5.10.112-cip6 works.

Eventually I get to https://storage.kernelci.org/cip/linux-5.10.y-cip/v5.10.121-cip9/arm64/defconfig+arm64-chromebook/gcc-10/lab-baylibre/baseline-qemu_arm64-virt-gicv2.html .

And sorry, no I don't see anything I could debug there. Did the docker
fail to start? Hmm. Lets compare it with the older results.

https://storage.kernelci.org/cip/linux-5.10.y-cip/v5.10.112-cip6/arm64/defconfig+arm64-chromebook/gcc-10/lab-baylibre/baseline-qemu_arm64-virt-gicv2.html . Aha, 404. No comparison possible.

Lets try one more.

rk3399-gru-kevin defconfig+arm64-chromebook ‐ arm64 ‐ gcc-10

https://linux.kernelci.org/test/plan/id/62a337700aadba677da39bdd/

It gets me to:

https://storage.kernelci.org/cip/linux-5.10.y-cip/v5.10.121-cip9/arm64/defconfig+arm64-chromebook/gcc-10/lab-collabora/baseline-rk3399-gru-kevin.html

I see some errors... Like missing firmware (not a kernel problem). At
the end there's "tpm-chip-is-online: fail" . Is that what I should be debugging?

1368 12:21:39.212881 /usr/bin/tpm2_getcap
1369 12:21:39.251829 ERROR:sys:src/tss2-sys/api/Tss2_Sys_Execute.c:114:Tss2_Sys_ExecuteFinish() Unsupported device. The device is a TPM 1.2
1370 12:21:39.261387 ERROR:esys:src/tss2-esys/api/Esys_GetCapability.c:307:Esys_GetCapability_Finish() Received a non-TPM Error
1371 12:21:39.272254 ERROR:esys:src/tss2-esys/api/Esys_GetCapability.c:107:Esys_GetCapability() Esys Finish ErrorCode (0x00080001)
1372 12:21:39.281854 ERROR: Esys_GetCapability(0x80001) - sys:Catch all for all errors not otherwise specified
1373 12:21:39.285316 ERROR: Unable to run tpm2_getcap

Userland seems to say that it does not support this device. I guess I could compare it with older boot?

https://storage.kernelci.org/cip/linux-5.10.y-cip/v5.10.83-cip1-178-g2cf1d12aab81/arm64/defconfig+arm64-chromebook/gcc-10/lab-collabora/baseline-rk3399-gru-kevin.html

Aha, no, could not, 404.

Now, let's go through Jan's
example. https://linux.kernelci.org/build/id/61fbabe0cb6f27a6ce5d6f03/logs/?
. Again, errors look like missconfigured build system, with

arm-linux-gnueabihf-gcc: error: unrecognized -march target: armv3
arm-linux-gnueabihf-gcc: error: missing argument to ‘-march=’

Full log https://storage.kernelci.org/stable-rc/linux-4.4.y/v4.4.302/arm/rpc_defconfig/gcc-10/logs gives 404.

I spent quite some time trying to click around to find an error I
could debug. I could not find one. All of above looks like kernelCI
configuration problems. Can they be fixed and/or filtered out?

Thanks and best regards,
Pavel

--
DENX Software Engineering GmbH, Managing Director: Wolfgang Denk
HRB 165235 Munich, Office: Kirchenstr.5, D-82194 Groebenzell, Germany


CIP IRC weekly meeting today on libera.chat

Jan Kiszka
 

Hi all,

Kindly be reminded to attend the weekly meeting through IRC to discuss
technical topics with CIP kernel today. Our channel is the following:

irc:irc.libera.chat:6667/cip

The IRC meeting is scheduled to UTC (GMT) 12:00:

https://www.timeanddate.com/worldclock/meetingdetails.html?year=2022&month=6&day=23&hour=12&min=0&sec=0&p1=224&p2=179&p3=136&p4=37&p5=241&p6=248

USWest USEast UK DE TW JP
05:00 08:00 13:00 14:00 20:00 21:00

Last meeting minutes:
https://ircbot.wl.linuxfoundation.org/meetings/cip/2022/06/cip.2022-06-09-12.00.log.html

* Action items
1. Resolve/filter irrelevant failures of KernelCI for 4.4-cip - patersonc & alicefm
2. Check cip devices on kernelci old pull request - patersonc
3. Update https://wiki.linuxfoundation.org/civilinfrastructureplatform/ciptesting/cipreferencehardware - iwamatsu-san
* Kernel maintenance updates
* Kernel testing
* AOB

Jan


New CVE entries this week

Masami Ichikawa
 

Hi !

It's this week's CVE report.

This week reported 6 new CVEs and 4 updated CVEs.

* New CVEs

CVE-2022-2078: Add several sanity checks for nft_set_desc_concat_parse().

CVSS v3 score is not assigned.

A buffer overflow bug was found in nft_set_desc_concat_parse(). This
bug allows an attacker to system crash or possibly execute run code.
This issue was introduced by commit f3a2181 ("netfilter: nf_tables:
Support for sets with multiple ranged fields") in 5.6-rc1. This commit
isn't backported to earlier than 5.6 kernels.

Fixed status
mainline: [fecf31ee395b0295f2d7260aa29946b7605f7c85]
stable/5.10: [c0aff1faf66b6b7a19103f83e6a5d0fdc64b9048]
stable/5.15: [89ef50fe03a55feccf5681c237673a2f98161161]
stable/5.18: [c9a46a3d549286861259c19af4747e12cfaeece9]

CVE-2022-21166: Device Register Partial Write (DRPW)
CVE-2022-21125: Shared Buffers Data Sampling (SBDS)
CVE-2022-21123: Shared Buffers Data Read (SBDR)

CVSS v3 score is not assigned.

CVE-2022-21166, CVE-2022-21125, and CVE-2022-21123 are related to
"Processor MMIO Stale Data Vulnerabilities are a class of
memory-mapped I/O (MMIO) vulnerabilities".
Please refer to the document
https://git.kernel.org/pub/scm/linux/kernel/git/torvalds/linux.git/tree/Documentation/admin-guide/hw-vuln/processor_mmio_stale_data.rst
for more details.

These vulnerabilities were fixd in a merge commit
https://github.com/torvalds/linux/commit/8e8afafb0b5571b7cb10b529dc60cadb7241bed4
.
This merge commit includes 11 commits. All of them were applied to all
stable kernels.

Fixed status
mainline: [4419470191386456e0b8ed4eb06a70b0021798a6,
51802186158c74a0304f51ab963e7c2b3a2b046f,
f52ea6c26953fed339aa4eae717ee5c2133c7ff2,
8cb861e9e3c9a55099ad3d08e1a3b653d29c33ca,
e5925fb867290ee924fcf2fe3ca887b792714366,
99a83db5a605137424e1efe29dc0573d6a5b6316,
8d50cdf8b8341770bc6367bce40c0c1bb0e1d5b3,
22cac9c677c95f3ac5c9244f8ca0afdc7c8afb19,
a992b8a4682f119ae035a01b40d4d0665c4a2875,
027bbb884be006b05d9c577d6401686053aa789e,
1dc6ff02c8bf77d71b9b5d11cbc9df77cfb28626]
stable/4.14: [62cf367c5fd1af75e005495ddcacde0f5eab85f0,
c00f2194c05c30a5f2f6a38d1555a8c6a9694cff,
ba0a1237c5ef0479d8799f9435ba04c4e022bbd8,
d6087dda37d3ffa3c8efe6385757d73d9ed173c5,
87e9881d5ad3d06cb8278062ecdafb4a5b5f423b,
e0fccc13ebe3ed1205f69d119d49789ef039c1fd,
ae620928044d93e1ab9b785e931854ee033e52c7,
ed4fa7697ca4039eed5142c983c5905e46039c36,
532c3a51316b6b1fdc6cb01926e2d139ef7e25da,
ac87ab4460f35b5064b2b9db1be146def2941fee,
66b7fb8b6de97d02255611eb83a0a64d88f01710]
stable/4.19: [2bb1c263b6797e2701a5f4ffe503a8ce15c0167e,
9277b11cafd0472db9e7d634de52d7c5d8d25462,
d03de576a604899741a0ebadcfe2a4a19ee53ba3,
9f2ce43ebc33713ba02a89a66bd5f93c2f3a82cf,
54974c8714283feb5bf64df3bfe0f44267db5a3c,
8b42145e8c9903d4805651e08f4fca628e166642,
f2983fbba1cccac611d4966277f0336374fad0be,
3ecb6dbad25b448ed8240f0ec2c7a8ff5155b7ea,
0e94464009ee37217a7e450c96ea1f8d42d3a6b5,
e0d1437042f0b491bf2cb7880628b0bd7783f80d,
0255c936bfaa1887f7043b995f1c9e1049bb25f1]
stable/4.9: [63c10e92b86a6cddd5294cda9f80eb7961cb1046,
19aa53c9eb2cf3a78ee44800e20bb34babe60f45,
91ab1073814aa5d44fb3d8e2423ffdc61a421cac,
a11f2f05f5c605d1f6573b0cdcd2a6f38667fda1,
5da4d16872d3d15dac54b5a6f83f54e28bc3a477,
6ecdbc9dc777a5b66a9ec293af88ab330dd644a2,
8acd4bf9427eaf18a801db3f2508a2d89914d51d,
48e40e2cccb37c1f9c345014ca55c41bb8baee66,
b7efb3a62fffa509e21d076aa2e75331c79fe36d,
da06c60d1dfef826512068d09aed3b6a70b5e5c9,
71078b82164e36c893dc0764866e3783b1988fb4]
stable/5.10: [f8a85334a57e7842320476ff27be3a5f151da364,
e66310bc96b74ed3df9993e5d835ef3084d62048,
f83d4e5be4a3955a6c8af61ecec0934d0ece40c0,
26f6f231f6a5a79ccc274967939b22602dec76e8,
56f0bca5e9c8456b7bb7089cbb6de866a9ba6da9,
3eb1180564fa0ecedc33b44029da7687c0a9fbf5,
001415e4e626403c9ff35f2498feb0021d0c8328,
cf1c01a5e4c3e269b9211ae2ef0a57f8c9474bfc,
6df693dca31218f76c63b6fd4aa7b7db3bd6e049,
bde15fdcce44956278b4f50680b7363ca126ffb9,
aa238a92cc94a15812c0de4adade86ba8f22707a]
stable/5.15: [1fcc3d646f0b719a2571aa68e4983c7a96fdc806,
d822b10f97f6bf83fcde3ed56caa58cde562eedd,
8b9521e711799f6260765209d5562fe6e6fbf3fc,
d74f4eb1ddf076a55ff0682a89e66af5c1974321,
407d97b99f276c7a761b905891a9d7a0fb727730,
2044838ab2283c23869ffa7b062e5f388136e432,
531eb5fe3171f11cece79c7aac28bb5a085fb3fa,
30120b433c1f53cd0a081e6e86fe016a60a423fc,
ebd0f558b48082c265fd594ffb205ae5350bfe79,
59d665a709b0446957261e8875ac9f7eb1bb1e96,
147ae04a7c52e8cec0b81b1057c13fc29dab143a]
stable/5.18: [2a00e432ef05d813956e811718e828076b3f3027,
d88769c6dd78a77c049a55d4d39542648740321f,
647afa778f7a98be3c690e579211d26d051fabfc,
bc4d37b2338a32a6668d94803feebc9cbc85572e,
e3718d0753ff30f93e3cb9dccc26b0452f90c6b1,
8547d4ae6a95543b69d523f3706dbf887496e9f3,
1baf738f30ee91be35003b0d106190ba8bfa8f1c,
bafc2b2727b4ebd219b112e87143cf0cf136d3fa,
dce28a791e9632f96ba018f2ef708e012edb4133,
0b4bd3f44c674ba215f8f7918e4145d045bf5396,
4064fc1ce85e4066a5aa97186766b71fe5f303d1]
stable/5.4: [91f8147c8371cb228bef738641abcd183d7adaf1,
814ccb6730358c2e30e00cb81fb84f4d480ff34f,
ae649e0cbf76c665cf3a92dc16ddef27789b0447,
0800f1b45bf6d85e5a168db9ae91fb816f0a8c34,
7f898baa2044094accfbe49c846f50fecc58e043,
8d25482fc96aa2cb24a221295fdd498f40565415,
020ce7495cfccec17693bf58b42282707dece24d,
bc64f38b5a3839f14896cb9e2de7614d47151fc3,
d961592635932bd1ea32a534412a41fb794e2212,
d49c22094e6f698a86dfdfd8f22b2a220e797bd4,
4cc40b1022bbfe6da2dda489006b7ab6548bcd61]

CVE-2022-33981: floppy: disable FDRAWCMD by default

CVSS v3 score is not assigned.

It is duplicated of CVE-2022-1836.
A use-after-free bug was found in drivers/block/floppy.c which will
result denial of service.

Fixed status
mainline: [233087ca063686964a53c829d547c7571e3f67bf]
stable/4.14: [b7fa84ae1171a3c5ea5d710899080a6e63cfe084]
stable/4.19: [0e535976774504af36fab1dfb54f3d4d6cc577a9]
stable/4.9: [0dd02ff72c6daf4e7800fb5dd1109fbacdde97dc]
stable/5.10: [54c028cfc49624bfc27a571b94edecc79bbaaab4]
stable/5.15: [e52da8e4632f9c8fe78bf1c5881ce6871c7e08f3]
stable/5.4: [7dea5913000c6a2974a00d9af8e7ffb54e47eac1]

CVE-2022-2153: KVM: NULL pointer dereference in kvm_irq_delivery_to_apic_fast()

CVSS v3 score is not assigned.

This vulnerability was introduced by commit 1e08ec4 ("KVM: optimize
apic interrupt delivery") that was merged in 3.7-rc1.
There is a NULL pointer dereference bug in
kvm_irq_delivery_to_apic_fast() that triggers local DoS.

Commit 7ec37d1 (KVM: x86: Check lapic_in_kernel() before attempting to
set a SynIC irq) and commit 00b5f37("KVM: x86: Avoid theoretical NULL
pointer dereference in kvm_irq_delivery_to_apic_fast()") are failed to
apply to 4.14, 4.19, 4.9, 5.4, and 5.10.

Fixed status
mainline: [7ec37d1cbe17d8189d9562178d8b29167fe1c31a,
00b5f37189d24ac3ed46cb7f11742094778c46ce,
b1e34d325397a33d97d845e312d7cf2a8b646b44]
stable/4.19: [2f4835b5188f3b73b2b048a761ae2553e845b027]
stable/4.9: [95d51d058680766130098287f680474bc55f1679]
stable/5.10: [09c771c45c1243e295470225aaee726693fdc242]
stable/5.15: [569a229142e95610adc1041ae9ca1f417c4c6a3e,
0e5dbc0540baa89faf4c04ccc7e9c4fe6b1d7bf4,
ba6e8c2df52047a32953588b49d9addbd843a098]

* Updated CVEs

CVE-2022-1353: af_key: add __GFP_ZERO flag for compose_sadb_supported
in function pfkey_register

stable/4.9 was fixed this week.

Fixed status
mainline: [9a564bccb78a76740ea9d75a259942df8143d02c]
stable/4.14: [fcdaaeb7eb5d52941ceb2fdcec0e2170c9bf3031]
stable/4.19: [693fe8af9a2625139de07bd1ae212a7d89c37795]
stable/4.9: [7b0e01a9b7f2aaeb6fa73b35864b1d7dc6e795c4]
stable/5.10: [8d3f4ad43054619379ccc697cfcbdb2c266800d8]
stable/5.15: [d06ee4572fd916fbb34d16dc81eb37d1dff83446]
stable/5.4: [ef388db2fe351230ff7194b37d507784bef659ec]

CVE-2022-1976: io_uring: reinstate the inflight tracking

stable/5.18 was fixed this week.

Fixed status
mainline: [9cae36a094e7e9d6e5fe8b6dcd4642138b3eb0c7]
stable/5.18: [bba36a27c38650eefc79d18c33a0acd0dcbeabb8]

CVE-2022-1508: io_uring: reexpand under-reexpanded iters

Added fixed commit to stable/5.10.

Fixed status
mainline: [89c2b3b74918200e46699338d7bcc19b1ea12110,
2112ff5ce0c1128fe7b4d19cfe7f2b8ce5b595fa]
stable/5.10: [8adb751d294ed3b668f1c7e41bd7ebe49002a744]

CVE-2022-1184: use-after-free and memory errors in ext4 when mounting
and operating on a corrupted image

The mainline and stable kernels were fixed this week.

Fixed status
mainline: [46c116b920ebec58031f0a78c5ea9599b0d2a371,
3ba733f879c2a88910744647e41edeefbc0d92b2]
stable/4.14: [d27d3caddbeff10871982d5e25e6557be0fdc29a,
24b8206fec1db21d7e82f21f0b2ff5e5672cf5b3]
stable/4.19: [78398c2b2cc14f9a9c8592cf6d334c5a479ed611,
b3ad9ff6f06c1dc6abf7437691c88ca3d6da3ac0]
stable/4.9: [93bbf0498ba20eadcd7132bd3cfdaff54eb72751]
stable/5.10: [da2f05919238c7bdc6e28c79539f55c8355408bb,
ff4cafa51762da3824881a9000ca421d4b78b138]
stable/5.15: [ca17db384762be0ec38373a12460081d22a8b42d,
3a3ce941645407cd0b0b7f01ad9e2ea3770f46cc]
stable/5.18: [298659c0e7074f774a794fc293df4014617b87be,
6084240bfc44bf265ab6ae7d96980469b05be0f1]
stable/5.4: [17034d45ec443fb0e3c0e7297f9cd10f70446064,
e157c8f87e8fac112d6c955e69a60cdb9bc80a60]

Currently tracking CVEs

CVE-2021-31615: Unencrypted Bluetooth Low Energy baseband links in
Bluetooth Core Specifications 4.0 through 5.2

There is no fix information.

CVE-2020-26556: kernel: malleable commitment Bluetooth Mesh Provisioning

No fix information.

CVE-2020-26557: kernel: predictable Authvalue in Bluetooth Mesh
Provisioning Leads to MITM

No fix information.

CVE-2020-26559: kernel: Authvalue leak in Bluetooth Mesh Provisioning

No fix information.

CVE-2020-26560: kernel: impersonation attack in Bluetooth Mesh Provisioning

No fix information.

Regards,
--
Masami Ichikawa
Cybertrust Japan Co., Ltd.

Email :masami.ichikawa@...
:masami.ichikawa@...


Re: Reported 4.4.y-st issue from Flamefire #cip

theflamefire89@...
 


Upstream said this code is correct and affected drivers should be
fixed, instead,

First this is a practical issue: There are proprietary drivers which likely will never get fixed.
And second I do not agree that this code is correct as it doesn't make sense to me:

- From snd_soc_put_volsw_sx:

if (mc->platform_max && val > mc->platform_max)
	return -EINVAL;
if (val > max - min)
	return -EINVAL;
And from snd_soc_info_volsw called by snd_soc_info_volsw_sx
mc->platform_max = mc->max;
So if platform_max gets always set to max why would you compare `val` directly against platform_max but subtract min from max?

Or did upstream say that using a negative "min" is invalid? Example where this is used: https://github.com/sonyxperiadev/kernel/blob/5f3e8612a373f035fae72471dcbc37ec2110adde/sound/soc/codecs/wcd9335.c#L2255-L2256

I also find the following puzzling (in snd_soc_limit_volume):
if (max <= mc->max) {
	mc->platform_max = max;

i.e. a check against "max" setting "platform_max"?

Anyway I appreciate you taking care of this and hope the above input helps in guiding a decision.

Best Regards,

Alex


Re: [4.4.y] cred_getsecid hook

Pavel Machek
 

Hi!

While working on backporting the fix for CVE-2021-39686 in the
Android-"version" of the 4.4.y kernel I noticed the missing
cred_getsecid hook introduced in e.g. 4.19.y by
3ec30113264a7bcd389f51d1738e42da0f41bb5a (
https://git.kernel.org/pub/scm/linux/kernel/git/cip/linux-cip.git/commit/?h=linux-4.19.y&id=3ec30113264a7bcd389f51d1738e42da0f41bb5a
)
...
Anyway: Are there any plans to synchronize the hooks in 4.4 with those in more recent kernels?
Let me see. 4.19 has that commit; it was merged during merge
window. 4.9 does not have that commit.

If CVE-2021-39686 is important to you, right way forward would be to
backport neccessary changes to 4.9, first. We would rather not have
changes in 4.4-st that are not present in 4.9.X.

I don't think we have any plans to work in this area.

commit 3ec30113264a7bcd389f51d1738e42da0f41bb5a
Author: Matthew Garrett <mjg59@...>
Date: Mon Jan 8 13:36:19 2018 -0800

security: Add a cred_getsecid hook

For IMA purposes, we want to be able to obtain the prepared secid in the
bprm structure before the credentials are committed. Add a cred_getsecid
hook that makes this possible.

Best regards,
Pavel
--
DENX Software Engineering GmbH, Managing Director: Wolfgang Denk
HRB 165235 Munich, Office: Kirchenstr.5, D-82194 Groebenzell, Germany


Re: Reported 4.4.y-st issue from Flamefire #cip

Pavel Machek
 

Hi!

Unfortunately, mainline seems to be different here. Looking at the
code, is min < 0 in your case?
yes "min" is negative. IIRC min and max are centered around zero. And as linked above a similar function has the adjustment and others independently came up with the same fix. I also verified that it fixes my issue.
Upstream said this code is correct and affected drivers should be
fixed, instead, so we don't plan to do anything here.

Best regards,
Pavel

--
DENX Software Engineering GmbH, Managing Director: Wolfgang Denk
HRB 165235 Munich, Office: Kirchenstr.5, D-82194 Groebenzell, Germany


Re: [isar-cip-core] cip-core-image-security.bb:libpm-google-authenticator debian package

Shreyas.Karmahe@...
 

Hi Jan Kiszka,

I have added libpm-google-authenticator debian package debian package to verify Local and Remote multi-factor authentication.
I will create new MR regarding configuration changes and recipe customization.

Thanks & Regards,
Shreyas

-----Original Message-----
From: Jan Kiszka <jan.kiszka@...>
Sent: Friday, June 17, 2022 8:33 PM
To: karmahe shreyas(TSIP) <Shreyas.Karmahe@...>; cip-dev@...
Cc: dinesh kumar(TSIP) <dinesh.kumar@...>; pyla venkata(TSIP TMIEC ODG Porting) <Venkata.Pyla@...>; hayashi kazuhiro(林 和宏 □SWC◯ACT) <kazuhiro3.hayashi@...>
Subject: Re: [isar-cip-core] cip-core-image-security.bb:libpm-google-authenticator debian package

On 17.06.22 16:44, Shreyas.Karmahe@... wrote:
From: Shreyas Karmahe <Shreyas.Karmahe@...>

Added libpm-google-authenticator for MFA authetication for remote and
local session

Signed-off-by: Shreyas Karmahe <Shreyas.Karmahe@...>
---
recipes-core/images/cip-core-image-security.bb | 1 +
1 file changed, 1 insertion(+)

diff --git a/recipes-core/images/cip-core-image-security.bb
b/recipes-core/images/cip-core-image-security.bb
index 3ea544a..e56d279 100644
--- a/recipes-core/images/cip-core-image-security.bb
+++ b/recipes-core/images/cip-core-image-security.bb
@@ -32,6 +32,7 @@ IMAGE_PREINSTALL += " \
audispd-plugins auditd \
uuid-runtime \
sudo \
+ libpam-google-authenticator \
"

OVERRIDES_append = ":${BASE_DISTRO_CODENAME}"
Is that thing configuration-free? Or will the customization recipe need some tuning as well?

Jan

--
Siemens AG, Technology
Competence Center Embedded Linux


[isar-cip-core][PATCH] squashfs: Fix rebuild

Jan Kiszka
 

From: Jan Kiszka <jan.kiszka@...>

The wrong filename was used for deleting a preexisting image, and that
caused mksquashfs to refuse creating a new one. We can achieve this also
without an explicit rm, just by using -noappend.

Signed-off-by: Jan Kiszka <jan.kiszka@...>
---
classes/squashfs.bbclass | 4 +---
1 file changed, 1 insertion(+), 3 deletions(-)

diff --git a/classes/squashfs.bbclass b/classes/squashfs.bbclass
index 376ddfe..99436bc 100644
--- a/classes/squashfs.bbclass
+++ b/classes/squashfs.bbclass
@@ -29,9 +29,7 @@ python __anonymous() {

IMAGE_CMD_squashfs[depends] = "${PN}:do_transform_template"
IMAGE_CMD_squashfs() {
- rm -f '${DEPLOY_DIR_IMAGE}/${SQUASHFS_IMAGE_FILE}'
-
${SUDO_CHROOT} /bin/mksquashfs \
'${SQUASHFS_CONTENT}' '${IMAGE_FILE_CHROOT}' \
- ${SQUASHFS_CREATION_ARGS}
+ -noappend ${SQUASHFS_CREATION_ARGS}
}
--
2.35.3


Re: [isar-cip-core] cip-core-image-security.bb:libpm-google-authenticator debian package

Jan Kiszka
 

On 17.06.22 16:44, Shreyas.Karmahe@... wrote:
From: Shreyas Karmahe <Shreyas.Karmahe@...>

Added libpm-google-authenticator for MFA authetication for remote and local session

Signed-off-by: Shreyas Karmahe <Shreyas.Karmahe@...>
---
recipes-core/images/cip-core-image-security.bb | 1 +
1 file changed, 1 insertion(+)

diff --git a/recipes-core/images/cip-core-image-security.bb b/recipes-core/images/cip-core-image-security.bb
index 3ea544a..e56d279 100644
--- a/recipes-core/images/cip-core-image-security.bb
+++ b/recipes-core/images/cip-core-image-security.bb
@@ -32,6 +32,7 @@ IMAGE_PREINSTALL += " \
audispd-plugins auditd \
uuid-runtime \
sudo \
+ libpam-google-authenticator \
"

OVERRIDES_append = ":${BASE_DISTRO_CODENAME}"
Is that thing configuration-free? Or will the customization recipe need
some tuning as well?

Jan

--
Siemens AG, Technology
Competence Center Embedded Linux


Re: [isar-cip-core][PATCH] swupdate: Limit SRC_URI addition to the supported efibootguard case

Florian Bezdeka
 

On Fri, 2022-06-17 at 16:14 +0200, florian.bezdeka@... via
lists.cip-project.org wrote:
The following build warning was observed when SWUPDATE_BOOTLOADER was
set to something different from "efibootguard" in downstream layers:

WARNING:
/work/cip-core/recipes-core/swupdate-handler-roundrobin/swupdate-handler-roundrobin_0.1.bb:
Unable to get checksum for swupdate-handler-roundrobin SRC_URI entry
swupdate.handler.u-boot.ini: file could not be found

Signed-off-by: Florian Bezdeka <florian.bezdeka@...>
---
Please ignore this one. Seems I posted the wrong version of that
patch... v2 should follow soon.

981 - 1000 of 9574