Date   

Re: [isar-cip-core][PATCH] security-testing.yml: Add kas option for IEC layer testing

Jan Kiszka
 

On 05.07.22 13:14, Venkata.Pyla@... wrote:


-----Original Message-----
From: Jan Kiszka <jan.kiszka@...>
Sent: 05 July 2022 14:24
To: pyla venkata(TSIP TMIEC ODG Porting) <Venkata.Pyla@toshiba-
tsip.com>; cip-dev@...
Cc: dinesh kumar(TSIP) <dinesh.kumar@...>; hayashi
kazuhiro(林 和宏 □SWC◯ACT) <kazuhiro3.hayashi@...>
Subject: Re: [isar-cip-core][PATCH] security-testing.yml: Add kas option for IEC
layer testing

On 04.07.22 19:21, venkata.pyla@... wrote:
From: venkata pyla <venkata.pyla@...>

This kas option file adds additonal packages required only while
testing using cip-security-tests[1].

Also it provides additional rootfs size required for testing.

[1] https://gitlab.com/cip-project/cip-testing/cip-security-tests

Signed-off-by: venkata pyla <venkata.pyla@...>
---
kas/opt/security-testing.yml | 20 ++++++++++++++++++++
1 file changed, 20 insertions(+)
create mode 100644 kas/opt/security-testing.yml

diff --git a/kas/opt/security-testing.yml
b/kas/opt/security-testing.yml new file mode 100644 index
0000000..19215f1
--- /dev/null
+++ b/kas/opt/security-testing.yml
@@ -0,0 +1,20 @@
+#
+# CIP Core, generic profile
+#
+# Copyright (c) Toshiba Corporation, 2022 # # Authors:
+# Venkata Pyla <venkata.pyla@...> # #
+SPDX-License-Identifier: MIT #
+header:
+ version: 10
+ includes:
+ - kas/opt/security.yml
+
+local_conf_header:
+ security_testing: |
+ IMAGE_PREINSTALL_append = " sshpass"
+ ROOTFS_EXTRA = "8192"
+
There is already kas/opt/test.yml. Can't we piggy-back on that one?
Would also already come with kconfig support.
Yes I thin so, we can also add security testing requirements in to test.yml,
but does it not create any side effect to the original test image?
security testing requirements adds additional package `sshpass` and increases
the rootfs size.

Or, can we select the local_conf_header fragment ('testing' or 'security_testing')
from the kconfig based on image is selected?
Adding Nobuhiro, he once wrote that. But I strongly suspect the impact
is not relevant, in both directions. If there should be, we can look
into image-specific additions, but via the same option file.

My goal here is to keep the number of kas option files low whenever
possible. From a user perspective, it does not matter if a regular or a
security image is augmented with testing features.

Jan

--
Siemens AG, Technology
Competence Center Embedded Linux


Re: qemu-arm not working with 5.10.126-cip11

Jan Kiszka
 

On 05.07.22 16:03, Jan Kiszka wrote:
Hi all,

it /seems/ (still double-checking) that there is a regression in latest
5.10-cip regarding the qemu-arm target as built and run via
isar-cip-core. Not getting any outputs from the kernel. Just rolled back
from next to master in isar-cip-core, and it works again. Any ideas or
similar observations?
Not a kernel issue, regression of cip-kernel-config, namely [1]:
CONFIG_ARCH_VIRT is lost. Now trying to understand why that happened.

Jan

[1]
https://gitlab.com/cip-project/cip-kernel/cip-kernel-config/-/commit/8dc2e5a1772c1d7aab78028a8a1db1ae6e6ed9d0

--
Siemens AG, Technology
Competence Center Embedded Linux


qemu-arm not working with 5.10.126-cip11

Jan Kiszka
 

Hi all,

it /seems/ (still double-checking) that there is a regression in latest
5.10-cip regarding the qemu-arm target as built and run via
isar-cip-core. Not getting any outputs from the kernel. Just rolled back
from next to master in isar-cip-core, and it works again. Any ideas or
similar observations?

Jan

--
Siemens AG, Technology
Competence Center Embedded Linux


Re: [isar-cip-core][PATCH] security-testing.yml: Add kas option for IEC layer testing

Venkata Pyla
 

-----Original Message-----
From: Jan Kiszka <jan.kiszka@...>
Sent: 05 July 2022 14:24
To: pyla venkata(TSIP TMIEC ODG Porting) <Venkata.Pyla@toshiba-
tsip.com>; cip-dev@...
Cc: dinesh kumar(TSIP) <dinesh.kumar@...>; hayashi
kazuhiro(林 和宏 □SWC◯ACT) <kazuhiro3.hayashi@...>
Subject: Re: [isar-cip-core][PATCH] security-testing.yml: Add kas option for IEC
layer testing

On 04.07.22 19:21, venkata.pyla@... wrote:
From: venkata pyla <venkata.pyla@...>

This kas option file adds additonal packages required only while
testing using cip-security-tests[1].

Also it provides additional rootfs size required for testing.

[1] https://gitlab.com/cip-project/cip-testing/cip-security-tests

Signed-off-by: venkata pyla <venkata.pyla@...>
---
kas/opt/security-testing.yml | 20 ++++++++++++++++++++
1 file changed, 20 insertions(+)
create mode 100644 kas/opt/security-testing.yml

diff --git a/kas/opt/security-testing.yml
b/kas/opt/security-testing.yml new file mode 100644 index
0000000..19215f1
--- /dev/null
+++ b/kas/opt/security-testing.yml
@@ -0,0 +1,20 @@
+#
+# CIP Core, generic profile
+#
+# Copyright (c) Toshiba Corporation, 2022 # # Authors:
+# Venkata Pyla <venkata.pyla@...> # #
+SPDX-License-Identifier: MIT #
+header:
+ version: 10
+ includes:
+ - kas/opt/security.yml
+
+local_conf_header:
+ security_testing: |
+ IMAGE_PREINSTALL_append = " sshpass"
+ ROOTFS_EXTRA = "8192"
+
There is already kas/opt/test.yml. Can't we piggy-back on that one?
Would also already come with kconfig support.
Yes I thin so, we can also add security testing requirements in to test.yml,
but does it not create any side effect to the original test image?
security testing requirements adds additional package `sshpass` and increases
the rootfs size.

Or, can we select the local_conf_header fragment ('testing' or 'security_testing')
from the kconfig based on image is selected?


Jan

--
Siemens AG, Technology
Competence Center Embedded Linux


Re: [isar-cip-core] cip-core-image-security.bb: Add aide-common package

Jan Kiszka
 

On 04.07.22 18:43, Shreyas.Karmahe@... wrote:
From: Shreyas Karmahe <Shreyas.Karmahe@...>

aide-common pckage added to resolve missing aide.conf file to run
^^^^^^
Typo. I've fixed it while merging.

Thanks,
Jan

IEC Layer test.

Signed-off-by: Shreyas Karmahe <Shreyas.Karmahe@...>
---
recipes-core/images/cip-core-image-security.bb | 1 +
1 file changed, 1 insertion(+)

diff --git a/recipes-core/images/cip-core-image-security.bb b/recipes-core/images/cip-core-image-security.bb
index 3ea544a..6060978 100644
--- a/recipes-core/images/cip-core-image-security.bb
+++ b/recipes-core/images/cip-core-image-security.bb
@@ -32,6 +32,7 @@ IMAGE_PREINSTALL += " \
audispd-plugins auditd \
uuid-runtime \
sudo \
+ aide-common \
"

OVERRIDES_append = ":${BASE_DISTRO_CODENAME}"

--
Siemens AG, Technology
Competence Center Embedded Linux


Re: [isar-cip-core] postinst:Added lines to verify Local and Remote Multi-factor Authentication

Jan Kiszka
 

On 04.07.22 18:51, Shreyas.Karmahe@... wrote:
Hi Jan,

I have resend the patch again by removing the commented line from postinst file from security-customizations.
The commenting line is dead code only and used for debugging purpose.
Kindly review the following resend patch

v2-0001-security-customizations-postinst-Add-configuratio.patch
Please read both of my replies and address the other one as well.

Thanks,
Jan


Kind Regards,
Shreyas
-----Original Message-----
From: Jan Kiszka <jan.kiszka@...>
Sent: Friday, July 1, 2022 5:04 PM
To: karmahe shreyas(TSIP) <Shreyas.Karmahe@...>; yes@...; cip-dev@...
Cc: dinesh kumar(TSIP) <dinesh.kumar@...>; pyla venkata(TSIP TMIEC ODG Porting) <Venkata.Pyla@...>; hayashi kazuhiro(林 和宏 □SWC◯ACT) <kazuhiro3.hayashi@...>
Subject: Re: [isar-cip-core] postinst:Added lines to verify Local and Remote Multi-factor Authentication

On 01.07.22 13:32, Jan Kiszka wrote:
On 30.06.22 13:26, Shreyas.Karmahe@... wrote:
From: Shreyas Karmahe <Shreyas.Karmahe@...>

To enable and configure PAM for Remote and Local MFA Session
Verification

Signed-off-by: Shreyas Karmahe <Shreyas.Karmahe@...>
---
.../security-customizations/files/postinst | 15 ++++++++++++++-
1 file changed, 14 insertions(+), 1 deletion(-)

diff --git a/recipes-core/security-customizations/files/postinst
b/recipes-core/security-customizations/files/postinst
index bb7d15b..843ce3c 100644
--- a/recipes-core/security-customizations/files/postinst
+++ b/recipes-core/security-customizations/files/postinst
@@ -15,7 +15,8 @@ echo "127.0.0.1 $HOSTNAME" >> /etc/hosts
PAM_PWD_FILE="/etc/pam.d/common-password"
pam_cracklib_config="password requisite pam_cracklib.so retry=3 minlen=8 maxrepeat=3 ucredit=-1 lcredit=-1 dcredit=-1 ocredit=-1 difok=3 gecoscheck=1 reject_username enforce_for_root"
if grep -c "pam_cracklib.so" "${PAM_PWD_FILE}";then
- sed -i '/pam_cracklib.so/ s/^#*/#/' "${PAM_PWD_FILE}"
+
+sed -i '/pam_cracklib.so/ s/^#*/#/' "${PAM_PWD_FILE}"
And an accidental change here?

fi
sed -i "0,/^password.*/s/^password.*/${pam_cracklib_config}\n&/" "${PAM_PWD_FILE}"

@@ -49,3 +50,15 @@ sed -i 's/admin_space_left_action =
.*/admin_space_left_action = SYSLOG/' $AUDIT

# CR2.10: Response to audit processing failures sed -i
's/disk_error_action = .*/disk_error_action = SYSLOG/'
$AUDIT_CONF_FILE
+
+# CR2.11: Enable Mutli Factor Authentication for Local and Remote
+Session SSHD_AUTH_CONFIG="/etc/pam.d/common-auth"
+google_authenticator="auth required pam_google_authenticator.so nullok"
+if grep -c "pam_google_authenticator.so" "${SSHD_AUTH_CONFIG}";then
+ sed -i '/pam_google_authenticator.so/ s/^#*/#/' "${SSHD_AUTH_CONFIG}"
+fi
+#sed -i "0,/^auth.*/s/^auth.*/${google_authenticator}\n&/" "${SSHD_AUTH_CONFIG}"
Dead code? Or forgotten to activate?

+echo "auth required pam_google_authenticator.so nullok" | tee -a "${SSHD_AUTH_CONFIG}"
+# Enable PAM configuration for Remote Session sed -i
+'s/ChallengeResponseAuthentication no/ChallengeResponseAuthentication yes/g' "${SSHD_CONFIG}"
+echo "AuthenticationMethods keyboard-interactive" | tee -a "${SSHD_CONFIG}"
Jan

--
Siemens AG, Technology
Competence Center Embedded Linux

--
Siemens AG, Technology
Competence Center Embedded Linux


[PATCH isar-cip-core] linux-cip: Update to 4.19.249-cip76 and 5.10.126-cip11

Jan Kiszka
 

From: Jan Kiszka <jan.kiszka@...>

Signed-off-by: Jan Kiszka <jan.kiszka@...>
---
...{linux-cip_4.19.246-cip75.bb => linux-cip_4.19.249-cip76.bb} | 2 +-
.../{linux-cip_5.10.121-cip9.bb => linux-cip_5.10.126-cip11.bb} | 2 +-
2 files changed, 2 insertions(+), 2 deletions(-)
rename recipes-kernel/linux/{linux-cip_4.19.246-cip75.bb => linux-cip_4.19.249-cip76.bb} (72%)
rename recipes-kernel/linux/{linux-cip_5.10.121-cip9.bb => linux-cip_5.10.126-cip11.bb} (72%)

diff --git a/recipes-kernel/linux/linux-cip_4.19.246-cip75.bb b/recipes-kernel/linux/linux-cip_4.19.249-cip76.bb
similarity index 72%
rename from recipes-kernel/linux/linux-cip_4.19.246-cip75.bb
rename to recipes-kernel/linux/linux-cip_4.19.249-cip76.bb
index a4ae23e..e061644 100644
--- a/recipes-kernel/linux/linux-cip_4.19.246-cip75.bb
+++ b/recipes-kernel/linux/linux-cip_4.19.249-cip76.bb
@@ -13,4 +13,4 @@ require linux-cip-common.inc

KERNEL_DEFCONFIG_VERSION ?= "4.19.y-cip"

-SRC_URI[sha256sum] = "bf7c1c6a852ecc3daf6a8de302cc9e456aa05f8a72a34ba1941e43ace10e47c7"
+SRC_URI[sha256sum] = "2dd59ffb3557580f9fae93952206880f1248ad3bd239983a71c0f7113f31880e"
diff --git a/recipes-kernel/linux/linux-cip_5.10.121-cip9.bb b/recipes-kernel/linux/linux-cip_5.10.126-cip11.bb
similarity index 72%
rename from recipes-kernel/linux/linux-cip_5.10.121-cip9.bb
rename to recipes-kernel/linux/linux-cip_5.10.126-cip11.bb
index 0b08d62..ac4f620 100644
--- a/recipes-kernel/linux/linux-cip_5.10.121-cip9.bb
+++ b/recipes-kernel/linux/linux-cip_5.10.126-cip11.bb
@@ -13,4 +13,4 @@ require linux-cip-common.inc

KERNEL_DEFCONFIG_VERSION ?= "5.10.y-cip"

-SRC_URI[sha256sum] = "0be35d737212ae68cf8dea7c84bfac61f2b98aeec3df6f308692fbdfc80db743"
+SRC_URI[sha256sum] = "2b0742b538bd993538a73905100bcbba3f48b4259773a119a7c0fdb2cff5a0fb"
--
2.35.3


Re: [isar-cip-core][PATCH] security-testing.yml: Add kas option for IEC layer testing

Jan Kiszka
 

On 04.07.22 19:21, venkata.pyla@... wrote:
From: venkata pyla <venkata.pyla@...>

This kas option file adds additonal packages required only while testing
using cip-security-tests[1].

Also it provides additional rootfs size required for testing.

[1] https://gitlab.com/cip-project/cip-testing/cip-security-tests

Signed-off-by: venkata pyla <venkata.pyla@...>
---
kas/opt/security-testing.yml | 20 ++++++++++++++++++++
1 file changed, 20 insertions(+)
create mode 100644 kas/opt/security-testing.yml

diff --git a/kas/opt/security-testing.yml b/kas/opt/security-testing.yml
new file mode 100644
index 0000000..19215f1
--- /dev/null
+++ b/kas/opt/security-testing.yml
@@ -0,0 +1,20 @@
+#
+# CIP Core, generic profile
+#
+# Copyright (c) Toshiba Corporation, 2022
+#
+# Authors:
+# Venkata Pyla <venkata.pyla@...>
+#
+# SPDX-License-Identifier: MIT
+#
+header:
+ version: 10
+ includes:
+ - kas/opt/security.yml
+
+local_conf_header:
+ security_testing: |
+ IMAGE_PREINSTALL_append = " sshpass"
+ ROOTFS_EXTRA = "8192"
+
There is already kas/opt/test.yml. Can't we piggy-back on that one?
Would also already come with kconfig support.

Jan

--
Siemens AG, Technology
Competence Center Embedded Linux


cip-gitlab/ci/iwamatsu/linux-4.4.y-cip-rc ltp-ipc: 9 runs, 1 regressions (v4.4.302-1083-g94e3113365c2) #kernelci

kernelci.org bot <bot@...>
 

cip-gitlab/ci/iwamatsu/linux-4.4.y-cip-rc ltp-ipc: 9 runs, 1 regressions (v4.4.302-1083-g94e3113365c2)

Regressions Summary
-------------------

platform | arch | lab | compiler | defconfig | regressions
-----------------+------+---------+----------+--------------------+------------
beaglebone-black | arm | lab-cip | gcc-10 | multi_v7_defconfig | 1

Details: https://kernelci.org/test/job/cip-gitlab/branch/ci%2Fiwamatsu%2Flinux-4.4.y-cip-rc/kernel/v4.4.302-1083-g94e3113365c2/plan/ltp-ipc/

Test: ltp-ipc
Tree: cip-gitlab
Branch: ci/iwamatsu/linux-4.4.y-cip-rc
Describe: v4.4.302-1083-g94e3113365c2
URL: https://gitlab.com/cip-project/cip-kernel/linux-cip.git
SHA: 94e3113365c2fd3bb6050308d809a5d12b4f042a

Test suite revisions:
ltp-tests
URL: https://github.com/linux-test-project/ltp.git
SHA: e98f9465925434349d0aa6eb71e81b5464e76df4


Test Regressions
----------------


platform | arch | lab | compiler | defconfig | regressions
-----------------+------+---------+----------+--------------------+------------
beaglebone-black | arm | lab-cip | gcc-10 | multi_v7_defconfig | 1

Details: https://kernelci.org/test/plan/id/62c3b74cf2280bf969a39bde

Results: 0 PASS, 1 FAIL, 0 SKIP
Full config: multi_v7_defconfig
Compiler: gcc-10 (arm-linux-gnueabihf-gcc (Debian 10.2.1-6) 10.2.1 20210110)
Plain log: https://storage.kernelci.org//cip-gitlab/ci-iwamatsu-linux-4.4.y-cip-rc/v4.4.302-1083-g94e3113365c2/arm/multi_v7_defconfig/gcc-10/lab-cip/ltp-ipc-beaglebone-black.txt
HTML log: https://storage.kernelci.org//cip-gitlab/ci-iwamatsu-linux-4.4.y-cip-rc/v4.4.302-1083-g94e3113365c2/arm/multi_v7_defconfig/gcc-10/lab-cip/ltp-ipc-beaglebone-black.html
Rootfs: http://storage.kernelci.org/images/rootfs/debian/bullseye-ltp/20220610.0/armhf/initrd.cpio.gz


* ltp-ipc.login: https://kernelci.org/test/case/id/62c3b74cf2280bf969a39bdf
new failure (last pass: v4.4.302-1082-g00b9de85d40e)


cip-gitlab/ci/iwamatsu/linux-4.19.y-cip-rc smc: 11 runs, 2 regressions (v4.19.249-cip76-54-gb41c396e258f) #kernelci

kernelci.org bot <bot@...>
 

cip-gitlab/ci/iwamatsu/linux-4.19.y-cip-rc smc: 11 runs, 2 regressions (v4.19.249-cip76-54-gb41c396e258f)

Regressions Summary
-------------------

platform | arch | lab | compiler | defconfig | regressions
----------------------+-------+-------------+----------+----------------------------+------------
qemu_arm64-virt-gicv3 | arm64 | lab-broonie | gcc-10 | defconfig | 1
qemu_arm64-virt-gicv3 | arm64 | lab-broonie | gcc-10 | defconfig+arm64-chromebook | 1

Details: https://kernelci.org/test/job/cip-gitlab/branch/ci%2Fiwamatsu%2Flinux-4.19.y-cip-rc/kernel/v4.19.249-cip76-54-gb41c396e258f/plan/smc/

Test: smc
Tree: cip-gitlab
Branch: ci/iwamatsu/linux-4.19.y-cip-rc
Describe: v4.19.249-cip76-54-gb41c396e258f
URL: https://gitlab.com/cip-project/cip-kernel/linux-cip.git
SHA: b41c396e258f2fee2f17d7d65e4e03a629ba380b


Test Regressions
----------------


platform | arch | lab | compiler | defconfig | regressions
----------------------+-------+-------------+----------+----------------------------+------------
qemu_arm64-virt-gicv3 | arm64 | lab-broonie | gcc-10 | defconfig | 1

Details: https://kernelci.org/test/plan/id/62c3b53e1469cab263a39bcd

Results: 0 PASS, 1 FAIL, 0 SKIP
Full config: defconfig
Compiler: gcc-10 (aarch64-linux-gnu-gcc (Debian 10.2.1-6) 10.2.1 20210110)
Plain log: https://storage.kernelci.org//cip-gitlab/ci-iwamatsu-linux-4.19.y-cip-rc/v4.19.249-cip76-54-gb41c396e258f/arm64/defconfig/gcc-10/lab-broonie/smc-qemu_arm64-virt-gicv3.txt
HTML log: https://storage.kernelci.org//cip-gitlab/ci-iwamatsu-linux-4.19.y-cip-rc/v4.19.249-cip76-54-gb41c396e258f/arm64/defconfig/gcc-10/lab-broonie/smc-qemu_arm64-virt-gicv3.html
Rootfs: http://storage.kernelci.org/images/rootfs/buildroot/buildroot-baseline/20220624.0/arm64/rootfs.cpio.gz


* smc.login: https://kernelci.org/test/case/id/62c3b53e1469cab263a39bce
failing since 28 days (last pass: v4.19.239-cip72-68-g407458469172, first fail: v4.19.245-cip74-32-g2d021d7a9e637)



platform | arch | lab | compiler | defconfig | regressions
----------------------+-------+-------------+----------+----------------------------+------------
qemu_arm64-virt-gicv3 | arm64 | lab-broonie | gcc-10 | defconfig+arm64-chromebook | 1

Details: https://kernelci.org/test/plan/id/62c3bb7cf5294c9690a39bcd

Results: 0 PASS, 1 FAIL, 0 SKIP
Full config: defconfig+arm64-chromebook
Compiler: gcc-10 (aarch64-linux-gnu-gcc (Debian 10.2.1-6) 10.2.1 20210110)
Plain log: https://storage.kernelci.org//cip-gitlab/ci-iwamatsu-linux-4.19.y-cip-rc/v4.19.249-cip76-54-gb41c396e258f/arm64/defconfig+arm64-chromebook/gcc-10/lab-broonie/smc-qemu_arm64-virt-gicv3.txt
HTML log: https://storage.kernelci.org//cip-gitlab/ci-iwamatsu-linux-4.19.y-cip-rc/v4.19.249-cip76-54-gb41c396e258f/arm64/defconfig+arm64-chromebook/gcc-10/lab-broonie/smc-qemu_arm64-virt-gicv3.html
Rootfs: http://storage.kernelci.org/images/rootfs/buildroot/buildroot-baseline/20220624.0/arm64/rootfs.cpio.gz


* smc.login: https://kernelci.org/test/case/id/62c3bb7cf5294c9690a39bce
failing since 28 days (last pass: v4.19.239-cip72-68-g407458469172, first fail: v4.19.245-cip74-32-g2d021d7a9e637)


cip-gitlab/ci/iwamatsu/linux-4.19.y-cip-rc kselftest-futex: 9 runs, 2 regressions (v4.19.249-cip76-54-gb41c396e258f) #kernelci

kernelci.org bot <bot@...>
 

cip-gitlab/ci/iwamatsu/linux-4.19.y-cip-rc kselftest-futex: 9 runs, 2 regressions (v4.19.249-cip76-54-gb41c396e258f)

Regressions Summary
-------------------

platform | arch | lab | compiler | defconfig | regressions
-----------------------------+-------+--------------+----------+-----------+------------
meson-gxl-s905x-libretech-cc | arm64 | lab-baylibre | gcc-10 | defconfig | 1
r8a774a1-hihope-rzg2m-ex | arm64 | lab-cip | gcc-10 | defconfig | 1

Details: https://kernelci.org/test/job/cip-gitlab/branch/ci%2Fiwamatsu%2Flinux-4.19.y-cip-rc/kernel/v4.19.249-cip76-54-gb41c396e258f/plan/kselftest-futex/

Test: kselftest-futex
Tree: cip-gitlab
Branch: ci/iwamatsu/linux-4.19.y-cip-rc
Describe: v4.19.249-cip76-54-gb41c396e258f
URL: https://gitlab.com/cip-project/cip-kernel/linux-cip.git
SHA: b41c396e258f2fee2f17d7d65e4e03a629ba380b


Test Regressions
----------------


platform | arch | lab | compiler | defconfig | regressions
-----------------------------+-------+--------------+----------+-----------+------------
meson-gxl-s905x-libretech-cc | arm64 | lab-baylibre | gcc-10 | defconfig | 1

Details: https://kernelci.org/test/plan/id/62c3b5561469cab263a39be2

Results: 0 PASS, 1 FAIL, 0 SKIP
Full config: defconfig
Compiler: gcc-10 (aarch64-linux-gnu-gcc (Debian 10.2.1-6) 10.2.1 20210110)
Plain log: https://storage.kernelci.org//cip-gitlab/ci-iwamatsu-linux-4.19.y-cip-rc/v4.19.249-cip76-54-gb41c396e258f/arm64/defconfig/gcc-10/lab-baylibre/kselftest-futex-meson-gxl-s905x-libretech-cc.txt
HTML log: https://storage.kernelci.org//cip-gitlab/ci-iwamatsu-linux-4.19.y-cip-rc/v4.19.249-cip76-54-gb41c396e258f/arm64/defconfig/gcc-10/lab-baylibre/kselftest-futex-meson-gxl-s905x-libretech-cc.html
Rootfs: http://storage.kernelci.org/images/rootfs/debian/bullseye-kselftest/20220624.0/arm64/initrd.cpio.gz


* kselftest-futex.login: https://kernelci.org/test/case/id/62c3b5561469cab263a39be3
new failure (last pass: v4.19.245-cip74-32-g2d021d7a9e637)



platform | arch | lab | compiler | defconfig | regressions
-----------------------------+-------+--------------+----------+-----------+------------
r8a774a1-hihope-rzg2m-ex | arm64 | lab-cip | gcc-10 | defconfig | 1

Details: https://kernelci.org/test/plan/id/62c3b6363c2feb78f4a39bd8

Results: 0 PASS, 1 FAIL, 0 SKIP
Full config: defconfig
Compiler: gcc-10 (aarch64-linux-gnu-gcc (Debian 10.2.1-6) 10.2.1 20210110)
Plain log: https://storage.kernelci.org//cip-gitlab/ci-iwamatsu-linux-4.19.y-cip-rc/v4.19.249-cip76-54-gb41c396e258f/arm64/defconfig/gcc-10/lab-cip/kselftest-futex-r8a774a1-hihope-rzg2m-ex.txt
HTML log: https://storage.kernelci.org//cip-gitlab/ci-iwamatsu-linux-4.19.y-cip-rc/v4.19.249-cip76-54-gb41c396e258f/arm64/defconfig/gcc-10/lab-cip/kselftest-futex-r8a774a1-hihope-rzg2m-ex.html
Rootfs: http://storage.kernelci.org/images/rootfs/debian/bullseye-kselftest/20220624.0/arm64/initrd.cpio.gz


* kselftest-futex.login: https://kernelci.org/test/case/id/62c3b6363c2feb78f4a39bd9
new failure (last pass: v4.19.245-cip74-32-g2d021d7a9e637)


cip-gitlab/ci/iwamatsu/linux-4.4.y-cip-rc baseline: 76 runs, 4 regressions (v4.4.302-1083-g94e3113365c2) #kernelci

kernelci.org bot <bot@...>
 

cip-gitlab/ci/iwamatsu/linux-4.4.y-cip-rc baseline: 76 runs, 4 regressions (v4.4.302-1083-g94e3113365c2)

Regressions Summary
-------------------

platform | arch | lab | compiler | defconfig | regressions
----------------------+-------+--------------+----------+-----------+------------
qemu_arm64-virt-gicv2 | arm64 | lab-baylibre | gcc-10 | defconfig | 1
qemu_arm64-virt-gicv2 | arm64 | lab-broonie | gcc-10 | defconfig | 1
qemu_arm64-virt-gicv3 | arm64 | lab-baylibre | gcc-10 | defconfig | 1
qemu_arm64-virt-gicv3 | arm64 | lab-broonie | gcc-10 | defconfig | 1

Details: https://kernelci.org/test/job/cip-gitlab/branch/ci%2Fiwamatsu%2Flinux-4.4.y-cip-rc/kernel/v4.4.302-1083-g94e3113365c2/plan/baseline/

Test: baseline
Tree: cip-gitlab
Branch: ci/iwamatsu/linux-4.4.y-cip-rc
Describe: v4.4.302-1083-g94e3113365c2
URL: https://gitlab.com/cip-project/cip-kernel/linux-cip.git
SHA: 94e3113365c2fd3bb6050308d809a5d12b4f042a


Test Regressions
----------------


platform | arch | lab | compiler | defconfig | regressions
----------------------+-------+--------------+----------+-----------+------------
qemu_arm64-virt-gicv2 | arm64 | lab-baylibre | gcc-10 | defconfig | 1

Details: https://kernelci.org/test/plan/id/62c3b7ad620443d4aca39bcf

Results: 0 PASS, 1 FAIL, 0 SKIP
Full config: defconfig
Compiler: gcc-10 (aarch64-linux-gnu-gcc (Debian 10.2.1-6) 10.2.1 20210110)
Plain log: https://storage.kernelci.org//cip-gitlab/ci-iwamatsu-linux-4.4.y-cip-rc/v4.4.302-1083-g94e3113365c2/arm64/defconfig/gcc-10/lab-baylibre/baseline-qemu_arm64-virt-gicv2.txt
HTML log: https://storage.kernelci.org//cip-gitlab/ci-iwamatsu-linux-4.4.y-cip-rc/v4.4.302-1083-g94e3113365c2/arm64/defconfig/gcc-10/lab-baylibre/baseline-qemu_arm64-virt-gicv2.html
Rootfs: http://storage.kernelci.org/images/rootfs/buildroot/buildroot-baseline/20220624.0/arm64/rootfs.cpio.gz


* baseline.login: https://kernelci.org/test/case/id/62c3b7ad620443d4aca39bd0
new failure (last pass: v4.4.302-1082-g00b9de85d40e)



platform | arch | lab | compiler | defconfig | regressions
----------------------+-------+--------------+----------+-----------+------------
qemu_arm64-virt-gicv2 | arm64 | lab-broonie | gcc-10 | defconfig | 1

Details: https://kernelci.org/test/plan/id/62c3b897be27da01f1a39bd0

Results: 0 PASS, 1 FAIL, 0 SKIP
Full config: defconfig
Compiler: gcc-10 (aarch64-linux-gnu-gcc (Debian 10.2.1-6) 10.2.1 20210110)
Plain log: https://storage.kernelci.org//cip-gitlab/ci-iwamatsu-linux-4.4.y-cip-rc/v4.4.302-1083-g94e3113365c2/arm64/defconfig/gcc-10/lab-broonie/baseline-qemu_arm64-virt-gicv2.txt
HTML log: https://storage.kernelci.org//cip-gitlab/ci-iwamatsu-linux-4.4.y-cip-rc/v4.4.302-1083-g94e3113365c2/arm64/defconfig/gcc-10/lab-broonie/baseline-qemu_arm64-virt-gicv2.html
Rootfs: http://storage.kernelci.org/images/rootfs/buildroot/buildroot-baseline/20220624.0/arm64/rootfs.cpio.gz


* baseline.login: https://kernelci.org/test/case/id/62c3b897be27da01f1a39bd1
new failure (last pass: v4.4.302-1082-g00b9de85d40e)



platform | arch | lab | compiler | defconfig | regressions
----------------------+-------+--------------+----------+-----------+------------
qemu_arm64-virt-gicv3 | arm64 | lab-baylibre | gcc-10 | defconfig | 1

Details: https://kernelci.org/test/plan/id/62c3b6fb2afccfb1e5a39bf6

Results: 0 PASS, 1 FAIL, 0 SKIP
Full config: defconfig
Compiler: gcc-10 (aarch64-linux-gnu-gcc (Debian 10.2.1-6) 10.2.1 20210110)
Plain log: https://storage.kernelci.org//cip-gitlab/ci-iwamatsu-linux-4.4.y-cip-rc/v4.4.302-1083-g94e3113365c2/arm64/defconfig/gcc-10/lab-baylibre/baseline-qemu_arm64-virt-gicv3.txt
HTML log: https://storage.kernelci.org//cip-gitlab/ci-iwamatsu-linux-4.4.y-cip-rc/v4.4.302-1083-g94e3113365c2/arm64/defconfig/gcc-10/lab-baylibre/baseline-qemu_arm64-virt-gicv3.html
Rootfs: http://storage.kernelci.org/images/rootfs/buildroot/buildroot-baseline/20220624.0/arm64/rootfs.cpio.gz


* baseline.login: https://kernelci.org/test/case/id/62c3b6fb2afccfb1e5a39bf7
new failure (last pass: v4.4.302-1082-g00b9de85d40e)



platform | arch | lab | compiler | defconfig | regressions
----------------------+-------+--------------+----------+-----------+------------
qemu_arm64-virt-gicv3 | arm64 | lab-broonie | gcc-10 | defconfig | 1

Details: https://kernelci.org/test/plan/id/62c3b847684eed3a6ea39bfc

Results: 0 PASS, 1 FAIL, 0 SKIP
Full config: defconfig
Compiler: gcc-10 (aarch64-linux-gnu-gcc (Debian 10.2.1-6) 10.2.1 20210110)
Plain log: https://storage.kernelci.org//cip-gitlab/ci-iwamatsu-linux-4.4.y-cip-rc/v4.4.302-1083-g94e3113365c2/arm64/defconfig/gcc-10/lab-broonie/baseline-qemu_arm64-virt-gicv3.txt
HTML log: https://storage.kernelci.org//cip-gitlab/ci-iwamatsu-linux-4.4.y-cip-rc/v4.4.302-1083-g94e3113365c2/arm64/defconfig/gcc-10/lab-broonie/baseline-qemu_arm64-virt-gicv3.html
Rootfs: http://storage.kernelci.org/images/rootfs/buildroot/buildroot-baseline/20220624.0/arm64/rootfs.cpio.gz


* baseline.login: https://kernelci.org/test/case/id/62c3b847684eed3a6ea39bfd
new failure (last pass: v4.4.302-1082-g00b9de85d40e)


cip-gitlab/ci/iwamatsu/linux-4.19.y-cip-rc baseline: 136 runs, 20 regressions (v4.19.249-cip76-54-gb41c396e258f) #kernelci

kernelci.org bot <bot@...>
 

cip-gitlab/ci/iwamatsu/linux-4.19.y-cip-rc baseline: 136 runs, 20 regressions (v4.19.249-cip76-54-gb41c396e258f)

Regressions Summary
-------------------

platform | arch | lab | compiler | defconfig | regressions
---------------------------+-------+---------------+----------+----------------------------+------------
da850-lcdk | arm | lab-baylibre | gcc-10 | davinci_all_defconfig | 2
jetson-tk1 | arm | lab-baylibre | gcc-10 | multi_v7_defconfig | 1
qemu_arm64-virt-gicv2 | arm64 | lab-baylibre | gcc-10 | defconfig | 1
qemu_arm64-virt-gicv2 | arm64 | lab-baylibre | gcc-10 | defconfig+arm64-chromebook | 1
qemu_arm64-virt-gicv2 | arm64 | lab-broonie | gcc-10 | defconfig | 1
qemu_arm64-virt-gicv2 | arm64 | lab-broonie | gcc-10 | defconfig+arm64-chromebook | 1
qemu_arm64-virt-gicv2-uefi | arm64 | lab-baylibre | gcc-10 | defconfig | 1
qemu_arm64-virt-gicv2-uefi | arm64 | lab-baylibre | gcc-10 | defconfig+arm64-chromebook | 1
qemu_arm64-virt-gicv2-uefi | arm64 | lab-broonie | gcc-10 | defconfig | 1
qemu_arm64-virt-gicv2-uefi | arm64 | lab-broonie | gcc-10 | defconfig+arm64-chromebook | 1
qemu_arm64-virt-gicv3 | arm64 | lab-baylibre | gcc-10 | defconfig | 1
qemu_arm64-virt-gicv3 | arm64 | lab-baylibre | gcc-10 | defconfig+arm64-chromebook | 1
qemu_arm64-virt-gicv3 | arm64 | lab-broonie | gcc-10 | defconfig | 1
qemu_arm64-virt-gicv3 | arm64 | lab-broonie | gcc-10 | defconfig+arm64-chromebook | 1
qemu_arm64-virt-gicv3-uefi | arm64 | lab-baylibre | gcc-10 | defconfig | 1
qemu_arm64-virt-gicv3-uefi | arm64 | lab-baylibre | gcc-10 | defconfig+arm64-chromebook | 1
qemu_arm64-virt-gicv3-uefi | arm64 | lab-broonie | gcc-10 | defconfig | 1
qemu_arm64-virt-gicv3-uefi | arm64 | lab-broonie | gcc-10 | defconfig+arm64-chromebook | 1
rk3399-gru-kevin | arm64 | lab-collabora | gcc-10 | defconfig+arm64-chromebook | 1

Details: https://kernelci.org/test/job/cip-gitlab/branch/ci%2Fiwamatsu%2Flinux-4.19.y-cip-rc/kernel/v4.19.249-cip76-54-gb41c396e258f/plan/baseline/

Test: baseline
Tree: cip-gitlab
Branch: ci/iwamatsu/linux-4.19.y-cip-rc
Describe: v4.19.249-cip76-54-gb41c396e258f
URL: https://gitlab.com/cip-project/cip-kernel/linux-cip.git
SHA: b41c396e258f2fee2f17d7d65e4e03a629ba380b


Test Regressions
----------------


platform | arch | lab | compiler | defconfig | regressions
---------------------------+-------+---------------+----------+----------------------------+------------
da850-lcdk | arm | lab-baylibre | gcc-10 | davinci_all_defconfig | 2

Details: https://kernelci.org/test/plan/id/62c3b44601a65903caa39be8

Results: 4 PASS, 2 FAIL, 1 SKIP
Full config: davinci_all_defconfig
Compiler: gcc-10 (arm-linux-gnueabihf-gcc (Debian 10.2.1-6) 10.2.1 20210110)
Plain log: https://storage.kernelci.org//cip-gitlab/ci-iwamatsu-linux-4.19.y-cip-rc/v4.19.249-cip76-54-gb41c396e258f/arm/davinci_all_defconfig/gcc-10/lab-baylibre/baseline-da850-lcdk.txt
HTML log: https://storage.kernelci.org//cip-gitlab/ci-iwamatsu-linux-4.19.y-cip-rc/v4.19.249-cip76-54-gb41c396e258f/arm/davinci_all_defconfig/gcc-10/lab-baylibre/baseline-da850-lcdk.html
Rootfs: http://storage.kernelci.org/images/rootfs/buildroot/buildroot-baseline/20220624.0/armel/rootfs.cpio.gz


* baseline.dmesg.emerg: https://kernelci.org/test/case/id/62c3b44601a65903caa39bef
new failure (last pass: v4.19.249-cip76-53-ga202ffa2bce5)
4 lines

2022-07-05T03:47:06.293045 kern :emerg : page:c6f51000 count:0 mapcount:-128 mapping:00000000 index:0x4
2022-07-05T03:47:06.293275 kern :emerg : flags: 0x0()
2022-07-05T03:47:06.293457 kern :emerg : page:c6f59000 count:0 mapcount:-128 mapping:00000000 index:0x4
2022-07-05T03:47:06.296172 kern :emerg : flags: 0x0()
2022-07-05T03:47:06.360018 <8><LAVA_SIGNAL_TESTCASE TEST_CASE_ID=emerg RESULT=fail UNITS=lines MEASUREMENT=4>
2022-07-05T03:47:06.360605 + set +x

* baseline.dmesg.alert: https://kernelci.org/test/case/id/62c3b44601a65903caa39bf0
new failure (last pass: v4.19.249-cip76-53-ga202ffa2bce5)
6 lines

2022-07-05T03:47:06.110424 kern :alert : BUG: Bad page state in process swapper pfn:c3400
2022-07-05T03:47:06.111792 kern :alert : raw: 00000000 00000100 00000200 00000000 00000004 0000000a ffffff7f 00000000
2022-07-05T03:47:06.112276 kern :alert : page dumped because: nonzero mapcount
2022-07-05T03:47:06.112686 kern :alert : BUG: Bad page state in process swapper pfn:c3800
2022-07-05T03:47:06.113080 kern :alert : raw: 00000000 00000100 00000200 00000000 00000004 0000000a ffffff7f 00000000
2022-07-05T03:47:06.114692 kern :alert : page dumped because: nonzero mapcount
2022-07-05T03:47:06.152233 <8><LAVA_SIGNAL_TESTCASE TEST_CASE_ID=alert RESULT=fail UNITS=lines MEASUREMENT=6>



platform | arch | lab | compiler | defconfig | regressions
---------------------------+-------+---------------+----------+----------------------------+------------
jetson-tk1 | arm | lab-baylibre | gcc-10 | multi_v7_defconfig | 1

Details: https://kernelci.org/test/plan/id/62c3b6f1b78b9f0184a39bd2

Results: 0 PASS, 1 FAIL, 0 SKIP
Full config: multi_v7_defconfig
Compiler: gcc-10 (arm-linux-gnueabihf-gcc (Debian 10.2.1-6) 10.2.1 20210110)
Plain log: https://storage.kernelci.org//cip-gitlab/ci-iwamatsu-linux-4.19.y-cip-rc/v4.19.249-cip76-54-gb41c396e258f/arm/multi_v7_defconfig/gcc-10/lab-baylibre/baseline-jetson-tk1.txt
HTML log: https://storage.kernelci.org//cip-gitlab/ci-iwamatsu-linux-4.19.y-cip-rc/v4.19.249-cip76-54-gb41c396e258f/arm/multi_v7_defconfig/gcc-10/lab-baylibre/baseline-jetson-tk1.html
Rootfs: http://storage.kernelci.org/images/rootfs/buildroot/buildroot-baseline/20220624.0/armel/rootfs.cpio.gz


* baseline.login: https://kernelci.org/test/case/id/62c3b6f1b78b9f0184a39bd3
failing since 28 days (last pass: v4.19.239-cip72-68-g407458469172, first fail: v4.19.245-cip74-32-g2d021d7a9e637)



platform | arch | lab | compiler | defconfig | regressions
---------------------------+-------+---------------+----------+----------------------------+------------
qemu_arm64-virt-gicv2 | arm64 | lab-baylibre | gcc-10 | defconfig | 1

Details: https://kernelci.org/test/plan/id/62c3b57de2ef24bb63a39bde

Results: 0 PASS, 1 FAIL, 0 SKIP
Full config: defconfig
Compiler: gcc-10 (aarch64-linux-gnu-gcc (Debian 10.2.1-6) 10.2.1 20210110)
Plain log: https://storage.kernelci.org//cip-gitlab/ci-iwamatsu-linux-4.19.y-cip-rc/v4.19.249-cip76-54-gb41c396e258f/arm64/defconfig/gcc-10/lab-baylibre/baseline-qemu_arm64-virt-gicv2.txt
HTML log: https://storage.kernelci.org//cip-gitlab/ci-iwamatsu-linux-4.19.y-cip-rc/v4.19.249-cip76-54-gb41c396e258f/arm64/defconfig/gcc-10/lab-baylibre/baseline-qemu_arm64-virt-gicv2.html
Rootfs: http://storage.kernelci.org/images/rootfs/buildroot/buildroot-baseline/20220624.0/arm64/rootfs.cpio.gz


* baseline.login: https://kernelci.org/test/case/id/62c3b57de2ef24bb63a39bdf
failing since 47 days (last pass: v4.19.239-cip72-68-g407458469172, first fail: v4.19.242-cip73-50-gd57bc44cb340)



platform | arch | lab | compiler | defconfig | regressions
---------------------------+-------+---------------+----------+----------------------------+------------
qemu_arm64-virt-gicv2 | arm64 | lab-baylibre | gcc-10 | defconfig+arm64-chromebook | 1

Details: https://kernelci.org/test/plan/id/62c3b658ae7190e4b6a39bdf

Results: 0 PASS, 1 FAIL, 0 SKIP
Full config: defconfig+arm64-chromebook
Compiler: gcc-10 (aarch64-linux-gnu-gcc (Debian 10.2.1-6) 10.2.1 20210110)
Plain log: https://storage.kernelci.org//cip-gitlab/ci-iwamatsu-linux-4.19.y-cip-rc/v4.19.249-cip76-54-gb41c396e258f/arm64/defconfig+arm64-chromebook/gcc-10/lab-baylibre/baseline-qemu_arm64-virt-gicv2.txt
HTML log: https://storage.kernelci.org//cip-gitlab/ci-iwamatsu-linux-4.19.y-cip-rc/v4.19.249-cip76-54-gb41c396e258f/arm64/defconfig+arm64-chromebook/gcc-10/lab-baylibre/baseline-qemu_arm64-virt-gicv2.html
Rootfs: http://storage.kernelci.org/images/rootfs/buildroot/buildroot-baseline/20220624.0/arm64/rootfs.cpio.gz


* baseline.login: https://kernelci.org/test/case/id/62c3b658ae7190e4b6a39be0
failing since 47 days (last pass: v4.19.239-cip72-68-g407458469172, first fail: v4.19.242-cip73-50-gd57bc44cb340)



platform | arch | lab | compiler | defconfig | regressions
---------------------------+-------+---------------+----------+----------------------------+------------
qemu_arm64-virt-gicv2 | arm64 | lab-broonie | gcc-10 | defconfig | 1

Details: https://kernelci.org/test/plan/id/62c3b5270dd8423c26a39c01

Results: 0 PASS, 1 FAIL, 0 SKIP
Full config: defconfig
Compiler: gcc-10 (aarch64-linux-gnu-gcc (Debian 10.2.1-6) 10.2.1 20210110)
Plain log: https://storage.kernelci.org//cip-gitlab/ci-iwamatsu-linux-4.19.y-cip-rc/v4.19.249-cip76-54-gb41c396e258f/arm64/defconfig/gcc-10/lab-broonie/baseline-qemu_arm64-virt-gicv2.txt
HTML log: https://storage.kernelci.org//cip-gitlab/ci-iwamatsu-linux-4.19.y-cip-rc/v4.19.249-cip76-54-gb41c396e258f/arm64/defconfig/gcc-10/lab-broonie/baseline-qemu_arm64-virt-gicv2.html
Rootfs: http://storage.kernelci.org/images/rootfs/buildroot/buildroot-baseline/20220624.0/arm64/rootfs.cpio.gz


* baseline.login: https://kernelci.org/test/case/id/62c3b5270dd8423c26a39c02
failing since 47 days (last pass: v4.19.239-cip72-68-g407458469172, first fail: v4.19.242-cip73-50-gd57bc44cb340)



platform | arch | lab | compiler | defconfig | regressions
---------------------------+-------+---------------+----------+----------------------------+------------
qemu_arm64-virt-gicv2 | arm64 | lab-broonie | gcc-10 | defconfig+arm64-chromebook | 1

Details: https://kernelci.org/test/plan/id/62c3b6df87fcc3f9fda39be5

Results: 0 PASS, 1 FAIL, 0 SKIP
Full config: defconfig+arm64-chromebook
Compiler: gcc-10 (aarch64-linux-gnu-gcc (Debian 10.2.1-6) 10.2.1 20210110)
Plain log: https://storage.kernelci.org//cip-gitlab/ci-iwamatsu-linux-4.19.y-cip-rc/v4.19.249-cip76-54-gb41c396e258f/arm64/defconfig+arm64-chromebook/gcc-10/lab-broonie/baseline-qemu_arm64-virt-gicv2.txt
HTML log: https://storage.kernelci.org//cip-gitlab/ci-iwamatsu-linux-4.19.y-cip-rc/v4.19.249-cip76-54-gb41c396e258f/arm64/defconfig+arm64-chromebook/gcc-10/lab-broonie/baseline-qemu_arm64-virt-gicv2.html
Rootfs: http://storage.kernelci.org/images/rootfs/buildroot/buildroot-baseline/20220624.0/arm64/rootfs.cpio.gz


* baseline.login: https://kernelci.org/test/case/id/62c3b6df87fcc3f9fda39be6
failing since 47 days (last pass: v4.19.239-cip72-68-g407458469172, first fail: v4.19.242-cip73-50-gd57bc44cb340)



platform | arch | lab | compiler | defconfig | regressions
---------------------------+-------+---------------+----------+----------------------------+------------
qemu_arm64-virt-gicv2-uefi | arm64 | lab-baylibre | gcc-10 | defconfig | 1

Details: https://kernelci.org/test/plan/id/62c3b591adfe84d255a39bee

Results: 0 PASS, 1 FAIL, 0 SKIP
Full config: defconfig
Compiler: gcc-10 (aarch64-linux-gnu-gcc (Debian 10.2.1-6) 10.2.1 20210110)
Plain log: https://storage.kernelci.org//cip-gitlab/ci-iwamatsu-linux-4.19.y-cip-rc/v4.19.249-cip76-54-gb41c396e258f/arm64/defconfig/gcc-10/lab-baylibre/baseline-qemu_arm64-virt-gicv2-uefi.txt
HTML log: https://storage.kernelci.org//cip-gitlab/ci-iwamatsu-linux-4.19.y-cip-rc/v4.19.249-cip76-54-gb41c396e258f/arm64/defconfig/gcc-10/lab-baylibre/baseline-qemu_arm64-virt-gicv2-uefi.html
Rootfs: http://storage.kernelci.org/images/rootfs/buildroot/buildroot-baseline/20220624.0/arm64/rootfs.cpio.gz


* baseline.login: https://kernelci.org/test/case/id/62c3b591adfe84d255a39bef
failing since 47 days (last pass: v4.19.239-cip72-68-g407458469172, first fail: v4.19.242-cip73-50-gd57bc44cb340)



platform | arch | lab | compiler | defconfig | regressions
---------------------------+-------+---------------+----------+----------------------------+------------
qemu_arm64-virt-gicv2-uefi | arm64 | lab-baylibre | gcc-10 | defconfig+arm64-chromebook | 1

Details: https://kernelci.org/test/plan/id/62c3b6f92afccfb1e5a39bf0

Results: 0 PASS, 1 FAIL, 0 SKIP
Full config: defconfig+arm64-chromebook
Compiler: gcc-10 (aarch64-linux-gnu-gcc (Debian 10.2.1-6) 10.2.1 20210110)
Plain log: https://storage.kernelci.org//cip-gitlab/ci-iwamatsu-linux-4.19.y-cip-rc/v4.19.249-cip76-54-gb41c396e258f/arm64/defconfig+arm64-chromebook/gcc-10/lab-baylibre/baseline-qemu_arm64-virt-gicv2-uefi.txt
HTML log: https://storage.kernelci.org//cip-gitlab/ci-iwamatsu-linux-4.19.y-cip-rc/v4.19.249-cip76-54-gb41c396e258f/arm64/defconfig+arm64-chromebook/gcc-10/lab-baylibre/baseline-qemu_arm64-virt-gicv2-uefi.html
Rootfs: http://storage.kernelci.org/images/rootfs/buildroot/buildroot-baseline/20220624.0/arm64/rootfs.cpio.gz


* baseline.login: https://kernelci.org/test/case/id/62c3b6f92afccfb1e5a39bf1
failing since 47 days (last pass: v4.19.239-cip72-68-g407458469172, first fail: v4.19.242-cip73-50-gd57bc44cb340)



platform | arch | lab | compiler | defconfig | regressions
---------------------------+-------+---------------+----------+----------------------------+------------
qemu_arm64-virt-gicv2-uefi | arm64 | lab-broonie | gcc-10 | defconfig | 1

Details: https://kernelci.org/test/plan/id/62c3b53bc1612fd326a39bfd

Results: 0 PASS, 1 FAIL, 0 SKIP
Full config: defconfig
Compiler: gcc-10 (aarch64-linux-gnu-gcc (Debian 10.2.1-6) 10.2.1 20210110)
Plain log: https://storage.kernelci.org//cip-gitlab/ci-iwamatsu-linux-4.19.y-cip-rc/v4.19.249-cip76-54-gb41c396e258f/arm64/defconfig/gcc-10/lab-broonie/baseline-qemu_arm64-virt-gicv2-uefi.txt
HTML log: https://storage.kernelci.org//cip-gitlab/ci-iwamatsu-linux-4.19.y-cip-rc/v4.19.249-cip76-54-gb41c396e258f/arm64/defconfig/gcc-10/lab-broonie/baseline-qemu_arm64-virt-gicv2-uefi.html
Rootfs: http://storage.kernelci.org/images/rootfs/buildroot/buildroot-baseline/20220624.0/arm64/rootfs.cpio.gz


* baseline.login: https://kernelci.org/test/case/id/62c3b53bc1612fd326a39bfe
failing since 47 days (last pass: v4.19.239-cip72-68-g407458469172, first fail: v4.19.242-cip73-50-gd57bc44cb340)



platform | arch | lab | compiler | defconfig | regressions
---------------------------+-------+---------------+----------+----------------------------+------------
qemu_arm64-virt-gicv2-uefi | arm64 | lab-broonie | gcc-10 | defconfig+arm64-chromebook | 1

Details: https://kernelci.org/test/plan/id/62c3b72fdb2e71c10ca39c1f

Results: 0 PASS, 1 FAIL, 0 SKIP
Full config: defconfig+arm64-chromebook
Compiler: gcc-10 (aarch64-linux-gnu-gcc (Debian 10.2.1-6) 10.2.1 20210110)
Plain log: https://storage.kernelci.org//cip-gitlab/ci-iwamatsu-linux-4.19.y-cip-rc/v4.19.249-cip76-54-gb41c396e258f/arm64/defconfig+arm64-chromebook/gcc-10/lab-broonie/baseline-qemu_arm64-virt-gicv2-uefi.txt
HTML log: https://storage.kernelci.org//cip-gitlab/ci-iwamatsu-linux-4.19.y-cip-rc/v4.19.249-cip76-54-gb41c396e258f/arm64/defconfig+arm64-chromebook/gcc-10/lab-broonie/baseline-qemu_arm64-virt-gicv2-uefi.html
Rootfs: http://storage.kernelci.org/images/rootfs/buildroot/buildroot-baseline/20220624.0/arm64/rootfs.cpio.gz


* baseline.login: https://kernelci.org/test/case/id/62c3b72fdb2e71c10ca39c20
failing since 47 days (last pass: v4.19.239-cip72-68-g407458469172, first fail: v4.19.242-cip73-50-gd57bc44cb340)



platform | arch | lab | compiler | defconfig | regressions
---------------------------+-------+---------------+----------+----------------------------+------------
qemu_arm64-virt-gicv3 | arm64 | lab-baylibre | gcc-10 | defconfig | 1

Details: https://kernelci.org/test/plan/id/62c3b59284f501711fa39bf1

Results: 0 PASS, 1 FAIL, 0 SKIP
Full config: defconfig
Compiler: gcc-10 (aarch64-linux-gnu-gcc (Debian 10.2.1-6) 10.2.1 20210110)
Plain log: https://storage.kernelci.org//cip-gitlab/ci-iwamatsu-linux-4.19.y-cip-rc/v4.19.249-cip76-54-gb41c396e258f/arm64/defconfig/gcc-10/lab-baylibre/baseline-qemu_arm64-virt-gicv3.txt
HTML log: https://storage.kernelci.org//cip-gitlab/ci-iwamatsu-linux-4.19.y-cip-rc/v4.19.249-cip76-54-gb41c396e258f/arm64/defconfig/gcc-10/lab-baylibre/baseline-qemu_arm64-virt-gicv3.html
Rootfs: http://storage.kernelci.org/images/rootfs/buildroot/buildroot-baseline/20220624.0/arm64/rootfs.cpio.gz


* baseline.login: https://kernelci.org/test/case/id/62c3b59284f501711fa39bf2
failing since 47 days (last pass: v4.19.239-cip72-68-g407458469172, first fail: v4.19.242-cip73-50-gd57bc44cb340)



platform | arch | lab | compiler | defconfig | regressions
---------------------------+-------+---------------+----------+----------------------------+------------
qemu_arm64-virt-gicv3 | arm64 | lab-baylibre | gcc-10 | defconfig+arm64-chromebook | 1

Details: https://kernelci.org/test/plan/id/62c3b6fa2afccfb1e5a39bf3

Results: 0 PASS, 1 FAIL, 0 SKIP
Full config: defconfig+arm64-chromebook
Compiler: gcc-10 (aarch64-linux-gnu-gcc (Debian 10.2.1-6) 10.2.1 20210110)
Plain log: https://storage.kernelci.org//cip-gitlab/ci-iwamatsu-linux-4.19.y-cip-rc/v4.19.249-cip76-54-gb41c396e258f/arm64/defconfig+arm64-chromebook/gcc-10/lab-baylibre/baseline-qemu_arm64-virt-gicv3.txt
HTML log: https://storage.kernelci.org//cip-gitlab/ci-iwamatsu-linux-4.19.y-cip-rc/v4.19.249-cip76-54-gb41c396e258f/arm64/defconfig+arm64-chromebook/gcc-10/lab-baylibre/baseline-qemu_arm64-virt-gicv3.html
Rootfs: http://storage.kernelci.org/images/rootfs/buildroot/buildroot-baseline/20220624.0/arm64/rootfs.cpio.gz


* baseline.login: https://kernelci.org/test/case/id/62c3b6fa2afccfb1e5a39bf4
failing since 47 days (last pass: v4.19.239-cip72-68-g407458469172, first fail: v4.19.242-cip73-50-gd57bc44cb340)



platform | arch | lab | compiler | defconfig | regressions
---------------------------+-------+---------------+----------+----------------------------+------------
qemu_arm64-virt-gicv3 | arm64 | lab-broonie | gcc-10 | defconfig | 1

Details: https://kernelci.org/test/plan/id/62c3b529269a4d050aa39bdd

Results: 0 PASS, 1 FAIL, 0 SKIP
Full config: defconfig
Compiler: gcc-10 (aarch64-linux-gnu-gcc (Debian 10.2.1-6) 10.2.1 20210110)
Plain log: https://storage.kernelci.org//cip-gitlab/ci-iwamatsu-linux-4.19.y-cip-rc/v4.19.249-cip76-54-gb41c396e258f/arm64/defconfig/gcc-10/lab-broonie/baseline-qemu_arm64-virt-gicv3.txt
HTML log: https://storage.kernelci.org//cip-gitlab/ci-iwamatsu-linux-4.19.y-cip-rc/v4.19.249-cip76-54-gb41c396e258f/arm64/defconfig/gcc-10/lab-broonie/baseline-qemu_arm64-virt-gicv3.html
Rootfs: http://storage.kernelci.org/images/rootfs/buildroot/buildroot-baseline/20220624.0/arm64/rootfs.cpio.gz


* baseline.login: https://kernelci.org/test/case/id/62c3b529269a4d050aa39bde
failing since 47 days (last pass: v4.19.239-cip72-68-g407458469172, first fail: v4.19.242-cip73-50-gd57bc44cb340)



platform | arch | lab | compiler | defconfig | regressions
---------------------------+-------+---------------+----------+----------------------------+------------
qemu_arm64-virt-gicv3 | arm64 | lab-broonie | gcc-10 | defconfig+arm64-chromebook | 1

Details: https://kernelci.org/test/plan/id/62c3b80bb18ba34beaa39bef

Results: 0 PASS, 1 FAIL, 0 SKIP
Full config: defconfig+arm64-chromebook
Compiler: gcc-10 (aarch64-linux-gnu-gcc (Debian 10.2.1-6) 10.2.1 20210110)
Plain log: https://storage.kernelci.org//cip-gitlab/ci-iwamatsu-linux-4.19.y-cip-rc/v4.19.249-cip76-54-gb41c396e258f/arm64/defconfig+arm64-chromebook/gcc-10/lab-broonie/baseline-qemu_arm64-virt-gicv3.txt
HTML log: https://storage.kernelci.org//cip-gitlab/ci-iwamatsu-linux-4.19.y-cip-rc/v4.19.249-cip76-54-gb41c396e258f/arm64/defconfig+arm64-chromebook/gcc-10/lab-broonie/baseline-qemu_arm64-virt-gicv3.html
Rootfs: http://storage.kernelci.org/images/rootfs/buildroot/buildroot-baseline/20220624.0/arm64/rootfs.cpio.gz


* baseline.login: https://kernelci.org/test/case/id/62c3b80bb18ba34beaa39bf0
failing since 47 days (last pass: v4.19.239-cip72-68-g407458469172, first fail: v4.19.242-cip73-50-gd57bc44cb340)



platform | arch | lab | compiler | defconfig | regressions
---------------------------+-------+---------------+----------+----------------------------+------------
qemu_arm64-virt-gicv3-uefi | arm64 | lab-baylibre | gcc-10 | defconfig | 1

Details: https://kernelci.org/test/plan/id/62c3b593adfe84d255a39bf3

Results: 0 PASS, 1 FAIL, 0 SKIP
Full config: defconfig
Compiler: gcc-10 (aarch64-linux-gnu-gcc (Debian 10.2.1-6) 10.2.1 20210110)
Plain log: https://storage.kernelci.org//cip-gitlab/ci-iwamatsu-linux-4.19.y-cip-rc/v4.19.249-cip76-54-gb41c396e258f/arm64/defconfig/gcc-10/lab-baylibre/baseline-qemu_arm64-virt-gicv3-uefi.txt
HTML log: https://storage.kernelci.org//cip-gitlab/ci-iwamatsu-linux-4.19.y-cip-rc/v4.19.249-cip76-54-gb41c396e258f/arm64/defconfig/gcc-10/lab-baylibre/baseline-qemu_arm64-virt-gicv3-uefi.html
Rootfs: http://storage.kernelci.org/images/rootfs/buildroot/buildroot-baseline/20220624.0/arm64/rootfs.cpio.gz


* baseline.login: https://kernelci.org/test/case/id/62c3b593adfe84d255a39bf4
failing since 47 days (last pass: v4.19.239-cip72-68-g407458469172, first fail: v4.19.242-cip73-50-gd57bc44cb340)



platform | arch | lab | compiler | defconfig | regressions
---------------------------+-------+---------------+----------+----------------------------+------------
qemu_arm64-virt-gicv3-uefi | arm64 | lab-baylibre | gcc-10 | defconfig+arm64-chromebook | 1

Details: https://kernelci.org/test/plan/id/62c3b6e5b78b9f0184a39bcd

Results: 0 PASS, 1 FAIL, 0 SKIP
Full config: defconfig+arm64-chromebook
Compiler: gcc-10 (aarch64-linux-gnu-gcc (Debian 10.2.1-6) 10.2.1 20210110)
Plain log: https://storage.kernelci.org//cip-gitlab/ci-iwamatsu-linux-4.19.y-cip-rc/v4.19.249-cip76-54-gb41c396e258f/arm64/defconfig+arm64-chromebook/gcc-10/lab-baylibre/baseline-qemu_arm64-virt-gicv3-uefi.txt
HTML log: https://storage.kernelci.org//cip-gitlab/ci-iwamatsu-linux-4.19.y-cip-rc/v4.19.249-cip76-54-gb41c396e258f/arm64/defconfig+arm64-chromebook/gcc-10/lab-baylibre/baseline-qemu_arm64-virt-gicv3-uefi.html
Rootfs: http://storage.kernelci.org/images/rootfs/buildroot/buildroot-baseline/20220624.0/arm64/rootfs.cpio.gz


* baseline.login: https://kernelci.org/test/case/id/62c3b6e5b78b9f0184a39bce
failing since 47 days (last pass: v4.19.239-cip72-68-g407458469172, first fail: v4.19.242-cip73-50-gd57bc44cb340)



platform | arch | lab | compiler | defconfig | regressions
---------------------------+-------+---------------+----------+----------------------------+------------
qemu_arm64-virt-gicv3-uefi | arm64 | lab-broonie | gcc-10 | defconfig | 1

Details: https://kernelci.org/test/plan/id/62c3b53cc1612fd326a39c00

Results: 0 PASS, 1 FAIL, 0 SKIP
Full config: defconfig
Compiler: gcc-10 (aarch64-linux-gnu-gcc (Debian 10.2.1-6) 10.2.1 20210110)
Plain log: https://storage.kernelci.org//cip-gitlab/ci-iwamatsu-linux-4.19.y-cip-rc/v4.19.249-cip76-54-gb41c396e258f/arm64/defconfig/gcc-10/lab-broonie/baseline-qemu_arm64-virt-gicv3-uefi.txt
HTML log: https://storage.kernelci.org//cip-gitlab/ci-iwamatsu-linux-4.19.y-cip-rc/v4.19.249-cip76-54-gb41c396e258f/arm64/defconfig/gcc-10/lab-broonie/baseline-qemu_arm64-virt-gicv3-uefi.html
Rootfs: http://storage.kernelci.org/images/rootfs/buildroot/buildroot-baseline/20220624.0/arm64/rootfs.cpio.gz


* baseline.login: https://kernelci.org/test/case/id/62c3b53cc1612fd326a39c01
failing since 47 days (last pass: v4.19.239-cip72-68-g407458469172, first fail: v4.19.242-cip73-50-gd57bc44cb340)



platform | arch | lab | compiler | defconfig | regressions
---------------------------+-------+---------------+----------+----------------------------+------------
qemu_arm64-virt-gicv3-uefi | arm64 | lab-broonie | gcc-10 | defconfig+arm64-chromebook | 1

Details: https://kernelci.org/test/plan/id/62c3b6f3b78b9f0184a39bd9

Results: 0 PASS, 1 FAIL, 0 SKIP
Full config: defconfig+arm64-chromebook
Compiler: gcc-10 (aarch64-linux-gnu-gcc (Debian 10.2.1-6) 10.2.1 20210110)
Plain log: https://storage.kernelci.org//cip-gitlab/ci-iwamatsu-linux-4.19.y-cip-rc/v4.19.249-cip76-54-gb41c396e258f/arm64/defconfig+arm64-chromebook/gcc-10/lab-broonie/baseline-qemu_arm64-virt-gicv3-uefi.txt
HTML log: https://storage.kernelci.org//cip-gitlab/ci-iwamatsu-linux-4.19.y-cip-rc/v4.19.249-cip76-54-gb41c396e258f/arm64/defconfig+arm64-chromebook/gcc-10/lab-broonie/baseline-qemu_arm64-virt-gicv3-uefi.html
Rootfs: http://storage.kernelci.org/images/rootfs/buildroot/buildroot-baseline/20220624.0/arm64/rootfs.cpio.gz


* baseline.login: https://kernelci.org/test/case/id/62c3b6f3b78b9f0184a39bda
failing since 47 days (last pass: v4.19.239-cip72-68-g407458469172, first fail: v4.19.242-cip73-50-gd57bc44cb340)



platform | arch | lab | compiler | defconfig | regressions
---------------------------+-------+---------------+----------+----------------------------+------------
rk3399-gru-kevin | arm64 | lab-collabora | gcc-10 | defconfig+arm64-chromebook | 1

Details: https://kernelci.org/test/plan/id/62c3b57e58f0547f27a39c0f

Results: 83 PASS, 7 FAIL, 0 SKIP
Full config: defconfig+arm64-chromebook
Compiler: gcc-10 (aarch64-linux-gnu-gcc (Debian 10.2.1-6) 10.2.1 20210110)
Plain log: https://storage.kernelci.org//cip-gitlab/ci-iwamatsu-linux-4.19.y-cip-rc/v4.19.249-cip76-54-gb41c396e258f/arm64/defconfig+arm64-chromebook/gcc-10/lab-collabora/baseline-rk3399-gru-kevin.txt
HTML log: https://storage.kernelci.org//cip-gitlab/ci-iwamatsu-linux-4.19.y-cip-rc/v4.19.249-cip76-54-gb41c396e258f/arm64/defconfig+arm64-chromebook/gcc-10/lab-collabora/baseline-rk3399-gru-kevin.html
Rootfs: http://storage.kernelci.org/images/rootfs/buildroot/buildroot-baseline/20220624.0/arm64/rootfs.cpio.gz


* baseline.bootrr.rockchip-i2s1-probed: https://kernelci.org/test/case/id/62c3b57e58f0547f27a39c31
failing since 113 days (last pass: v4.19.229-cip67-111-g5c3c0b39cf3b, first fail: v4.19.231-cip68-123-g92e3e7f3d4df)

2022-07-05T03:52:21.065444 /lava-6750444/1/../bin/lava-test-case


cip-gitlab/ci/iwamatsu/linux-4.19.y-cip-rc baseline-nfs: 44 runs, 2 regressions (v4.19.249-cip76-54-gb41c396e258f) #kernelci

kernelci.org bot <bot@...>
 

cip-gitlab/ci/iwamatsu/linux-4.19.y-cip-rc baseline-nfs: 44 runs, 2 regressions (v4.19.249-cip76-54-gb41c396e258f)

Regressions Summary
-------------------

platform | arch | lab | compiler | defconfig | regressions
-----------------+-------+---------------+----------+----------------------------+------------
jetson-tk1 | arm | lab-baylibre | gcc-10 | multi_v7_defconfig | 1
rk3399-gru-kevin | arm64 | lab-collabora | gcc-10 | defconfig+arm64-chromebook | 1

Details: https://kernelci.org/test/job/cip-gitlab/branch/ci%2Fiwamatsu%2Flinux-4.19.y-cip-rc/kernel/v4.19.249-cip76-54-gb41c396e258f/plan/baseline-nfs/

Test: baseline-nfs
Tree: cip-gitlab
Branch: ci/iwamatsu/linux-4.19.y-cip-rc
Describe: v4.19.249-cip76-54-gb41c396e258f
URL: https://gitlab.com/cip-project/cip-kernel/linux-cip.git
SHA: b41c396e258f2fee2f17d7d65e4e03a629ba380b


Test Regressions
----------------


platform | arch | lab | compiler | defconfig | regressions
-----------------+-------+---------------+----------+----------------------------+------------
jetson-tk1 | arm | lab-baylibre | gcc-10 | multi_v7_defconfig | 1

Details: https://kernelci.org/test/plan/id/62c3b8201119a34480a39bf8

Results: 0 PASS, 1 FAIL, 0 SKIP
Full config: multi_v7_defconfig
Compiler: gcc-10 (arm-linux-gnueabihf-gcc (Debian 10.2.1-6) 10.2.1 20210110)
Plain log: https://storage.kernelci.org//cip-gitlab/ci-iwamatsu-linux-4.19.y-cip-rc/v4.19.249-cip76-54-gb41c396e258f/arm/multi_v7_defconfig/gcc-10/lab-baylibre/baseline-nfs-jetson-tk1.txt
HTML log: https://storage.kernelci.org//cip-gitlab/ci-iwamatsu-linux-4.19.y-cip-rc/v4.19.249-cip76-54-gb41c396e258f/arm/multi_v7_defconfig/gcc-10/lab-baylibre/baseline-nfs-jetson-tk1.html
Rootfs: http://storage.kernelci.org/images/rootfs/debian/bullseye/20220624.0/armhf/initrd.cpio.gz


* baseline-nfs.login: https://kernelci.org/test/case/id/62c3b8201119a34480a39bf9
failing since 28 days (last pass: v4.19.239-cip72-68-g407458469172, first fail: v4.19.245-cip74-32-g2d021d7a9e637)



platform | arch | lab | compiler | defconfig | regressions
-----------------+-------+---------------+----------+----------------------------+------------
rk3399-gru-kevin | arm64 | lab-collabora | gcc-10 | defconfig+arm64-chromebook | 1

Details: https://kernelci.org/test/plan/id/62c3b50580683c3d7ca39bef

Results: 82 PASS, 6 FAIL, 0 SKIP
Full config: defconfig+arm64-chromebook
Compiler: gcc-10 (aarch64-linux-gnu-gcc (Debian 10.2.1-6) 10.2.1 20210110)
Plain log: https://storage.kernelci.org//cip-gitlab/ci-iwamatsu-linux-4.19.y-cip-rc/v4.19.249-cip76-54-gb41c396e258f/arm64/defconfig+arm64-chromebook/gcc-10/lab-collabora/baseline-nfs-rk3399-gru-kevin.txt
HTML log: https://storage.kernelci.org//cip-gitlab/ci-iwamatsu-linux-4.19.y-cip-rc/v4.19.249-cip76-54-gb41c396e258f/arm64/defconfig+arm64-chromebook/gcc-10/lab-collabora/baseline-nfs-rk3399-gru-kevin.html
Rootfs: http://storage.kernelci.org/images/rootfs/debian/bullseye/20220624.0/arm64/initrd.cpio.gz


* baseline-nfs.bootrr.rockchip-i2s1-probed: https://kernelci.org/test/case/id/62c3b50580683c3d7ca39c11
failing since 113 days (last pass: v4.19.229-cip67-111-g5c3c0b39cf3b, first fail: v4.19.231-cip68-123-g92e3e7f3d4df)

2022-07-05T03:50:17.805914 <8>[ 37.849662] <LAVA_SIGNAL_TESTCASE TEST_CASE_ID=rockchip-i2s0-probed RESULT=pass>
2022-07-05T03:50:18.832660 /lava-6750436/1/../bin/lava-test-case
2022-07-05T03:50:18.860208 <8>[ 38.904037] <LAVA_SIGNAL_TESTCASE TEST_CASE_ID=rockchip-i2s1-probed RESULT=fail>


cip-gitlab/ci/iwamatsu/linux-4.4.y-cip-rc build: 179 builds: 3 failed, 176 passed, 4 errors, 36 warnings (v4.4.302-1083-g94e3113365c2) #kernelci

kernelci.org bot <bot@...>
 

cip-gitlab/ci/iwamatsu/linux-4.4.y-cip-rc build: 179 builds: 3 failed, 176 passed, 4 errors, 36 warnings (v4.4.302-1083-g94e3113365c2)

Full Build Summary: https://kernelci.org/build/cip-gitlab/branch/ci%2Fiwamatsu%2Flinux-4.4.y-cip-rc/kernel/v4.4.302-1083-g94e3113365c2/

Tree: cip-gitlab
Branch: ci/iwamatsu/linux-4.4.y-cip-rc
Git Describe: v4.4.302-1083-g94e3113365c2
Git Commit: 94e3113365c2fd3bb6050308d809a5d12b4f042a
Git URL: https://gitlab.com/cip-project/cip-kernel/linux-cip.git
Built: 6 unique architectures

Build Failures Detected:

arm:
rpc_defconfig: (gcc-10) FAIL

mips:
ip28_defconfig: (gcc-10) FAIL
lemote2f_defconfig: (gcc-10) FAIL

Errors and Warnings Detected:

arc:

arm64:
defconfig (gcc-10): 1 warning

arm:
clps711x_defconfig (gcc-10): 1 warning
davinci_all_defconfig (gcc-10): 1 warning
lpc32xx_defconfig (gcc-10): 1 warning
mini2440_defconfig (gcc-10): 1 warning
mxs_defconfig (gcc-10): 1 warning
omap1_defconfig (gcc-10): 1 warning
omap2plus_defconfig (gcc-10): 1 warning
rpc_defconfig (gcc-10): 2 errors
s3c2410_defconfig (gcc-10): 1 warning
s3c6400_defconfig (gcc-10): 2 warnings

i386:
i386_defconfig (gcc-10): 2 warnings

mips:
ip22_defconfig (gcc-10): 1 warning
lemote2f_defconfig (gcc-10): 2 errors
mtx1_defconfig (gcc-10): 3 warnings

x86_64:
allnoconfig (gcc-10): 4 warnings
tinyconfig (gcc-10): 3 warnings
x86_64_defconfig (gcc-10): 6 warnings
x86_64_defconfig+x86-chromebook (gcc-10): 6 warnings

Errors summary:

2 cc1: error: ‘-mloongson-mmi’ must be used with ‘-mhard-float’
1 arm-linux-gnueabihf-gcc: error: unrecognized -march target: armv3
1 arm-linux-gnueabihf-gcc: error: missing argument to ‘-march=’

Warnings summary:

7 arch/x86/kernel/process.c:456: Warning: no instruction mnemonic suffix given and no register operands; using default for `btr'
4 arch/x86/entry/entry_64.S:487: Warning: no instruction mnemonic suffix given and no register operands; using default for `btr'
4 arch/x86/entry/entry_64.S:1642: Warning: no instruction mnemonic suffix given and no register operands; using default for `sysret'
3 ld: warning: creating DT_TEXTREL in a PIE
3 drivers/tty/serial/samsung.c:1780:34: warning: array ‘s3c24xx_uart_dt_match’ assumed to have one element
2 sound/pci/echoaudio/echoaudio_dsp.c:647:9: warning: iteration 1073741824 invokes undefined behavior [-Waggressive-loop-optimizations]
2 ld: arch/x86/boot/compressed/head_64.o: warning: relocation in read-only section `.head.text'
1 sound/pci/echoaudio/echoaudio_dsp.c:658:9: warning: iteration 1073741824 invokes undefined behavior [-Waggressive-loop-optimizations]
1 ld: arch/x86/boot/compressed/head_32.o: warning: relocation in read-only section `.head.text'
1 drivers/net/ethernet/seeq/sgiseeq.c:804:26: warning: passing argument 5 of ‘dma_free_attrs’ makes pointer from integer without a cast [-Wint-conversion]
1 drivers/net/ethernet/apm/xgene/xgene_enet_main.c:32:36: warning: array ‘xgene_enet_acpi_match’ assumed to have one element
1 drivers/mmc/host/sdhci-s3c.c:429:34: warning: array ‘sdhci_s3c_dt_match’ assumed to have one element
1 drivers/gpio/gpio-omap.c:1161:34: warning: array ‘omap_gpio_match’ assumed to have one element
1 drivers/cpufreq/ti-cpufreq.c:250:24: warning: passing argument 1 of ‘PTR_ERR_OR_ZERO’ makes pointer from integer without a cast [-Wint-conversion]
1 arch/arm/mach-mxs/mach-mxs.c:285:26: warning: duplicate ‘const’ declaration specifier [-Wduplicate-decl-specifier]
1 arch/arm/mach-lpc32xx/phy3250.c:215:36: warning: duplicate ‘const’ declaration specifier [-Wduplicate-decl-specifier]
1 arch/arm/mach-davinci/da8xx-dt.c:23:34: warning: duplicate ‘const’ declaration specifier [-Wduplicate-decl-specifier]
1 arch/arm/mach-clps711x/board-autcpu12.c:163:26: warning: duplicate ‘const’ declaration specifier [-Wduplicate-decl-specifier]

================================================================================

Detailed per-defconfig build reports:

--------------------------------------------------------------------------------
acs5k_defconfig (arm, gcc-10) — PASS, 0 errors, 0 warnings, 0 section mismatches

--------------------------------------------------------------------------------
acs5k_tiny_defconfig (arm, gcc-10) — PASS, 0 errors, 0 warnings, 0 section mismatches

--------------------------------------------------------------------------------
allnoconfig (arm, gcc-10) — PASS, 0 errors, 0 warnings, 0 section mismatches

--------------------------------------------------------------------------------
allnoconfig (x86_64, gcc-10) — PASS, 0 errors, 4 warnings, 0 section mismatches

Warnings:
arch/x86/entry/entry_64.S:487: Warning: no instruction mnemonic suffix given and no register operands; using default for `btr'
arch/x86/entry/entry_64.S:1642: Warning: no instruction mnemonic suffix given and no register operands; using default for `sysret'
arch/x86/kernel/process.c:456: Warning: no instruction mnemonic suffix given and no register operands; using default for `btr'
arch/x86/kernel/process.c:456: Warning: no instruction mnemonic suffix given and no register operands; using default for `btr'

--------------------------------------------------------------------------------
allnoconfig (arc, gcc-10) — PASS, 0 errors, 0 warnings, 0 section mismatches

--------------------------------------------------------------------------------
allnoconfig (mips, gcc-10) — PASS, 0 errors, 0 warnings, 0 section mismatches

--------------------------------------------------------------------------------
allnoconfig (i386, gcc-10) — PASS, 0 errors, 0 warnings, 0 section mismatches

--------------------------------------------------------------------------------
am200epdkit_defconfig (arm, gcc-10) — PASS, 0 errors, 0 warnings, 0 section mismatches

--------------------------------------------------------------------------------
ar7_defconfig (mips, gcc-10) — PASS, 0 errors, 0 warnings, 0 section mismatches

--------------------------------------------------------------------------------
assabet_defconfig (arm, gcc-10) — PASS, 0 errors, 0 warnings, 0 section mismatches

--------------------------------------------------------------------------------
at91_dt_defconfig (arm, gcc-10) — PASS, 0 errors, 0 warnings, 0 section mismatches

--------------------------------------------------------------------------------
ath79_defconfig (mips, gcc-10) — PASS, 0 errors, 0 warnings, 0 section mismatches

--------------------------------------------------------------------------------
axm55xx_defconfig (arm, gcc-10) — PASS, 0 errors, 0 warnings, 0 section mismatches

--------------------------------------------------------------------------------
axs103_smp_defconfig (arc, gcc-10) — PASS, 0 errors, 0 warnings, 0 section mismatches

--------------------------------------------------------------------------------
badge4_defconfig (arm, gcc-10) — PASS, 0 errors, 0 warnings, 0 section mismatches

--------------------------------------------------------------------------------
bcm2835_defconfig (arm, gcc-10) — PASS, 0 errors, 0 warnings, 0 section mismatches

--------------------------------------------------------------------------------
bcm47xx_defconfig (mips, gcc-10) — PASS, 0 errors, 0 warnings, 0 section mismatches

--------------------------------------------------------------------------------
bcm63xx_defconfig (mips, gcc-10) — PASS, 0 errors, 0 warnings, 0 section mismatches

--------------------------------------------------------------------------------
bcm_defconfig (arm, gcc-10) — PASS, 0 errors, 0 warnings, 0 section mismatches

--------------------------------------------------------------------------------
bigsur_defconfig (mips, gcc-10) — PASS, 0 errors, 0 warnings, 0 section mismatches

--------------------------------------------------------------------------------
bmips_be_defconfig (mips, gcc-10) — PASS, 0 errors, 0 warnings, 0 section mismatches

--------------------------------------------------------------------------------
bmips_stb_defconfig (mips, gcc-10) — PASS, 0 errors, 0 warnings, 0 section mismatches

--------------------------------------------------------------------------------
capcella_defconfig (mips, gcc-10) — PASS, 0 errors, 0 warnings, 0 section mismatches

--------------------------------------------------------------------------------
cavium_octeon_defconfig (mips, gcc-10) — PASS, 0 errors, 0 warnings, 0 section mismatches

--------------------------------------------------------------------------------
cerfcube_defconfig (arm, gcc-10) — PASS, 0 errors, 0 warnings, 0 section mismatches

--------------------------------------------------------------------------------
ci20_defconfig (mips, gcc-10) — PASS, 0 errors, 0 warnings, 0 section mismatches

--------------------------------------------------------------------------------
clps711x_defconfig (arm, gcc-10) — PASS, 0 errors, 1 warning, 0 section mismatches

Warnings:
arch/arm/mach-clps711x/board-autcpu12.c:163:26: warning: duplicate ‘const’ declaration specifier [-Wduplicate-decl-specifier]

--------------------------------------------------------------------------------
cm_x2xx_defconfig (arm, gcc-10) — PASS, 0 errors, 0 warnings, 0 section mismatches

--------------------------------------------------------------------------------
cm_x300_defconfig (arm, gcc-10) — PASS, 0 errors, 0 warnings, 0 section mismatches

--------------------------------------------------------------------------------
cobalt_defconfig (mips, gcc-10) — PASS, 0 errors, 0 warnings, 0 section mismatches

--------------------------------------------------------------------------------
colibri_pxa270_defconfig (arm, gcc-10) — PASS, 0 errors, 0 warnings, 0 section mismatches

--------------------------------------------------------------------------------
colibri_pxa300_defconfig (arm, gcc-10) — PASS, 0 errors, 0 warnings, 0 section mismatches

--------------------------------------------------------------------------------
collie_defconfig (arm, gcc-10) — PASS, 0 errors, 0 warnings, 0 section mismatches

--------------------------------------------------------------------------------
corgi_defconfig (arm, gcc-10) — PASS, 0 errors, 0 warnings, 0 section mismatches

--------------------------------------------------------------------------------
davinci_all_defconfig (arm, gcc-10) — PASS, 0 errors, 1 warning, 0 section mismatches

Warnings:
arch/arm/mach-davinci/da8xx-dt.c:23:34: warning: duplicate ‘const’ declaration specifier [-Wduplicate-decl-specifier]

--------------------------------------------------------------------------------
db1xxx_defconfig (mips, gcc-10) — PASS, 0 errors, 0 warnings, 0 section mismatches

--------------------------------------------------------------------------------
decstation_defconfig (mips, gcc-10) — PASS, 0 errors, 0 warnings, 0 section mismatches

--------------------------------------------------------------------------------
defconfig (arm64, gcc-10) — PASS, 0 errors, 1 warning, 0 section mismatches

Warnings:
drivers/net/ethernet/apm/xgene/xgene_enet_main.c:32:36: warning: array ‘xgene_enet_acpi_match’ assumed to have one element

--------------------------------------------------------------------------------
dove_defconfig (arm, gcc-10) — PASS, 0 errors, 0 warnings, 0 section mismatches

--------------------------------------------------------------------------------
e55_defconfig (mips, gcc-10) — PASS, 0 errors, 0 warnings, 0 section mismatches

--------------------------------------------------------------------------------
ebsa110_defconfig (arm, gcc-10) — PASS, 0 errors, 0 warnings, 0 section mismatches

--------------------------------------------------------------------------------
efm32_defconfig (arm, gcc-10) — PASS, 0 errors, 0 warnings, 0 section mismatches

--------------------------------------------------------------------------------
em_x270_defconfig (arm, gcc-10) — PASS, 0 errors, 0 warnings, 0 section mismatches

--------------------------------------------------------------------------------
ep93xx_defconfig (arm, gcc-10) — PASS, 0 errors, 0 warnings, 0 section mismatches

--------------------------------------------------------------------------------
eseries_pxa_defconfig (arm, gcc-10) — PASS, 0 errors, 0 warnings, 0 section mismatches

--------------------------------------------------------------------------------
exynos_defconfig (arm, gcc-10) — PASS, 0 errors, 0 warnings, 0 section mismatches

--------------------------------------------------------------------------------
ezx_defconfig (arm, gcc-10) — PASS, 0 errors, 0 warnings, 0 section mismatches

--------------------------------------------------------------------------------
footbridge_defconfig (arm, gcc-10) — PASS, 0 errors, 0 warnings, 0 section mismatches

--------------------------------------------------------------------------------
gpr_defconfig (mips, gcc-10) — PASS, 0 errors, 0 warnings, 0 section mismatches

--------------------------------------------------------------------------------
h3600_defconfig (arm, gcc-10) — PASS, 0 errors, 0 warnings, 0 section mismatches

--------------------------------------------------------------------------------
h5000_defconfig (arm, gcc-10) — PASS, 0 errors, 0 warnings, 0 section mismatches

--------------------------------------------------------------------------------
hackkit_defconfig (arm, gcc-10) — PASS, 0 errors, 0 warnings, 0 section mismatches

--------------------------------------------------------------------------------
hisi_defconfig (arm, gcc-10) — PASS, 0 errors, 0 warnings, 0 section mismatches

--------------------------------------------------------------------------------
i386_defconfig (i386, gcc-10) — PASS, 0 errors, 2 warnings, 0 section mismatches

Warnings:
ld: arch/x86/boot/compressed/head_32.o: warning: relocation in read-only section `.head.text'
ld: warning: creating DT_TEXTREL in a PIE

--------------------------------------------------------------------------------
imote2_defconfig (arm, gcc-10) — PASS, 0 errors, 0 warnings, 0 section mismatches

--------------------------------------------------------------------------------
imx_v4_v5_defconfig (arm, gcc-10) — PASS, 0 errors, 0 warnings, 0 section mismatches

--------------------------------------------------------------------------------
imx_v6_v7_defconfig (arm, gcc-10) — PASS, 0 errors, 0 warnings, 0 section mismatches

--------------------------------------------------------------------------------
integrator_defconfig (arm, gcc-10) — PASS, 0 errors, 0 warnings, 0 section mismatches

--------------------------------------------------------------------------------
iop13xx_defconfig (arm, gcc-10) — PASS, 0 errors, 0 warnings, 0 section mismatches

--------------------------------------------------------------------------------
iop32x_defconfig (arm, gcc-10) — PASS, 0 errors, 0 warnings, 0 section mismatches

--------------------------------------------------------------------------------
iop33x_defconfig (arm, gcc-10) — PASS, 0 errors, 0 warnings, 0 section mismatches

--------------------------------------------------------------------------------
ip22_defconfig (mips, gcc-10) — PASS, 0 errors, 1 warning, 0 section mismatches

Warnings:
drivers/net/ethernet/seeq/sgiseeq.c:804:26: warning: passing argument 5 of ‘dma_free_attrs’ makes pointer from integer without a cast [-Wint-conversion]

--------------------------------------------------------------------------------
ip28_defconfig (mips, gcc-10) — FAIL, 0 errors, 0 warnings, 0 section mismatches

--------------------------------------------------------------------------------
ip32_defconfig (mips, gcc-10) — PASS, 0 errors, 0 warnings, 0 section mismatches

--------------------------------------------------------------------------------
ixp4xx_defconfig (arm, gcc-10) — PASS, 0 errors, 0 warnings, 0 section mismatches

--------------------------------------------------------------------------------
jazz_defconfig (mips, gcc-10) — PASS, 0 errors, 0 warnings, 0 section mismatches

--------------------------------------------------------------------------------
jmr3927_defconfig (mips, gcc-10) — PASS, 0 errors, 0 warnings, 0 section mismatches

--------------------------------------------------------------------------------
jornada720_defconfig (arm, gcc-10) — PASS, 0 errors, 0 warnings, 0 section mismatches

--------------------------------------------------------------------------------
keystone_defconfig (arm, gcc-10) — PASS, 0 errors, 0 warnings, 0 section mismatches

--------------------------------------------------------------------------------
ks8695_defconfig (arm, gcc-10) — PASS, 0 errors, 0 warnings, 0 section mismatches

--------------------------------------------------------------------------------
lart_defconfig (arm, gcc-10) — PASS, 0 errors, 0 warnings, 0 section mismatches

--------------------------------------------------------------------------------
lasat_defconfig (mips, gcc-10) — PASS, 0 errors, 0 warnings, 0 section mismatches

--------------------------------------------------------------------------------
lemote2f_defconfig (mips, gcc-10) — FAIL, 2 errors, 0 warnings, 0 section mismatches

Errors:
cc1: error: ‘-mloongson-mmi’ must be used with ‘-mhard-float’
cc1: error: ‘-mloongson-mmi’ must be used with ‘-mhard-float’

--------------------------------------------------------------------------------
loongson3_defconfig (mips, gcc-10) — PASS, 0 errors, 0 warnings, 0 section mismatches

--------------------------------------------------------------------------------
lpc18xx_defconfig (arm, gcc-10) — PASS, 0 errors, 0 warnings, 0 section mismatches

--------------------------------------------------------------------------------
lpc32xx_defconfig (arm, gcc-10) — PASS, 0 errors, 1 warning, 0 section mismatches

Warnings:
arch/arm/mach-lpc32xx/phy3250.c:215:36: warning: duplicate ‘const’ declaration specifier [-Wduplicate-decl-specifier]

--------------------------------------------------------------------------------
lpd270_defconfig (arm, gcc-10) — PASS, 0 errors, 0 warnings, 0 section mismatches

--------------------------------------------------------------------------------
ls1b_defconfig (mips, gcc-10) — PASS, 0 errors, 0 warnings, 0 section mismatches

--------------------------------------------------------------------------------
lubbock_defconfig (arm, gcc-10) — PASS, 0 errors, 0 warnings, 0 section mismatches

--------------------------------------------------------------------------------
magician_defconfig (arm, gcc-10) — PASS, 0 errors, 0 warnings, 0 section mismatches

--------------------------------------------------------------------------------
mainstone_defconfig (arm, gcc-10) — PASS, 0 errors, 0 warnings, 0 section mismatches

--------------------------------------------------------------------------------
malta_defconfig (mips, gcc-10) — PASS, 0 errors, 0 warnings, 0 section mismatches

--------------------------------------------------------------------------------
malta_kvm_defconfig (mips, gcc-10) — PASS, 0 errors, 0 warnings, 0 section mismatches

--------------------------------------------------------------------------------
malta_kvm_guest_defconfig (mips, gcc-10) — PASS, 0 errors, 0 warnings, 0 section mismatches

--------------------------------------------------------------------------------
malta_qemu_32r6_defconfig (mips, gcc-10) — PASS, 0 errors, 0 warnings, 0 section mismatches

--------------------------------------------------------------------------------
maltaaprp_defconfig (mips, gcc-10) — PASS, 0 errors, 0 warnings, 0 section mismatches

--------------------------------------------------------------------------------
maltasmvp_defconfig (mips, gcc-10) — PASS, 0 errors, 0 warnings, 0 section mismatches

--------------------------------------------------------------------------------
maltasmvp_eva_defconfig (mips, gcc-10) — PASS, 0 errors, 0 warnings, 0 section mismatches

--------------------------------------------------------------------------------
maltaup_defconfig (mips, gcc-10) — PASS, 0 errors, 0 warnings, 0 section mismatches

--------------------------------------------------------------------------------
maltaup_xpa_defconfig (mips, gcc-10) — PASS, 0 errors, 0 warnings, 0 section mismatches

--------------------------------------------------------------------------------
markeins_defconfig (mips, gcc-10) — PASS, 0 errors, 0 warnings, 0 section mismatches

--------------------------------------------------------------------------------
mini2440_defconfig (arm, gcc-10) — PASS, 0 errors, 1 warning, 0 section mismatches

Warnings:
drivers/tty/serial/samsung.c:1780:34: warning: array ‘s3c24xx_uart_dt_match’ assumed to have one element

--------------------------------------------------------------------------------
mips_paravirt_defconfig (mips, gcc-10) — PASS, 0 errors, 0 warnings, 0 section mismatches

--------------------------------------------------------------------------------
mmp2_defconfig (arm, gcc-10) — PASS, 0 errors, 0 warnings, 0 section mismatches

--------------------------------------------------------------------------------
mpc30x_defconfig (mips, gcc-10) — PASS, 0 errors, 0 warnings, 0 section mismatches

--------------------------------------------------------------------------------
msp71xx_defconfig (mips, gcc-10) — PASS, 0 errors, 0 warnings, 0 section mismatches

--------------------------------------------------------------------------------
mtx1_defconfig (mips, gcc-10) — PASS, 0 errors, 3 warnings, 0 section mismatches

Warnings:
sound/pci/echoaudio/echoaudio_dsp.c:647:9: warning: iteration 1073741824 invokes undefined behavior [-Waggressive-loop-optimizations]
sound/pci/echoaudio/echoaudio_dsp.c:658:9: warning: iteration 1073741824 invokes undefined behavior [-Waggressive-loop-optimizations]
sound/pci/echoaudio/echoaudio_dsp.c:647:9: warning: iteration 1073741824 invokes undefined behavior [-Waggressive-loop-optimizations]

--------------------------------------------------------------------------------
multi_v5_defconfig (arm, gcc-10) — PASS, 0 errors, 0 warnings, 0 section mismatches

--------------------------------------------------------------------------------
multi_v7_defconfig (arm, gcc-10) — PASS, 0 errors, 0 warnings, 0 section mismatches

--------------------------------------------------------------------------------
mv78xx0_defconfig (arm, gcc-10) — PASS, 0 errors, 0 warnings, 0 section mismatches

--------------------------------------------------------------------------------
mvebu_v5_defconfig (arm, gcc-10) — PASS, 0 errors, 0 warnings, 0 section mismatches

--------------------------------------------------------------------------------
mvebu_v7_defconfig (arm, gcc-10) — PASS, 0 errors, 0 warnings, 0 section mismatches

--------------------------------------------------------------------------------
mxs_defconfig (arm, gcc-10) — PASS, 0 errors, 1 warning, 0 section mismatches

Warnings:
arch/arm/mach-mxs/mach-mxs.c:285:26: warning: duplicate ‘const’ declaration specifier [-Wduplicate-decl-specifier]

--------------------------------------------------------------------------------
neponset_defconfig (arm, gcc-10) — PASS, 0 errors, 0 warnings, 0 section mismatches

--------------------------------------------------------------------------------
netwinder_defconfig (arm, gcc-10) — PASS, 0 errors, 0 warnings, 0 section mismatches

--------------------------------------------------------------------------------
netx_defconfig (arm, gcc-10) — PASS, 0 errors, 0 warnings, 0 section mismatches

--------------------------------------------------------------------------------
nhk8815_defconfig (arm, gcc-10) — PASS, 0 errors, 0 warnings, 0 section mismatches

--------------------------------------------------------------------------------
nlm_xlp_defconfig (mips, gcc-10) — PASS, 0 errors, 0 warnings, 0 section mismatches

--------------------------------------------------------------------------------
nlm_xlr_defconfig (mips, gcc-10) — PASS, 0 errors, 0 warnings, 0 section mismatches

--------------------------------------------------------------------------------
nsim_hs_defconfig (arc, gcc-10) — PASS, 0 errors, 0 warnings, 0 section mismatches

--------------------------------------------------------------------------------
nsim_hs_smp_defconfig (arc, gcc-10) — PASS, 0 errors, 0 warnings, 0 section mismatches

--------------------------------------------------------------------------------
nsimosci_hs_defconfig (arc, gcc-10) — PASS, 0 errors, 0 warnings, 0 section mismatches

--------------------------------------------------------------------------------
nsimosci_hs_smp_defconfig (arc, gcc-10) — PASS, 0 errors, 0 warnings, 0 section mismatches

--------------------------------------------------------------------------------
nuc910_defconfig (arm, gcc-10) — PASS, 0 errors, 0 warnings, 0 section mismatches

--------------------------------------------------------------------------------
nuc950_defconfig (arm, gcc-10) — PASS, 0 errors, 0 warnings, 0 section mismatches

--------------------------------------------------------------------------------
omap1_defconfig (arm, gcc-10) — PASS, 0 errors, 1 warning, 0 section mismatches

Warnings:
drivers/gpio/gpio-omap.c:1161:34: warning: array ‘omap_gpio_match’ assumed to have one element

--------------------------------------------------------------------------------
omap2plus_defconfig (arm, gcc-10) — PASS, 0 errors, 1 warning, 0 section mismatches

Warnings:
drivers/cpufreq/ti-cpufreq.c:250:24: warning: passing argument 1 of ‘PTR_ERR_OR_ZERO’ makes pointer from integer without a cast [-Wint-conversion]

--------------------------------------------------------------------------------
orion5x_defconfig (arm, gcc-10) — PASS, 0 errors, 0 warnings, 0 section mismatches

--------------------------------------------------------------------------------
palmz72_defconfig (arm, gcc-10) — PASS, 0 errors, 0 warnings, 0 section mismatches

--------------------------------------------------------------------------------
pcm027_defconfig (arm, gcc-10) — PASS, 0 errors, 0 warnings, 0 section mismatches

--------------------------------------------------------------------------------
pleb_defconfig (arm, gcc-10) — PASS, 0 errors, 0 warnings, 0 section mismatches

--------------------------------------------------------------------------------
pnx8335_stb225_defconfig (mips, gcc-10) — PASS, 0 errors, 0 warnings, 0 section mismatches

--------------------------------------------------------------------------------
prima2_defconfig (arm, gcc-10) — PASS, 0 errors, 0 warnings, 0 section mismatches

--------------------------------------------------------------------------------
pxa168_defconfig (arm, gcc-10) — PASS, 0 errors, 0 warnings, 0 section mismatches

--------------------------------------------------------------------------------
pxa255-idp_defconfig (arm, gcc-10) — PASS, 0 errors, 0 warnings, 0 section mismatches

--------------------------------------------------------------------------------
pxa3xx_defconfig (arm, gcc-10) — PASS, 0 errors, 0 warnings, 0 section mismatches

--------------------------------------------------------------------------------
pxa910_defconfig (arm, gcc-10) — PASS, 0 errors, 0 warnings, 0 section mismatches

--------------------------------------------------------------------------------
qcom_defconfig (arm, gcc-10) — PASS, 0 errors, 0 warnings, 0 section mismatches

--------------------------------------------------------------------------------
qi_lb60_defconfig (mips, gcc-10) — PASS, 0 errors, 0 warnings, 0 section mismatches

--------------------------------------------------------------------------------
raumfeld_defconfig (arm, gcc-10) — PASS, 0 errors, 0 warnings, 0 section mismatches

--------------------------------------------------------------------------------
rb532_defconfig (mips, gcc-10) — PASS, 0 errors, 0 warnings, 0 section mismatches

--------------------------------------------------------------------------------
rbtx49xx_defconfig (mips, gcc-10) — PASS, 0 errors, 0 warnings, 0 section mismatches

--------------------------------------------------------------------------------
realview-smp_defconfig (arm, gcc-10) — PASS, 0 errors, 0 warnings, 0 section mismatches

--------------------------------------------------------------------------------
realview_defconfig (arm, gcc-10) — PASS, 0 errors, 0 warnings, 0 section mismatches

--------------------------------------------------------------------------------
rm200_defconfig (mips, gcc-10) — PASS, 0 errors, 0 warnings, 0 section mismatches

--------------------------------------------------------------------------------
rpc_defconfig (arm, gcc-10) — FAIL, 2 errors, 0 warnings, 0 section mismatches

Errors:
arm-linux-gnueabihf-gcc: error: unrecognized -march target: armv3
arm-linux-gnueabihf-gcc: error: missing argument to ‘-march=’

--------------------------------------------------------------------------------
rt305x_defconfig (mips, gcc-10) — PASS, 0 errors, 0 warnings, 0 section mismatches

--------------------------------------------------------------------------------
s3c2410_defconfig (arm, gcc-10) — PASS, 0 errors, 1 warning, 0 section mismatches

Warnings:
drivers/tty/serial/samsung.c:1780:34: warning: array ‘s3c24xx_uart_dt_match’ assumed to have one element

--------------------------------------------------------------------------------
s3c6400_defconfig (arm, gcc-10) — PASS, 0 errors, 2 warnings, 0 section mismatches

Warnings:
drivers/mmc/host/sdhci-s3c.c:429:34: warning: array ‘sdhci_s3c_dt_match’ assumed to have one element
drivers/tty/serial/samsung.c:1780:34: warning: array ‘s3c24xx_uart_dt_match’ assumed to have one element

--------------------------------------------------------------------------------
s5pv210_defconfig (arm, gcc-10) — PASS, 0 errors, 0 warnings, 0 section mismatches

--------------------------------------------------------------------------------
sama5_defconfig (arm, gcc-10) — PASS, 0 errors, 0 warnings, 0 section mismatches

--------------------------------------------------------------------------------
sb1250_swarm_defconfig (mips, gcc-10) — PASS, 0 errors, 0 warnings, 0 section mismatches

--------------------------------------------------------------------------------
sead3_defconfig (mips, gcc-10) — PASS, 0 errors, 0 warnings, 0 section mismatches

--------------------------------------------------------------------------------
sead3micro_defconfig (mips, gcc-10) — PASS, 0 errors, 0 warnings, 0 section mismatches

--------------------------------------------------------------------------------
shannon_defconfig (arm, gcc-10) — PASS, 0 errors, 0 warnings, 0 section mismatches

--------------------------------------------------------------------------------
shmobile_defconfig (arm, gcc-10) — PASS, 0 errors, 0 warnings, 0 section mismatches

--------------------------------------------------------------------------------
simpad_defconfig (arm, gcc-10) — PASS, 0 errors, 0 warnings, 0 section mismatches

--------------------------------------------------------------------------------
socfpga_defconfig (arm, gcc-10) — PASS, 0 errors, 0 warnings, 0 section mismatches

--------------------------------------------------------------------------------
spear13xx_defconfig (arm, gcc-10) — PASS, 0 errors, 0 warnings, 0 section mismatches

--------------------------------------------------------------------------------
spear3xx_defconfig (arm, gcc-10) — PASS, 0 errors, 0 warnings, 0 section mismatches

--------------------------------------------------------------------------------
spear6xx_defconfig (arm, gcc-10) — PASS, 0 errors, 0 warnings, 0 section mismatches

--------------------------------------------------------------------------------
spitz_defconfig (arm, gcc-10) — PASS, 0 errors, 0 warnings, 0 section mismatches

--------------------------------------------------------------------------------
stm32_defconfig (arm, gcc-10) — PASS, 0 errors, 0 warnings, 0 section mismatches

--------------------------------------------------------------------------------
sunxi_defconfig (arm, gcc-10) — PASS, 0 errors, 0 warnings, 0 section mismatches

--------------------------------------------------------------------------------
tb0219_defconfig (mips, gcc-10) — PASS, 0 errors, 0 warnings, 0 section mismatches

--------------------------------------------------------------------------------
tb0226_defconfig (mips, gcc-10) — PASS, 0 errors, 0 warnings, 0 section mismatches

--------------------------------------------------------------------------------
tb0287_defconfig (mips, gcc-10) — PASS, 0 errors, 0 warnings, 0 section mismatches

--------------------------------------------------------------------------------
tct_hammer_defconfig (arm, gcc-10) — PASS, 0 errors, 0 warnings, 0 section mismatches

--------------------------------------------------------------------------------
tegra_defconfig (arm, gcc-10) — PASS, 0 errors, 0 warnings, 0 section mismatches

--------------------------------------------------------------------------------
tinyconfig (i386, gcc-10) — PASS, 0 errors, 0 warnings, 0 section mismatches

--------------------------------------------------------------------------------
tinyconfig (x86_64, gcc-10) — PASS, 0 errors, 3 warnings, 0 section mismatches

Warnings:
arch/x86/entry/entry_64.S:487: Warning: no instruction mnemonic suffix given and no register operands; using default for `btr'
arch/x86/entry/entry_64.S:1642: Warning: no instruction mnemonic suffix given and no register operands; using default for `sysret'
arch/x86/kernel/process.c:456: Warning: no instruction mnemonic suffix given and no register operands; using default for `btr'

--------------------------------------------------------------------------------
tinyconfig (arm, gcc-10) — PASS, 0 errors, 0 warnings, 0 section mismatches

--------------------------------------------------------------------------------
tinyconfig (mips, gcc-10) — PASS, 0 errors, 0 warnings, 0 section mismatches

--------------------------------------------------------------------------------
tinyconfig (arc, gcc-10) — PASS, 0 errors, 0 warnings, 0 section mismatches

--------------------------------------------------------------------------------
trizeps4_defconfig (arm, gcc-10) — PASS, 0 errors, 0 warnings, 0 section mismatches

--------------------------------------------------------------------------------
u300_defconfig (arm, gcc-10) — PASS, 0 errors, 0 warnings, 0 section mismatches

--------------------------------------------------------------------------------
u8500_defconfig (arm, gcc-10) — PASS, 0 errors, 0 warnings, 0 section mismatches

--------------------------------------------------------------------------------
vdk_hs38_defconfig (arc, gcc-10) — PASS, 0 errors, 0 warnings, 0 section mismatches

--------------------------------------------------------------------------------
versatile_defconfig (arm, gcc-10) — PASS, 0 errors, 0 warnings, 0 section mismatches

--------------------------------------------------------------------------------
vexpress_defconfig (arm, gcc-10) — PASS, 0 errors, 0 warnings, 0 section mismatches

--------------------------------------------------------------------------------
viper_defconfig (arm, gcc-10) — PASS, 0 errors, 0 warnings, 0 section mismatches

--------------------------------------------------------------------------------
vt8500_v6_v7_defconfig (arm, gcc-10) — PASS, 0 errors, 0 warnings, 0 section mismatches

--------------------------------------------------------------------------------
workpad_defconfig (mips, gcc-10) — PASS, 0 errors, 0 warnings, 0 section mismatches

--------------------------------------------------------------------------------
x86_64_defconfig (x86_64, gcc-10) — PASS, 0 errors, 6 warnings, 0 section mismatches

Warnings:
arch/x86/entry/entry_64.S:487: Warning: no instruction mnemonic suffix given and no register operands; using default for `btr'
arch/x86/entry/entry_64.S:1642: Warning: no instruction mnemonic suffix given and no register operands; using default for `sysret'
arch/x86/kernel/process.c:456: Warning: no instruction mnemonic suffix given and no register operands; using default for `btr'
arch/x86/kernel/process.c:456: Warning: no instruction mnemonic suffix given and no register operands; using default for `btr'
ld: arch/x86/boot/compressed/head_64.o: warning: relocation in read-only section `.head.text'
ld: warning: creating DT_TEXTREL in a PIE

--------------------------------------------------------------------------------
x86_64_defconfig+x86-chromebook (x86_64, gcc-10) — PASS, 0 errors, 6 warnings, 0 section mismatches

Warnings:
arch/x86/entry/entry_64.S:487: Warning: no instruction mnemonic suffix given and no register operands; using default for `btr'
arch/x86/entry/entry_64.S:1642: Warning: no instruction mnemonic suffix given and no register operands; using default for `sysret'
arch/x86/kernel/process.c:456: Warning: no instruction mnemonic suffix given and no register operands; using default for `btr'
arch/x86/kernel/process.c:456: Warning: no instruction mnemonic suffix given and no register operands; using default for `btr'
ld: arch/x86/boot/compressed/head_64.o: warning: relocation in read-only section `.head.text'
ld: warning: creating DT_TEXTREL in a PIE

--------------------------------------------------------------------------------
xcep_defconfig (arm, gcc-10) — PASS, 0 errors, 0 warnings, 0 section mismatches

--------------------------------------------------------------------------------
xilfpga_defconfig (mips, gcc-10) — PASS, 0 errors, 0 warnings, 0 section mismatches

--------------------------------------------------------------------------------
zeus_defconfig (arm, gcc-10) — PASS, 0 errors, 0 warnings, 0 section mismatches

--------------------------------------------------------------------------------
zx_defconfig (arm, gcc-10) — PASS, 0 errors, 0 warnings, 0 section mismatches

---
For more info write to <info@...>


cip-gitlab/ci/iwamatsu/linux-5.10.y-cip-rc kselftest-seccomp: 5 runs, 1 regressions (v5.10.125-cip10-120-gf70f522cb972) #kernelci

kernelci.org bot <bot@...>
 

cip-gitlab/ci/iwamatsu/linux-5.10.y-cip-rc kselftest-seccomp: 5 runs, 1 regressions (v5.10.125-cip10-120-gf70f522cb972)

Regressions Summary
-------------------

platform | arch | lab | compiler | defconfig | regressions
-----------------------------+-------+--------------+----------+---------------------+------------
meson-gxl-s905x-libretech-cc | arm64 | lab-baylibre | gcc-10 | defconfig+kselftest | 1

Details: https://kernelci.org/test/job/cip-gitlab/branch/ci%2Fiwamatsu%2Flinux-5.10.y-cip-rc/kernel/v5.10.125-cip10-120-gf70f522cb972/plan/kselftest-seccomp/

Test: kselftest-seccomp
Tree: cip-gitlab
Branch: ci/iwamatsu/linux-5.10.y-cip-rc
Describe: v5.10.125-cip10-120-gf70f522cb972
URL: https://gitlab.com/cip-project/cip-kernel/linux-cip.git
SHA: f70f522cb9729264739dd5a10a8e68d86241981f


Test Regressions
----------------


platform | arch | lab | compiler | defconfig | regressions
-----------------------------+-------+--------------+----------+---------------------+------------
meson-gxl-s905x-libretech-cc | arm64 | lab-baylibre | gcc-10 | defconfig+kselftest | 1

Details: https://kernelci.org/test/plan/id/62c3aaef641d6b956ba39bd6

Results: 0 PASS, 1 FAIL, 0 SKIP
Full config: defconfig+kselftest
Compiler: gcc-10 (aarch64-linux-gnu-gcc (Debian 10.2.1-6) 10.2.1 20210110)
Plain log: https://storage.kernelci.org//cip-gitlab/ci-iwamatsu-linux-5.10.y-cip-rc/v5.10.125-cip10-120-gf70f522cb972/arm64/defconfig+kselftest/gcc-10/lab-baylibre/kselftest-seccomp-meson-gxl-s905x-libretech-cc.txt
HTML log: https://storage.kernelci.org//cip-gitlab/ci-iwamatsu-linux-5.10.y-cip-rc/v5.10.125-cip10-120-gf70f522cb972/arm64/defconfig+kselftest/gcc-10/lab-baylibre/kselftest-seccomp-meson-gxl-s905x-libretech-cc.html
Rootfs: http://storage.kernelci.org/images/rootfs/debian/bullseye-kselftest/20220624.0/arm64/initrd.cpio.gz


* kselftest-seccomp.login: https://kernelci.org/test/case/id/62c3aaef641d6b956ba39bd7
failing since 7 days (last pass: v5.10.118-465-g0af29783a3c9, first fail: v5.10.121-cip9-287-ge9094c8446fc)


cip-gitlab/ci/iwamatsu/linux-5.10.y-cip-rc kselftest-lkdtm: 4 runs, 2 regressions (v5.10.125-cip10-120-gf70f522cb972) #kernelci

kernelci.org bot <bot@...>
 

cip-gitlab/ci/iwamatsu/linux-5.10.y-cip-rc kselftest-lkdtm: 4 runs, 2 regressions (v5.10.125-cip10-120-gf70f522cb972)

Regressions Summary
-------------------

platform | arch | lab | compiler | defconfig | regressions
--------------------------+--------+---------------+----------+------------------------------+------------
asus-C433TA-AJ0005-rammus | x86_64 | lab-collabora | gcc-10 | x86_64_defcon...ok+kselftest | 1
hp-11A-G6-EE-grunt | x86_64 | lab-collabora | gcc-10 | x86_64_defcon...ok+kselftest | 1

Details: https://kernelci.org/test/job/cip-gitlab/branch/ci%2Fiwamatsu%2Flinux-5.10.y-cip-rc/kernel/v5.10.125-cip10-120-gf70f522cb972/plan/kselftest-lkdtm/

Test: kselftest-lkdtm
Tree: cip-gitlab
Branch: ci/iwamatsu/linux-5.10.y-cip-rc
Describe: v5.10.125-cip10-120-gf70f522cb972
URL: https://gitlab.com/cip-project/cip-kernel/linux-cip.git
SHA: f70f522cb9729264739dd5a10a8e68d86241981f


Test Regressions
----------------


platform | arch | lab | compiler | defconfig | regressions
--------------------------+--------+---------------+----------+------------------------------+------------
asus-C433TA-AJ0005-rammus | x86_64 | lab-collabora | gcc-10 | x86_64_defcon...ok+kselftest | 1

Details: https://kernelci.org/test/plan/id/62c3a98e467eeed2baa39c33

Results: 37 PASS, 17 FAIL, 25 SKIP
Full config: x86_64_defconfig+x86-chromebook+kselftest
Compiler: gcc-10 (gcc (Debian 10.2.1-6) 10.2.1 20210110)
Plain log: https://storage.kernelci.org//cip-gitlab/ci-iwamatsu-linux-5.10.y-cip-rc/v5.10.125-cip10-120-gf70f522cb972/x86_64/x86_64_defconfig+x86-chromebook+kselftest/gcc-10/lab-collabora/kselftest-lkdtm-asus-C433TA-AJ0005-rammus.txt
HTML log: https://storage.kernelci.org//cip-gitlab/ci-iwamatsu-linux-5.10.y-cip-rc/v5.10.125-cip10-120-gf70f522cb972/x86_64/x86_64_defconfig+x86-chromebook+kselftest/gcc-10/lab-collabora/kselftest-lkdtm-asus-C433TA-AJ0005-rammus.html
Rootfs: http://storage.kernelci.org/images/rootfs/debian/bullseye-kselftest/20220624.0/amd64/initrd.cpio.gz


* kselftest-lkdtm.lkdtm_USERCOPY_STACK_FRAME_FROM_sh: https://kernelci.org/test/case/id/62c3a98e467eeed2baa39c39
failing since 10 days (last pass: v5.10.118-465-g0af29783a3c9, first fail: v5.10.121-cip9-272-g3fb28d4c623b)



platform | arch | lab | compiler | defconfig | regressions
--------------------------+--------+---------------+----------+------------------------------+------------
hp-11A-G6-EE-grunt | x86_64 | lab-collabora | gcc-10 | x86_64_defcon...ok+kselftest | 1

Details: https://kernelci.org/test/plan/id/62c3a9770f09249fcea39c30

Results: 36 PASS, 18 FAIL, 25 SKIP
Full config: x86_64_defconfig+x86-chromebook+kselftest
Compiler: gcc-10 (gcc (Debian 10.2.1-6) 10.2.1 20210110)
Plain log: https://storage.kernelci.org//cip-gitlab/ci-iwamatsu-linux-5.10.y-cip-rc/v5.10.125-cip10-120-gf70f522cb972/x86_64/x86_64_defconfig+x86-chromebook+kselftest/gcc-10/lab-collabora/kselftest-lkdtm-hp-11A-G6-EE-grunt.txt
HTML log: https://storage.kernelci.org//cip-gitlab/ci-iwamatsu-linux-5.10.y-cip-rc/v5.10.125-cip10-120-gf70f522cb972/x86_64/x86_64_defconfig+x86-chromebook+kselftest/gcc-10/lab-collabora/kselftest-lkdtm-hp-11A-G6-EE-grunt.html
Rootfs: http://storage.kernelci.org/images/rootfs/debian/bullseye-kselftest/20220624.0/amd64/initrd.cpio.gz


* kselftest-lkdtm.lkdtm_USERCOPY_STACK_FRAME_FROM_sh: https://kernelci.org/test/case/id/62c3a9770f09249fcea39c36
failing since 10 days (last pass: v5.10.118-465-g0af29783a3c9, first fail: v5.10.121-cip9-272-g3fb28d4c623b)


cip-gitlab/ci/iwamatsu/linux-5.10.y-cip-rc kselftest-lib: 8 runs, 2 regressions (v5.10.125-cip10-120-gf70f522cb972) #kernelci

kernelci.org bot <bot@...>
 

cip-gitlab/ci/iwamatsu/linux-5.10.y-cip-rc kselftest-lib: 8 runs, 2 regressions (v5.10.125-cip10-120-gf70f522cb972)

Regressions Summary
-------------------

platform | arch | lab | compiler | defconfig | regressions
-----------------------------+-------+--------------+----------+---------------------+------------
meson-gxl-s905x-libretech-cc | arm64 | lab-baylibre | gcc-10 | defconfig+kselftest | 1
r8a774a1-hihope-rzg2m-ex | arm64 | lab-cip | gcc-10 | defconfig+kselftest | 1

Details: https://kernelci.org/test/job/cip-gitlab/branch/ci%2Fiwamatsu%2Flinux-5.10.y-cip-rc/kernel/v5.10.125-cip10-120-gf70f522cb972/plan/kselftest-lib/

Test: kselftest-lib
Tree: cip-gitlab
Branch: ci/iwamatsu/linux-5.10.y-cip-rc
Describe: v5.10.125-cip10-120-gf70f522cb972
URL: https://gitlab.com/cip-project/cip-kernel/linux-cip.git
SHA: f70f522cb9729264739dd5a10a8e68d86241981f


Test Regressions
----------------


platform | arch | lab | compiler | defconfig | regressions
-----------------------------+-------+--------------+----------+---------------------+------------
meson-gxl-s905x-libretech-cc | arm64 | lab-baylibre | gcc-10 | defconfig+kselftest | 1

Details: https://kernelci.org/test/plan/id/62c3aafa641d6b956ba39bdf

Results: 0 PASS, 1 FAIL, 0 SKIP
Full config: defconfig+kselftest
Compiler: gcc-10 (aarch64-linux-gnu-gcc (Debian 10.2.1-6) 10.2.1 20210110)
Plain log: https://storage.kernelci.org//cip-gitlab/ci-iwamatsu-linux-5.10.y-cip-rc/v5.10.125-cip10-120-gf70f522cb972/arm64/defconfig+kselftest/gcc-10/lab-baylibre/kselftest-lib-meson-gxl-s905x-libretech-cc.txt
HTML log: https://storage.kernelci.org//cip-gitlab/ci-iwamatsu-linux-5.10.y-cip-rc/v5.10.125-cip10-120-gf70f522cb972/arm64/defconfig+kselftest/gcc-10/lab-baylibre/kselftest-lib-meson-gxl-s905x-libretech-cc.html
Rootfs: http://storage.kernelci.org/images/rootfs/debian/bullseye-kselftest/20220624.0/arm64/initrd.cpio.gz


* kselftest-lib.login: https://kernelci.org/test/case/id/62c3aafa641d6b956ba39be0
new failure (last pass: v5.10.125-cip10-119-g603acbe1aceb)



platform | arch | lab | compiler | defconfig | regressions
-----------------------------+-------+--------------+----------+---------------------+------------
r8a774a1-hihope-rzg2m-ex | arm64 | lab-cip | gcc-10 | defconfig+kselftest | 1

Details: https://kernelci.org/test/plan/id/62c3ab075f34d80945a39bd8

Results: 0 PASS, 1 FAIL, 0 SKIP
Full config: defconfig+kselftest
Compiler: gcc-10 (aarch64-linux-gnu-gcc (Debian 10.2.1-6) 10.2.1 20210110)
Plain log: https://storage.kernelci.org//cip-gitlab/ci-iwamatsu-linux-5.10.y-cip-rc/v5.10.125-cip10-120-gf70f522cb972/arm64/defconfig+kselftest/gcc-10/lab-cip/kselftest-lib-r8a774a1-hihope-rzg2m-ex.txt
HTML log: https://storage.kernelci.org//cip-gitlab/ci-iwamatsu-linux-5.10.y-cip-rc/v5.10.125-cip10-120-gf70f522cb972/arm64/defconfig+kselftest/gcc-10/lab-cip/kselftest-lib-r8a774a1-hihope-rzg2m-ex.html
Rootfs: http://storage.kernelci.org/images/rootfs/debian/bullseye-kselftest/20220624.0/arm64/initrd.cpio.gz


* kselftest-lib.login: https://kernelci.org/test/case/id/62c3ab075f34d80945a39bd9
new failure (last pass: v5.10.125-cip10-119-g603acbe1aceb)


cip-gitlab/ci/iwamatsu/linux-4.19.y-cip-rc build: 181 builds: 6 failed, 175 passed, 2 errors, 29 warnings (v4.19.249-cip76-54-gb41c396e258f) #kernelci

kernelci.org bot <bot@...>
 

cip-gitlab/ci/iwamatsu/linux-4.19.y-cip-rc build: 181 builds: 6 failed, 175 passed, 2 errors, 29 warnings (v4.19.249-cip76-54-gb41c396e258f)

Full Build Summary: https://kernelci.org/build/cip-gitlab/branch/ci%2Fiwamatsu%2Flinux-4.19.y-cip-rc/kernel/v4.19.249-cip76-54-gb41c396e258f/

Tree: cip-gitlab
Branch: ci/iwamatsu/linux-4.19.y-cip-rc
Git Describe: v4.19.249-cip76-54-gb41c396e258f
Git Commit: b41c396e258f2fee2f17d7d65e4e03a629ba380b
Git URL: https://gitlab.com/cip-project/cip-kernel/linux-cip.git
Built: 7 unique architectures

Build Failures Detected:

arm:
rpc_defconfig: (gcc-10) FAIL

mips:
ip27_defconfig: (gcc-10) FAIL
ip28_defconfig: (gcc-10) FAIL

riscv:
allnoconfig: (gcc-10) FAIL
defconfig: (gcc-10) FAIL
tinyconfig: (gcc-10) FAIL

Errors and Warnings Detected:

arc:

arm64:
defconfig (gcc-10): 3 warnings
defconfig+arm64-chromebook (gcc-10): 3 warnings

arm:
omap1_defconfig (gcc-10): 1 warning
rpc_defconfig (gcc-10): 2 errors

i386:
allnoconfig (gcc-10): 2 warnings
i386_defconfig (gcc-10): 2 warnings
tinyconfig (gcc-10): 2 warnings

mips:
lemote2f_defconfig (gcc-10): 1 warning
loongson3_defconfig (gcc-10): 1 warning
malta_qemu_32r6_defconfig (gcc-10): 1 warning
nlm_xlp_defconfig (gcc-10): 1 warning

riscv:

x86_64:
allnoconfig (gcc-10): 3 warnings
tinyconfig (gcc-10): 3 warnings
x86_64_defconfig (gcc-10): 3 warnings
x86_64_defconfig+x86-chromebook (gcc-10): 3 warnings

Errors summary:

1 arm-linux-gnueabihf-gcc: error: unrecognized -march target: armv3
1 arm-linux-gnueabihf-gcc: error: missing argument to ‘-march=’

Warnings summary:

7 ld: warning: creating DT_TEXTREL in a PIE
6 aarch64-linux-gnu-ld: warning: -z norelro ignored
4 ld: arch/x86/boot/compressed/head_64.o: warning: relocation in read-only section `.head.text'
4 arch/x86/entry/entry_64.S:1738: Warning: no instruction mnemonic suffix given and no register operands; using default for `sysret'
3 ld: arch/x86/boot/compressed/head_32.o: warning: relocation in read-only section `.head.text'
2 net/core/rtnetlink.c:3199:1: warning: the frame size of 1328 bytes is larger than 1024 bytes [-Wframe-larger-than=]
1 {standard input}:132: Warning: macro instruction expanded into multiple instructions
1 net/core/rtnetlink.c:3199:1: warning: the frame size of 1344 bytes is larger than 1024 bytes [-Wframe-larger-than=]
1 drivers/gpio/gpio-omap.c:1233:34: warning: array ‘omap_gpio_match’ assumed to have one element

Section mismatches summary:

13 WARNING: modpost: Found 1 section mismatch(es).

================================================================================

Detailed per-defconfig build reports:

--------------------------------------------------------------------------------
32r2el_defconfig (mips, gcc-10) — PASS, 0 errors, 0 warnings, 0 section mismatches

--------------------------------------------------------------------------------
acs5k_defconfig (arm, gcc-10) — PASS, 0 errors, 0 warnings, 0 section mismatches

--------------------------------------------------------------------------------
acs5k_tiny_defconfig (arm, gcc-10) — PASS, 0 errors, 0 warnings, 0 section mismatches

--------------------------------------------------------------------------------
allnoconfig (i386, gcc-10) — PASS, 0 errors, 2 warnings, 0 section mismatches

Warnings:
ld: arch/x86/boot/compressed/head_32.o: warning: relocation in read-only section `.head.text'
ld: warning: creating DT_TEXTREL in a PIE

--------------------------------------------------------------------------------
allnoconfig (x86_64, gcc-10) — PASS, 0 errors, 3 warnings, 0 section mismatches

Warnings:
arch/x86/entry/entry_64.S:1738: Warning: no instruction mnemonic suffix given and no register operands; using default for `sysret'
ld: arch/x86/boot/compressed/head_64.o: warning: relocation in read-only section `.head.text'
ld: warning: creating DT_TEXTREL in a PIE

--------------------------------------------------------------------------------
allnoconfig (riscv, gcc-10) — FAIL, 0 errors, 0 warnings, 0 section mismatches

--------------------------------------------------------------------------------
allnoconfig (arc, gcc-10) — PASS, 0 errors, 0 warnings, 0 section mismatches

--------------------------------------------------------------------------------
am200epdkit_defconfig (arm, gcc-10) — PASS, 0 errors, 0 warnings, 0 section mismatches

--------------------------------------------------------------------------------
ar7_defconfig (mips, gcc-10) — PASS, 0 errors, 0 warnings, 0 section mismatches

--------------------------------------------------------------------------------
aspeed_g4_defconfig (arm, gcc-10) — PASS, 0 errors, 0 warnings, 0 section mismatches

--------------------------------------------------------------------------------
assabet_defconfig (arm, gcc-10) — PASS, 0 errors, 0 warnings, 0 section mismatches

--------------------------------------------------------------------------------
at91_dt_defconfig (arm, gcc-10) — PASS, 0 errors, 0 warnings, 0 section mismatches

--------------------------------------------------------------------------------
ath79_defconfig (mips, gcc-10) — PASS, 0 errors, 0 warnings, 0 section mismatches

--------------------------------------------------------------------------------
axm55xx_defconfig (arm, gcc-10) — PASS, 0 errors, 0 warnings, 0 section mismatches

--------------------------------------------------------------------------------
axs103_defconfig (arc, gcc-10) — PASS, 0 errors, 0 warnings, 0 section mismatches

--------------------------------------------------------------------------------
badge4_defconfig (arm, gcc-10) — PASS, 0 errors, 0 warnings, 0 section mismatches

--------------------------------------------------------------------------------
bcm2835_defconfig (arm, gcc-10) — PASS, 0 errors, 0 warnings, 0 section mismatches

--------------------------------------------------------------------------------
bcm47xx_defconfig (mips, gcc-10) — PASS, 0 errors, 0 warnings, 0 section mismatches

--------------------------------------------------------------------------------
bcm63xx_defconfig (mips, gcc-10) — PASS, 0 errors, 0 warnings, 0 section mismatches

--------------------------------------------------------------------------------
bigsur_defconfig (mips, gcc-10) — PASS, 0 errors, 0 warnings, 0 section mismatches

--------------------------------------------------------------------------------
bmips_be_defconfig (mips, gcc-10) — PASS, 0 errors, 0 warnings, 0 section mismatches

--------------------------------------------------------------------------------
bmips_stb_defconfig (mips, gcc-10) — PASS, 0 errors, 0 warnings, 0 section mismatches

--------------------------------------------------------------------------------
capcella_defconfig (mips, gcc-10) — PASS, 0 errors, 0 warnings, 0 section mismatches

--------------------------------------------------------------------------------
cavium_octeon_defconfig (mips, gcc-10) — PASS, 0 errors, 0 warnings, 0 section mismatches

--------------------------------------------------------------------------------
cerfcube_defconfig (arm, gcc-10) — PASS, 0 errors, 0 warnings, 0 section mismatches

--------------------------------------------------------------------------------
ci20_defconfig (mips, gcc-10) — PASS, 0 errors, 0 warnings, 0 section mismatches

--------------------------------------------------------------------------------
cm_x2xx_defconfig (arm, gcc-10) — PASS, 0 errors, 0 warnings, 0 section mismatches

--------------------------------------------------------------------------------
cobalt_defconfig (mips, gcc-10) — PASS, 0 errors, 0 warnings, 0 section mismatches

--------------------------------------------------------------------------------
colibri_pxa270_defconfig (arm, gcc-10) — PASS, 0 errors, 0 warnings, 0 section mismatches

--------------------------------------------------------------------------------
collie_defconfig (arm, gcc-10) — PASS, 0 errors, 0 warnings, 0 section mismatches

--------------------------------------------------------------------------------
corgi_defconfig (arm, gcc-10) — PASS, 0 errors, 0 warnings, 0 section mismatches

--------------------------------------------------------------------------------
davinci_all_defconfig (arm, gcc-10) — PASS, 0 errors, 0 warnings, 0 section mismatches

--------------------------------------------------------------------------------
db1xxx_defconfig (mips, gcc-10) — PASS, 0 errors, 0 warnings, 0 section mismatches

--------------------------------------------------------------------------------
decstation_defconfig (mips, gcc-10) — PASS, 0 errors, 0 warnings, 0 section mismatches

--------------------------------------------------------------------------------
defconfig (riscv, gcc-10) — FAIL, 0 errors, 0 warnings, 0 section mismatches

--------------------------------------------------------------------------------
defconfig (arm64, gcc-10) — PASS, 0 errors, 3 warnings, 0 section mismatches

Warnings:
aarch64-linux-gnu-ld: warning: -z norelro ignored
aarch64-linux-gnu-ld: warning: -z norelro ignored
aarch64-linux-gnu-ld: warning: -z norelro ignored

Section mismatches:
WARNING: modpost: Found 1 section mismatch(es).

--------------------------------------------------------------------------------
defconfig+arm64-chromebook (arm64, gcc-10) — PASS, 0 errors, 3 warnings, 0 section mismatches

Warnings:
aarch64-linux-gnu-ld: warning: -z norelro ignored
aarch64-linux-gnu-ld: warning: -z norelro ignored
aarch64-linux-gnu-ld: warning: -z norelro ignored

Section mismatches:
WARNING: modpost: Found 1 section mismatch(es).

--------------------------------------------------------------------------------
dove_defconfig (arm, gcc-10) — PASS, 0 errors, 0 warnings, 0 section mismatches

--------------------------------------------------------------------------------
e55_defconfig (mips, gcc-10) — PASS, 0 errors, 0 warnings, 0 section mismatches

--------------------------------------------------------------------------------
ebsa110_defconfig (arm, gcc-10) — PASS, 0 errors, 0 warnings, 0 section mismatches

--------------------------------------------------------------------------------
efm32_defconfig (arm, gcc-10) — PASS, 0 errors, 0 warnings, 0 section mismatches

--------------------------------------------------------------------------------
em_x270_defconfig (arm, gcc-10) — PASS, 0 errors, 0 warnings, 0 section mismatches

--------------------------------------------------------------------------------
ep93xx_defconfig (arm, gcc-10) — PASS, 0 errors, 0 warnings, 0 section mismatches

Section mismatches:
WARNING: modpost: Found 1 section mismatch(es).

--------------------------------------------------------------------------------
eseries_pxa_defconfig (arm, gcc-10) — PASS, 0 errors, 0 warnings, 0 section mismatches

--------------------------------------------------------------------------------
exynos_defconfig (arm, gcc-10) — PASS, 0 errors, 0 warnings, 0 section mismatches

--------------------------------------------------------------------------------
ezx_defconfig (arm, gcc-10) — PASS, 0 errors, 0 warnings, 0 section mismatches

--------------------------------------------------------------------------------
footbridge_defconfig (arm, gcc-10) — PASS, 0 errors, 0 warnings, 0 section mismatches

--------------------------------------------------------------------------------
fuloong2e_defconfig (mips, gcc-10) — PASS, 0 errors, 0 warnings, 0 section mismatches

--------------------------------------------------------------------------------
gcw0_defconfig (mips, gcc-10) — PASS, 0 errors, 0 warnings, 0 section mismatches

--------------------------------------------------------------------------------
gemini_defconfig (arm, gcc-10) — PASS, 0 errors, 0 warnings, 0 section mismatches

--------------------------------------------------------------------------------
gpr_defconfig (mips, gcc-10) — PASS, 0 errors, 0 warnings, 0 section mismatches

--------------------------------------------------------------------------------
h3600_defconfig (arm, gcc-10) — PASS, 0 errors, 0 warnings, 0 section mismatches

--------------------------------------------------------------------------------
h5000_defconfig (arm, gcc-10) — PASS, 0 errors, 0 warnings, 0 section mismatches

--------------------------------------------------------------------------------
hackkit_defconfig (arm, gcc-10) — PASS, 0 errors, 0 warnings, 0 section mismatches

--------------------------------------------------------------------------------
haps_hs_defconfig (arc, gcc-10) — PASS, 0 errors, 0 warnings, 0 section mismatches

--------------------------------------------------------------------------------
haps_hs_smp_defconfig (arc, gcc-10) — PASS, 0 errors, 0 warnings, 0 section mismatches

--------------------------------------------------------------------------------
hisi_defconfig (arm, gcc-10) — PASS, 0 errors, 0 warnings, 0 section mismatches

--------------------------------------------------------------------------------
hsdk_defconfig (arc, gcc-10) — PASS, 0 errors, 0 warnings, 0 section mismatches

--------------------------------------------------------------------------------
i386_defconfig (i386, gcc-10) — PASS, 0 errors, 2 warnings, 0 section mismatches

Warnings:
ld: arch/x86/boot/compressed/head_32.o: warning: relocation in read-only section `.head.text'
ld: warning: creating DT_TEXTREL in a PIE

--------------------------------------------------------------------------------
imote2_defconfig (arm, gcc-10) — PASS, 0 errors, 0 warnings, 0 section mismatches

--------------------------------------------------------------------------------
imx_v4_v5_defconfig (arm, gcc-10) — PASS, 0 errors, 0 warnings, 0 section mismatches

--------------------------------------------------------------------------------
imx_v6_v7_defconfig (arm, gcc-10) — PASS, 0 errors, 0 warnings, 0 section mismatches

--------------------------------------------------------------------------------
integrator_defconfig (arm, gcc-10) — PASS, 0 errors, 0 warnings, 0 section mismatches

Section mismatches:
WARNING: modpost: Found 1 section mismatch(es).

--------------------------------------------------------------------------------
iop13xx_defconfig (arm, gcc-10) — PASS, 0 errors, 0 warnings, 0 section mismatches

--------------------------------------------------------------------------------
iop32x_defconfig (arm, gcc-10) — PASS, 0 errors, 0 warnings, 0 section mismatches

--------------------------------------------------------------------------------
iop33x_defconfig (arm, gcc-10) — PASS, 0 errors, 0 warnings, 0 section mismatches

--------------------------------------------------------------------------------
ip22_defconfig (mips, gcc-10) — PASS, 0 errors, 0 warnings, 0 section mismatches

--------------------------------------------------------------------------------
ip27_defconfig (mips, gcc-10) — FAIL, 0 errors, 0 warnings, 0 section mismatches

--------------------------------------------------------------------------------
ip28_defconfig (mips, gcc-10) — FAIL, 0 errors, 0 warnings, 0 section mismatches

--------------------------------------------------------------------------------
ip32_defconfig (mips, gcc-10) — PASS, 0 errors, 0 warnings, 0 section mismatches

--------------------------------------------------------------------------------
ixp4xx_defconfig (arm, gcc-10) — PASS, 0 errors, 0 warnings, 0 section mismatches

--------------------------------------------------------------------------------
jmr3927_defconfig (mips, gcc-10) — PASS, 0 errors, 0 warnings, 0 section mismatches

--------------------------------------------------------------------------------
jornada720_defconfig (arm, gcc-10) — PASS, 0 errors, 0 warnings, 0 section mismatches

--------------------------------------------------------------------------------
keystone_defconfig (arm, gcc-10) — PASS, 0 errors, 0 warnings, 0 section mismatches

--------------------------------------------------------------------------------
ks8695_defconfig (arm, gcc-10) — PASS, 0 errors, 0 warnings, 0 section mismatches

--------------------------------------------------------------------------------
lart_defconfig (arm, gcc-10) — PASS, 0 errors, 0 warnings, 0 section mismatches

--------------------------------------------------------------------------------
lasat_defconfig (mips, gcc-10) — PASS, 0 errors, 0 warnings, 0 section mismatches

--------------------------------------------------------------------------------
lemote2f_defconfig (mips, gcc-10) — PASS, 0 errors, 1 warning, 0 section mismatches

Warnings:
net/core/rtnetlink.c:3199:1: warning: the frame size of 1328 bytes is larger than 1024 bytes [-Wframe-larger-than=]

--------------------------------------------------------------------------------
loongson1b_defconfig (mips, gcc-10) — PASS, 0 errors, 0 warnings, 0 section mismatches

--------------------------------------------------------------------------------
loongson3_defconfig (mips, gcc-10) — PASS, 0 errors, 1 warning, 0 section mismatches

Warnings:
net/core/rtnetlink.c:3199:1: warning: the frame size of 1328 bytes is larger than 1024 bytes [-Wframe-larger-than=]

--------------------------------------------------------------------------------
lpc18xx_defconfig (arm, gcc-10) — PASS, 0 errors, 0 warnings, 0 section mismatches

--------------------------------------------------------------------------------
lpc32xx_defconfig (arm, gcc-10) — PASS, 0 errors, 0 warnings, 0 section mismatches

--------------------------------------------------------------------------------
lpd270_defconfig (arm, gcc-10) — PASS, 0 errors, 0 warnings, 0 section mismatches

--------------------------------------------------------------------------------
lubbock_defconfig (arm, gcc-10) — PASS, 0 errors, 0 warnings, 0 section mismatches

--------------------------------------------------------------------------------
magician_defconfig (arm, gcc-10) — PASS, 0 errors, 0 warnings, 0 section mismatches

--------------------------------------------------------------------------------
mainstone_defconfig (arm, gcc-10) — PASS, 0 errors, 0 warnings, 0 section mismatches

--------------------------------------------------------------------------------
malta_defconfig (mips, gcc-10) — PASS, 0 errors, 0 warnings, 0 section mismatches

--------------------------------------------------------------------------------
malta_kvm_guest_defconfig (mips, gcc-10) — PASS, 0 errors, 0 warnings, 0 section mismatches

--------------------------------------------------------------------------------
malta_qemu_32r6_defconfig (mips, gcc-10) — PASS, 0 errors, 1 warning, 0 section mismatches

Warnings:
{standard input}:132: Warning: macro instruction expanded into multiple instructions

--------------------------------------------------------------------------------
maltaaprp_defconfig (mips, gcc-10) — PASS, 0 errors, 0 warnings, 0 section mismatches

--------------------------------------------------------------------------------
maltasmvp_defconfig (mips, gcc-10) — PASS, 0 errors, 0 warnings, 0 section mismatches

--------------------------------------------------------------------------------
maltasmvp_eva_defconfig (mips, gcc-10) — PASS, 0 errors, 0 warnings, 0 section mismatches

--------------------------------------------------------------------------------
maltaup_defconfig (mips, gcc-10) — PASS, 0 errors, 0 warnings, 0 section mismatches

--------------------------------------------------------------------------------
maltaup_xpa_defconfig (mips, gcc-10) — PASS, 0 errors, 0 warnings, 0 section mismatches

--------------------------------------------------------------------------------
markeins_defconfig (mips, gcc-10) — PASS, 0 errors, 0 warnings, 0 section mismatches

--------------------------------------------------------------------------------
mini2440_defconfig (arm, gcc-10) — PASS, 0 errors, 0 warnings, 0 section mismatches

--------------------------------------------------------------------------------
mips_paravirt_defconfig (mips, gcc-10) — PASS, 0 errors, 0 warnings, 0 section mismatches

--------------------------------------------------------------------------------
moxart_defconfig (arm, gcc-10) — PASS, 0 errors, 0 warnings, 0 section mismatches

--------------------------------------------------------------------------------
mpc30x_defconfig (mips, gcc-10) — PASS, 0 errors, 0 warnings, 0 section mismatches

--------------------------------------------------------------------------------
mps2_defconfig (arm, gcc-10) — PASS, 0 errors, 0 warnings, 0 section mismatches

--------------------------------------------------------------------------------
msp71xx_defconfig (mips, gcc-10) — PASS, 0 errors, 0 warnings, 0 section mismatches

--------------------------------------------------------------------------------
multi_v4t_defconfig (arm, gcc-10) — PASS, 0 errors, 0 warnings, 0 section mismatches

--------------------------------------------------------------------------------
multi_v5_defconfig (arm, gcc-10) — PASS, 0 errors, 0 warnings, 0 section mismatches

Section mismatches:
WARNING: modpost: Found 1 section mismatch(es).

--------------------------------------------------------------------------------
multi_v7_defconfig (arm, gcc-10) — PASS, 0 errors, 0 warnings, 0 section mismatches

--------------------------------------------------------------------------------
mvebu_v5_defconfig (arm, gcc-10) — PASS, 0 errors, 0 warnings, 0 section mismatches

--------------------------------------------------------------------------------
mvebu_v7_defconfig (arm, gcc-10) — PASS, 0 errors, 0 warnings, 0 section mismatches

--------------------------------------------------------------------------------
mxs_defconfig (arm, gcc-10) — PASS, 0 errors, 0 warnings, 0 section mismatches

--------------------------------------------------------------------------------
neponset_defconfig (arm, gcc-10) — PASS, 0 errors, 0 warnings, 0 section mismatches

--------------------------------------------------------------------------------
netwinder_defconfig (arm, gcc-10) — PASS, 0 errors, 0 warnings, 0 section mismatches

--------------------------------------------------------------------------------
netx_defconfig (arm, gcc-10) — PASS, 0 errors, 0 warnings, 0 section mismatches

Section mismatches:
WARNING: modpost: Found 1 section mismatch(es).

--------------------------------------------------------------------------------
nhk8815_defconfig (arm, gcc-10) — PASS, 0 errors, 0 warnings, 0 section mismatches

Section mismatches:
WARNING: modpost: Found 1 section mismatch(es).

--------------------------------------------------------------------------------
nlm_xlp_defconfig (mips, gcc-10) — PASS, 0 errors, 1 warning, 0 section mismatches

Warnings:
net/core/rtnetlink.c:3199:1: warning: the frame size of 1344 bytes is larger than 1024 bytes [-Wframe-larger-than=]

--------------------------------------------------------------------------------
nlm_xlr_defconfig (mips, gcc-10) — PASS, 0 errors, 0 warnings, 0 section mismatches

--------------------------------------------------------------------------------
nsim_hs_defconfig (arc, gcc-10) — PASS, 0 errors, 0 warnings, 0 section mismatches

--------------------------------------------------------------------------------
nsim_hs_smp_defconfig (arc, gcc-10) — PASS, 0 errors, 0 warnings, 0 section mismatches

--------------------------------------------------------------------------------
nsimosci_hs_defconfig (arc, gcc-10) — PASS, 0 errors, 0 warnings, 0 section mismatches

--------------------------------------------------------------------------------
nsimosci_hs_smp_defconfig (arc, gcc-10) — PASS, 0 errors, 0 warnings, 0 section mismatches

--------------------------------------------------------------------------------
nuc910_defconfig (arm, gcc-10) — PASS, 0 errors, 0 warnings, 0 section mismatches

--------------------------------------------------------------------------------
nuc950_defconfig (arm, gcc-10) — PASS, 0 errors, 0 warnings, 0 section mismatches

--------------------------------------------------------------------------------
nuc960_defconfig (arm, gcc-10) — PASS, 0 errors, 0 warnings, 0 section mismatches

--------------------------------------------------------------------------------
omap1_defconfig (arm, gcc-10) — PASS, 0 errors, 1 warning, 0 section mismatches

Warnings:
drivers/gpio/gpio-omap.c:1233:34: warning: array ‘omap_gpio_match’ assumed to have one element

--------------------------------------------------------------------------------
omap2plus_defconfig (arm, gcc-10) — PASS, 0 errors, 0 warnings, 0 section mismatches

--------------------------------------------------------------------------------
omega2p_defconfig (mips, gcc-10) — PASS, 0 errors, 0 warnings, 0 section mismatches

--------------------------------------------------------------------------------
oxnas_v6_defconfig (arm, gcc-10) — PASS, 0 errors, 0 warnings, 0 section mismatches

--------------------------------------------------------------------------------
palmz72_defconfig (arm, gcc-10) — PASS, 0 errors, 0 warnings, 0 section mismatches

--------------------------------------------------------------------------------
pic32mzda_defconfig (mips, gcc-10) — PASS, 0 errors, 0 warnings, 0 section mismatches

--------------------------------------------------------------------------------
pistachio_defconfig (mips, gcc-10) — PASS, 0 errors, 0 warnings, 0 section mismatches

--------------------------------------------------------------------------------
pnx8335_stb225_defconfig (mips, gcc-10) — PASS, 0 errors, 0 warnings, 0 section mismatches

--------------------------------------------------------------------------------
prima2_defconfig (arm, gcc-10) — PASS, 0 errors, 0 warnings, 0 section mismatches

--------------------------------------------------------------------------------
pxa168_defconfig (arm, gcc-10) — PASS, 0 errors, 0 warnings, 0 section mismatches

--------------------------------------------------------------------------------
pxa910_defconfig (arm, gcc-10) — PASS, 0 errors, 0 warnings, 0 section mismatches

--------------------------------------------------------------------------------
pxa_defconfig (arm, gcc-10) — PASS, 0 errors, 0 warnings, 0 section mismatches

--------------------------------------------------------------------------------
qcom_defconfig (arm, gcc-10) — PASS, 0 errors, 0 warnings, 0 section mismatches

--------------------------------------------------------------------------------
qi_lb60_defconfig (mips, gcc-10) — PASS, 0 errors, 0 warnings, 0 section mismatches

--------------------------------------------------------------------------------
raumfeld_defconfig (arm, gcc-10) — PASS, 0 errors, 0 warnings, 0 section mismatches

--------------------------------------------------------------------------------
rb532_defconfig (mips, gcc-10) — PASS, 0 errors, 0 warnings, 0 section mismatches

--------------------------------------------------------------------------------
rbtx49xx_defconfig (mips, gcc-10) — PASS, 0 errors, 0 warnings, 0 section mismatches

--------------------------------------------------------------------------------
rm200_defconfig (mips, gcc-10) — PASS, 0 errors, 0 warnings, 0 section mismatches

--------------------------------------------------------------------------------
rpc_defconfig (arm, gcc-10) — FAIL, 2 errors, 0 warnings, 0 section mismatches

Errors:
arm-linux-gnueabihf-gcc: error: unrecognized -march target: armv3
arm-linux-gnueabihf-gcc: error: missing argument to ‘-march=’

--------------------------------------------------------------------------------
rt305x_defconfig (mips, gcc-10) — PASS, 0 errors, 0 warnings, 0 section mismatches

--------------------------------------------------------------------------------
s3c2410_defconfig (arm, gcc-10) — PASS, 0 errors, 0 warnings, 0 section mismatches

--------------------------------------------------------------------------------
s3c6400_defconfig (arm, gcc-10) — PASS, 0 errors, 0 warnings, 0 section mismatches

Section mismatches:
WARNING: modpost: Found 1 section mismatch(es).

--------------------------------------------------------------------------------
s5pv210_defconfig (arm, gcc-10) — PASS, 0 errors, 0 warnings, 0 section mismatches

Section mismatches:
WARNING: modpost: Found 1 section mismatch(es).

--------------------------------------------------------------------------------
sama5_defconfig (arm, gcc-10) — PASS, 0 errors, 0 warnings, 0 section mismatches

--------------------------------------------------------------------------------
sb1250_swarm_defconfig (mips, gcc-10) — PASS, 0 errors, 0 warnings, 0 section mismatches

--------------------------------------------------------------------------------
shannon_defconfig (arm, gcc-10) — PASS, 0 errors, 0 warnings, 0 section mismatches

--------------------------------------------------------------------------------
shmobile_defconfig (arm, gcc-10) — PASS, 0 errors, 0 warnings, 0 section mismatches

--------------------------------------------------------------------------------
simpad_defconfig (arm, gcc-10) — PASS, 0 errors, 0 warnings, 0 section mismatches

--------------------------------------------------------------------------------
socfpga_defconfig (arm, gcc-10) — PASS, 0 errors, 0 warnings, 0 section mismatches

--------------------------------------------------------------------------------
spear3xx_defconfig (arm, gcc-10) — PASS, 0 errors, 0 warnings, 0 section mismatches

Section mismatches:
WARNING: modpost: Found 1 section mismatch(es).

--------------------------------------------------------------------------------
spear6xx_defconfig (arm, gcc-10) — PASS, 0 errors, 0 warnings, 0 section mismatches

Section mismatches:
WARNING: modpost: Found 1 section mismatch(es).

--------------------------------------------------------------------------------
spitz_defconfig (arm, gcc-10) — PASS, 0 errors, 0 warnings, 0 section mismatches

--------------------------------------------------------------------------------
stm32_defconfig (arm, gcc-10) — PASS, 0 errors, 0 warnings, 0 section mismatches

--------------------------------------------------------------------------------
sunxi_defconfig (arm, gcc-10) — PASS, 0 errors, 0 warnings, 0 section mismatches

--------------------------------------------------------------------------------
tango4_defconfig (arm, gcc-10) — PASS, 0 errors, 0 warnings, 0 section mismatches

--------------------------------------------------------------------------------
tb0219_defconfig (mips, gcc-10) — PASS, 0 errors, 0 warnings, 0 section mismatches

--------------------------------------------------------------------------------
tb0226_defconfig (mips, gcc-10) — PASS, 0 errors, 0 warnings, 0 section mismatches

--------------------------------------------------------------------------------
tb0287_defconfig (mips, gcc-10) — PASS, 0 errors, 0 warnings, 0 section mismatches

--------------------------------------------------------------------------------
tct_hammer_defconfig (arm, gcc-10) — PASS, 0 errors, 0 warnings, 0 section mismatches

--------------------------------------------------------------------------------
tegra_defconfig (arm, gcc-10) — PASS, 0 errors, 0 warnings, 0 section mismatches

--------------------------------------------------------------------------------
tinyconfig (arc, gcc-10) — PASS, 0 errors, 0 warnings, 0 section mismatches

--------------------------------------------------------------------------------
tinyconfig (riscv, gcc-10) — FAIL, 0 errors, 0 warnings, 0 section mismatches

--------------------------------------------------------------------------------
tinyconfig (x86_64, gcc-10) — PASS, 0 errors, 3 warnings, 0 section mismatches

Warnings:
arch/x86/entry/entry_64.S:1738: Warning: no instruction mnemonic suffix given and no register operands; using default for `sysret'
ld: arch/x86/boot/compressed/head_64.o: warning: relocation in read-only section `.head.text'
ld: warning: creating DT_TEXTREL in a PIE

--------------------------------------------------------------------------------
tinyconfig (i386, gcc-10) — PASS, 0 errors, 2 warnings, 0 section mismatches

Warnings:
ld: arch/x86/boot/compressed/head_32.o: warning: relocation in read-only section `.head.text'
ld: warning: creating DT_TEXTREL in a PIE

--------------------------------------------------------------------------------
trizeps4_defconfig (arm, gcc-10) — PASS, 0 errors, 0 warnings, 0 section mismatches

--------------------------------------------------------------------------------
u300_defconfig (arm, gcc-10) — PASS, 0 errors, 0 warnings, 0 section mismatches

Section mismatches:
WARNING: modpost: Found 1 section mismatch(es).

--------------------------------------------------------------------------------
u8500_defconfig (arm, gcc-10) — PASS, 0 errors, 0 warnings, 0 section mismatches

--------------------------------------------------------------------------------
vdk_hs38_defconfig (arc, gcc-10) — PASS, 0 errors, 0 warnings, 0 section mismatches

--------------------------------------------------------------------------------
vdk_hs38_smp_defconfig (arc, gcc-10) — PASS, 0 errors, 0 warnings, 0 section mismatches

--------------------------------------------------------------------------------
versatile_defconfig (arm, gcc-10) — PASS, 0 errors, 0 warnings, 0 section mismatches

Section mismatches:
WARNING: modpost: Found 1 section mismatch(es).

--------------------------------------------------------------------------------
vexpress_defconfig (arm, gcc-10) — PASS, 0 errors, 0 warnings, 0 section mismatches

--------------------------------------------------------------------------------
vf610m4_defconfig (arm, gcc-10) — PASS, 0 errors, 0 warnings, 0 section mismatches

--------------------------------------------------------------------------------
viper_defconfig (arm, gcc-10) — PASS, 0 errors, 0 warnings, 0 section mismatches

--------------------------------------------------------------------------------
vocore2_defconfig (mips, gcc-10) — PASS, 0 errors, 0 warnings, 0 section mismatches

--------------------------------------------------------------------------------
vt8500_v6_v7_defconfig (arm, gcc-10) — PASS, 0 errors, 0 warnings, 0 section mismatches

--------------------------------------------------------------------------------
workpad_defconfig (mips, gcc-10) — PASS, 0 errors, 0 warnings, 0 section mismatches

--------------------------------------------------------------------------------
x86_64_defconfig (x86_64, gcc-10) — PASS, 0 errors, 3 warnings, 0 section mismatches

Warnings:
arch/x86/entry/entry_64.S:1738: Warning: no instruction mnemonic suffix given and no register operands; using default for `sysret'
ld: arch/x86/boot/compressed/head_64.o: warning: relocation in read-only section `.head.text'
ld: warning: creating DT_TEXTREL in a PIE

--------------------------------------------------------------------------------
x86_64_defconfig+x86-chromebook (x86_64, gcc-10) — PASS, 0 errors, 3 warnings, 0 section mismatches

Warnings:
arch/x86/entry/entry_64.S:1738: Warning: no instruction mnemonic suffix given and no register operands; using default for `sysret'
ld: arch/x86/boot/compressed/head_64.o: warning: relocation in read-only section `.head.text'
ld: warning: creating DT_TEXTREL in a PIE

--------------------------------------------------------------------------------
xcep_defconfig (arm, gcc-10) — PASS, 0 errors, 0 warnings, 0 section mismatches

--------------------------------------------------------------------------------
zeus_defconfig (arm, gcc-10) — PASS, 0 errors, 0 warnings, 0 section mismatches

--------------------------------------------------------------------------------
zx_defconfig (arm, gcc-10) — PASS, 0 errors, 0 warnings, 0 section mismatches

---
For more info write to <info@...>


cip-gitlab/ci/iwamatsu/linux-5.10.y-cip-rc baseline-nfs: 5 runs, 1 regressions (v5.10.125-cip10-120-gf70f522cb972) #kernelci

kernelci.org bot <bot@...>
 

cip-gitlab/ci/iwamatsu/linux-5.10.y-cip-rc baseline-nfs: 5 runs, 1 regressions (v5.10.125-cip10-120-gf70f522cb972)

Regressions Summary
-------------------

platform | arch | lab | compiler | defconfig | regressions
-----------+------+--------------+----------+-----------------+------------
jetson-tk1 | arm | lab-baylibre | gcc-10 | tegra_defconfig | 1

Details: https://kernelci.org/test/job/cip-gitlab/branch/ci%2Fiwamatsu%2Flinux-5.10.y-cip-rc/kernel/v5.10.125-cip10-120-gf70f522cb972/plan/baseline-nfs/

Test: baseline-nfs
Tree: cip-gitlab
Branch: ci/iwamatsu/linux-5.10.y-cip-rc
Describe: v5.10.125-cip10-120-gf70f522cb972
URL: https://gitlab.com/cip-project/cip-kernel/linux-cip.git
SHA: f70f522cb9729264739dd5a10a8e68d86241981f


Test Regressions
----------------


platform | arch | lab | compiler | defconfig | regressions
-----------+------+--------------+----------+-----------------+------------
jetson-tk1 | arm | lab-baylibre | gcc-10 | tegra_defconfig | 1

Details: https://kernelci.org/test/plan/id/62c3aec3b8ee856b6fa39bdd

Results: 0 PASS, 1 FAIL, 0 SKIP
Full config: tegra_defconfig
Compiler: gcc-10 (arm-linux-gnueabihf-gcc (Debian 10.2.1-6) 10.2.1 20210110)
Plain log: https://storage.kernelci.org//cip-gitlab/ci-iwamatsu-linux-5.10.y-cip-rc/v5.10.125-cip10-120-gf70f522cb972/arm/tegra_defconfig/gcc-10/lab-baylibre/baseline-nfs-jetson-tk1.txt
HTML log: https://storage.kernelci.org//cip-gitlab/ci-iwamatsu-linux-5.10.y-cip-rc/v5.10.125-cip10-120-gf70f522cb972/arm/tegra_defconfig/gcc-10/lab-baylibre/baseline-nfs-jetson-tk1.html
Rootfs: http://storage.kernelci.org/images/rootfs/debian/bullseye/20220624.0/armhf/initrd.cpio.gz


* baseline-nfs.login: https://kernelci.org/test/case/id/62c3aec3b8ee856b6fa39bde
failing since 35 days (last pass: v5.10.112-cip6-289-g2969e096d186, first fail: v5.10.118-465-g0af29783a3c9)

1441 - 1460 of 10124