Date   

Re: [isar-cip-core] postinst:Added lines to verify Local and Remote Multi-factor Authentication

Shreyas.Karmahe@...
 

Hi Jan,

I have created new patch that has only contain configuration for libpam-google-authenticator for Multi-Factor Authentication and kept it for review.
My apology as last time I missed out one of your comment and these patch has addressed all unnecessarily spaces and lines that included it last time.
Please review and let me know your comments

Kind Regards,
Shreyas

-----Original Message-----
From: Jan Kiszka <jan.kiszka@...>
Sent: Tuesday, July 5, 2022 3:33 PM
To: karmahe shreyas(TSIP TMIEC ODG Porting) <Shreyas.Karmahe@...>; yes@...; cip-dev@...
Cc: dinesh kumar(TSIP) <dinesh.kumar@...>; pyla venkata(TSIP TMIEC ODG Porting) <Venkata.Pyla@...>; hayashi kazuhiro(林 和宏 □SWC◯ACT) <kazuhiro3.hayashi@...>
Subject: Re: [isar-cip-core] postinst:Added lines to verify Local and Remote Multi-factor Authentication

On 04.07.22 18:51, Shreyas.Karmahe@... wrote:
Hi Jan,

I have resend the patch again by removing the commented line from postinst file from security-customizations.
The commenting line is dead code only and used for debugging purpose.
Kindly review the following resend patch

v2-0001-security-customizations-postinst-Add-configuratio.patch
Please read both of my replies and address the other one as well.

Thanks,
Jan


Kind Regards,
Shreyas
-----Original Message-----
From: Jan Kiszka <jan.kiszka@...>
Sent: Friday, July 1, 2022 5:04 PM
To: karmahe shreyas(TSIP) <Shreyas.Karmahe@...>;
yes@...; cip-dev@...
Cc: dinesh kumar(TSIP) <dinesh.kumar@...>; pyla
venkata(TSIP TMIEC ODG Porting) <Venkata.Pyla@...>;
hayashi kazuhiro(林 和宏 □SWC◯ACT) <kazuhiro3.hayashi@...>
Subject: Re: [isar-cip-core] postinst:Added lines to verify Local and
Remote Multi-factor Authentication

On 01.07.22 13:32, Jan Kiszka wrote:
On 30.06.22 13:26, Shreyas.Karmahe@... wrote:
From: Shreyas Karmahe <Shreyas.Karmahe@...>

To enable and configure PAM for Remote and Local MFA Session
Verification

Signed-off-by: Shreyas Karmahe <Shreyas.Karmahe@...>
---
.../security-customizations/files/postinst | 15 ++++++++++++++-
1 file changed, 14 insertions(+), 1 deletion(-)

diff --git a/recipes-core/security-customizations/files/postinst
b/recipes-core/security-customizations/files/postinst
index bb7d15b..843ce3c 100644
--- a/recipes-core/security-customizations/files/postinst
+++ b/recipes-core/security-customizations/files/postinst
@@ -15,7 +15,8 @@ echo "127.0.0.1 $HOSTNAME" >> /etc/hosts
PAM_PWD_FILE="/etc/pam.d/common-password"
pam_cracklib_config="password requisite pam_cracklib.so retry=3 minlen=8 maxrepeat=3 ucredit=-1 lcredit=-1 dcredit=-1 ocredit=-1 difok=3 gecoscheck=1 reject_username enforce_for_root"
if grep -c "pam_cracklib.so" "${PAM_PWD_FILE}";then
- sed -i '/pam_cracklib.so/ s/^#*/#/' "${PAM_PWD_FILE}"
+
+sed -i '/pam_cracklib.so/ s/^#*/#/' "${PAM_PWD_FILE}"
And an accidental change here?

fi
sed -i "0,/^password.*/s/^password.*/${pam_cracklib_config}\n&/" "${PAM_PWD_FILE}"

@@ -49,3 +50,15 @@ sed -i 's/admin_space_left_action =
.*/admin_space_left_action = SYSLOG/' $AUDIT

# CR2.10: Response to audit processing failures sed -i
's/disk_error_action = .*/disk_error_action = SYSLOG/'
$AUDIT_CONF_FILE
+
+# CR2.11: Enable Mutli Factor Authentication for Local and Remote
+Session SSHD_AUTH_CONFIG="/etc/pam.d/common-auth"
+google_authenticator="auth required pam_google_authenticator.so nullok"
+if grep -c "pam_google_authenticator.so" "${SSHD_AUTH_CONFIG}";then
+ sed -i '/pam_google_authenticator.so/ s/^#*/#/' "${SSHD_AUTH_CONFIG}"
+fi
+#sed -i "0,/^auth.*/s/^auth.*/${google_authenticator}\n&/" "${SSHD_AUTH_CONFIG}"
Dead code? Or forgotten to activate?

+echo "auth required pam_google_authenticator.so nullok" | tee -a "${SSHD_AUTH_CONFIG}"
+# Enable PAM configuration for Remote Session sed -i
+'s/ChallengeResponseAuthentication no/ChallengeResponseAuthentication yes/g' "${SSHD_CONFIG}"
+echo "AuthenticationMethods keyboard-interactive" | tee -a "${SSHD_CONFIG}"
Jan

--
Siemens AG, Technology
Competence Center Embedded Linux

--
Siemens AG, Technology
Competence Center Embedded Linux


Re: [isar-cip-core] security-customizations/postinst:Add configuration for MFA

Jan Kiszka
 

On 07.07.22 12:33, Shreyas.Karmahe@... wrote:
From: Shreyas Karmahe <Shreyas.Karmahe@...>

It configures libpam-google-authenticator for achieving the IEC requirement
for Multi-Factor Authentication.

Signed-off-by: Shreyas Karmahe <Shreyas.Karmahe@...>
---
recipes-core/security-customizations/files/postinst | 11 +++++++++++
1 file changed, 11 insertions(+)

diff --git a/recipes-core/security-customizations/files/postinst b/recipes-core/security-customizations/files/postinst
index 3699ba2..9ba8540 100644
--- a/recipes-core/security-customizations/files/postinst
+++ b/recipes-core/security-customizations/files/postinst
@@ -49,3 +49,14 @@ sed -i 's/admin_space_left_action = .*/admin_space_left_action = SYSLOG/' $AUDIT

# CR2.10: Response to audit processing failures
sed -i 's/disk_error_action = .*/disk_error_action = SYSLOG/' $AUDIT_CONF_FILE
+
+# CR2.11: Enable Mutli Factor Authentication for Local and Remote Session
+SSHD_AUTH_CONFIG="/etc/pam.d/common-auth"
+google_authenticator="auth required pam_google_authenticator.so nullok"
+if grep -c "pam_google_authenticator.so" "${SSHD_AUTH_CONFIG}";then
+ sed -i '/pam_google_authenticator.so/ s/^#*/#/' "${SSHD_AUTH_CONFIG}"
+fi
+echo "auth required pam_google_authenticator.so nullok" | tee -a "${SSHD_AUTH_CONFIG}"
+# Enable PAM configuration for Remote Session
+sed -i 's/ChallengeResponseAuthentication no/ChallengeResponseAuthentication yes/g' "${SSHD_CONFIG}"
+echo "AuthenticationMethods keyboard-interactive" | tee -a "${SSHD_CONFIG}"
Applied, thanks!

Jan

--
Siemens AG, Technology
Competence Center Embedded Linux


CIP IRC weekly meeting today on libera.chat

Jan Kiszka
 

Hi all,

Kindly be reminded to attend the weekly meeting through IRC to discuss
technical topics with CIP kernel today. Our channel is the following:

irc:irc.libera.chat:6667/cip

The IRC meeting is scheduled to UTC (GMT) 12:00:

https://www.timeanddate.com/worldclock/meetingdetails.html?year=2022&month=7&day=7&hour=12&min=0&sec=0&p1=224&p2=179&p3=136&p4=37&p5=241&p6=248

USWest USEast UK DE TW JP
05:00 08:00 13:00 14:00 20:00 21:00

Last meeting minutes:
https://ircbot.wl.linuxfoundation.org/meetings/cip/2022/06/cip.2022-06-30-12.01.log.html

* Action items
1. Resolve/ignore failures of KernelCI on 4.4-cip - alicefm
2. Check cip devices on kernelci old pull request - patersonc
3. Update https://wiki.linuxfoundation.org/civilinfrastructureplatform/ciptesting/cipreferencehardware - iwamatsu-san
* Kernel maintenance updates
- status 4.4 releases
* Kernel testing
* AOB
- first thoughts about next cip-kernel

Jan


cip-gitlab/ci/iwamatsu/linux-5.10.y-cip-rc smc: 10 runs, 4 regressions (v5.10.126-cip11-116-gef362fbbff528) #kernelci

kernelci.org bot <bot@...>
 

cip-gitlab/ci/iwamatsu/linux-5.10.y-cip-rc smc: 10 runs, 4 regressions (v5.10.126-cip11-116-gef362fbbff528)

Regressions Summary
-------------------

platform | arch | lab | compiler | defconfig | regressions
-----------------------------+--------+---------------+----------+------------------------------+------------
hp-x360-12b-c...4020-octopus | x86_64 | lab-collabora | gcc-10 | x86_64_defcon...6-chromebook | 2
qemu_arm64-virt-gicv3 | arm64 | lab-broonie | gcc-10 | defconfig | 1
qemu_arm64-virt-gicv3 | arm64 | lab-broonie | gcc-10 | defconfig+arm64-chromebook | 1

Details: https://kernelci.org/test/job/cip-gitlab/branch/ci%2Fiwamatsu%2Flinux-5.10.y-cip-rc/kernel/v5.10.126-cip11-116-gef362fbbff528/plan/smc/

Test: smc
Tree: cip-gitlab
Branch: ci/iwamatsu/linux-5.10.y-cip-rc
Describe: v5.10.126-cip11-116-gef362fbbff528
URL: https://gitlab.com/cip-project/cip-kernel/linux-cip.git
SHA: ef362fbbff528b6dc0695b488cfc8cde20b404e4


Test Regressions
----------------


platform | arch | lab | compiler | defconfig | regressions
-----------------------------+--------+---------------+----------+------------------------------+------------
hp-x360-12b-c...4020-octopus | x86_64 | lab-collabora | gcc-10 | x86_64_defcon...6-chromebook | 2

Details: https://kernelci.org/test/plan/id/62c676b82970b4186aa39c08

Results: 14 PASS, 2 FAIL, 0 SKIP
Full config: x86_64_defconfig+x86-chromebook
Compiler: gcc-10 (gcc (Debian 10.2.1-6) 10.2.1 20210110)
Plain log: https://storage.kernelci.org//cip-gitlab/ci-iwamatsu-linux-5.10.y-cip-rc/v5.10.126-cip11-116-gef362fbbff528/x86_64/x86_64_defconfig+x86-chromebook/gcc-10/lab-collabora/smc-hp-x360-12b-ca0010nr-n4020-octopus.txt
HTML log: https://storage.kernelci.org//cip-gitlab/ci-iwamatsu-linux-5.10.y-cip-rc/v5.10.126-cip11-116-gef362fbbff528/x86_64/x86_64_defconfig+x86-chromebook/gcc-10/lab-collabora/smc-hp-x360-12b-ca0010nr-n4020-octopus.html
Rootfs: http://storage.kernelci.org/images/rootfs/buildroot/buildroot-baseline/20220624.0/x86/rootfs.cpio.gz


* smc.CVE-2018-3639: https://kernelci.org/test/case/id/62c676b82970b4186aa39c14
failing since 2 days (last pass: v5.10.121-cip9-287-ge9094c8446fc, first fail: v5.10.125-cip10-119-g603acbe1aceb)

2022-07-07T06:01:04.964721 <8>[ 10.204828] <LAVA_SIGNAL_TESTCASE TEST_CASE_ID=CVE-2018-3639 RESULT=fail>

* smc.CVE-2018-3640: https://kernelci.org/test/case/id/62c676b82970b4186aa39c15
failing since 2 days (last pass: v5.10.121-cip9-287-ge9094c8446fc, first fail: v5.10.125-cip10-119-g603acbe1aceb)

2022-07-07T06:01:04.946634 <8>[ 10.186780] <LAVA_SIGNAL_TESTCASE TEST_CASE_ID=CVE-2018-3640 RESULT=fail>



platform | arch | lab | compiler | defconfig | regressions
-----------------------------+--------+---------------+----------+------------------------------+------------
qemu_arm64-virt-gicv3 | arm64 | lab-broonie | gcc-10 | defconfig | 1

Details: https://kernelci.org/test/plan/id/62c6787672b1398e74a39bcd

Results: 0 PASS, 1 FAIL, 0 SKIP
Full config: defconfig
Compiler: gcc-10 (aarch64-linux-gnu-gcc (Debian 10.2.1-6) 10.2.1 20210110)
Plain log: https://storage.kernelci.org//cip-gitlab/ci-iwamatsu-linux-5.10.y-cip-rc/v5.10.126-cip11-116-gef362fbbff528/arm64/defconfig/gcc-10/lab-broonie/smc-qemu_arm64-virt-gicv3.txt
HTML log: https://storage.kernelci.org//cip-gitlab/ci-iwamatsu-linux-5.10.y-cip-rc/v5.10.126-cip11-116-gef362fbbff528/arm64/defconfig/gcc-10/lab-broonie/smc-qemu_arm64-virt-gicv3.html
Rootfs: http://storage.kernelci.org/images/rootfs/buildroot/buildroot-baseline/20220624.0/arm64/rootfs.cpio.gz


* smc.login: https://kernelci.org/test/case/id/62c6787672b1398e74a39bce
failing since 58 days (last pass: v5.10.112-cip6-88-gf3397cadb2dd6, first fail: v5.10.112-cip6-218-g8253434cd56a)



platform | arch | lab | compiler | defconfig | regressions
-----------------------------+--------+---------------+----------+------------------------------+------------
qemu_arm64-virt-gicv3 | arm64 | lab-broonie | gcc-10 | defconfig+arm64-chromebook | 1

Details: https://kernelci.org/test/plan/id/62c678b26472939f5ca39bd2

Results: 0 PASS, 1 FAIL, 0 SKIP
Full config: defconfig+arm64-chromebook
Compiler: gcc-10 (aarch64-linux-gnu-gcc (Debian 10.2.1-6) 10.2.1 20210110)
Plain log: https://storage.kernelci.org//cip-gitlab/ci-iwamatsu-linux-5.10.y-cip-rc/v5.10.126-cip11-116-gef362fbbff528/arm64/defconfig+arm64-chromebook/gcc-10/lab-broonie/smc-qemu_arm64-virt-gicv3.txt
HTML log: https://storage.kernelci.org//cip-gitlab/ci-iwamatsu-linux-5.10.y-cip-rc/v5.10.126-cip11-116-gef362fbbff528/arm64/defconfig+arm64-chromebook/gcc-10/lab-broonie/smc-qemu_arm64-virt-gicv3.html
Rootfs: http://storage.kernelci.org/images/rootfs/buildroot/buildroot-baseline/20220624.0/arm64/rootfs.cpio.gz


* smc.login: https://kernelci.org/test/case/id/62c678b26472939f5ca39bd3
failing since 55 days (last pass: v5.10.112-cip6-88-gf3397cadb2dd6, first fail: v5.10.112-cip6-289-g2969e096d186)


cip-gitlab/ci/iwamatsu/linux-5.10.y-cip-rc ltp-ipc: 12 runs, 2 regressions (v5.10.126-cip11-116-gef362fbbff528) #kernelci

kernelci.org bot <bot@...>
 

cip-gitlab/ci/iwamatsu/linux-5.10.y-cip-rc ltp-ipc: 12 runs, 2 regressions (v5.10.126-cip11-116-gef362fbbff528)

Regressions Summary
-------------------

platform | arch | lab | compiler | defconfig | regressions
-------------------------+-------+---------+----------+----------------------------+------------
r8a774a1-hihope-rzg2m-ex | arm64 | lab-cip | gcc-10 | defconfig | 1
r8a774a1-hihope-rzg2m-ex | arm64 | lab-cip | gcc-10 | defconfig+arm64-chromebook | 1

Details: https://kernelci.org/test/job/cip-gitlab/branch/ci%2Fiwamatsu%2Flinux-5.10.y-cip-rc/kernel/v5.10.126-cip11-116-gef362fbbff528/plan/ltp-ipc/

Test: ltp-ipc
Tree: cip-gitlab
Branch: ci/iwamatsu/linux-5.10.y-cip-rc
Describe: v5.10.126-cip11-116-gef362fbbff528
URL: https://gitlab.com/cip-project/cip-kernel/linux-cip.git
SHA: ef362fbbff528b6dc0695b488cfc8cde20b404e4

Test suite revisions:
ltp-tests
URL: https://github.com/linux-test-project/ltp.git
SHA: e98f9465925434349d0aa6eb71e81b5464e76df4


Test Regressions
----------------


platform | arch | lab | compiler | defconfig | regressions
-------------------------+-------+---------+----------+----------------------------+------------
r8a774a1-hihope-rzg2m-ex | arm64 | lab-cip | gcc-10 | defconfig | 1

Details: https://kernelci.org/test/plan/id/62c67537f758531754a39bed

Results: 0 PASS, 1 FAIL, 0 SKIP
Full config: defconfig
Compiler: gcc-10 (aarch64-linux-gnu-gcc (Debian 10.2.1-6) 10.2.1 20210110)
Plain log: https://storage.kernelci.org//cip-gitlab/ci-iwamatsu-linux-5.10.y-cip-rc/v5.10.126-cip11-116-gef362fbbff528/arm64/defconfig/gcc-10/lab-cip/ltp-ipc-r8a774a1-hihope-rzg2m-ex.txt
HTML log: https://storage.kernelci.org//cip-gitlab/ci-iwamatsu-linux-5.10.y-cip-rc/v5.10.126-cip11-116-gef362fbbff528/arm64/defconfig/gcc-10/lab-cip/ltp-ipc-r8a774a1-hihope-rzg2m-ex.html
Rootfs: http://storage.kernelci.org/images/rootfs/debian/bullseye-ltp/20220610.0/arm64/initrd.cpio.gz


* ltp-ipc.login: https://kernelci.org/test/case/id/62c67537f758531754a39bee
new failure (last pass: v5.10.126-cip11-1-gc5218dc69ff1)



platform | arch | lab | compiler | defconfig | regressions
-------------------------+-------+---------+----------+----------------------------+------------
r8a774a1-hihope-rzg2m-ex | arm64 | lab-cip | gcc-10 | defconfig+arm64-chromebook | 1

Details: https://kernelci.org/test/plan/id/62c67fec1037195bb5a39bcd

Results: 0 PASS, 1 FAIL, 0 SKIP
Full config: defconfig+arm64-chromebook
Compiler: gcc-10 (aarch64-linux-gnu-gcc (Debian 10.2.1-6) 10.2.1 20210110)
Plain log: https://storage.kernelci.org//cip-gitlab/ci-iwamatsu-linux-5.10.y-cip-rc/v5.10.126-cip11-116-gef362fbbff528/arm64/defconfig+arm64-chromebook/gcc-10/lab-cip/ltp-ipc-r8a774a1-hihope-rzg2m-ex.txt
HTML log: https://storage.kernelci.org//cip-gitlab/ci-iwamatsu-linux-5.10.y-cip-rc/v5.10.126-cip11-116-gef362fbbff528/arm64/defconfig+arm64-chromebook/gcc-10/lab-cip/ltp-ipc-r8a774a1-hihope-rzg2m-ex.html
Rootfs: http://storage.kernelci.org/images/rootfs/debian/bullseye-ltp/20220610.0/arm64/initrd.cpio.gz


* ltp-ipc.login: https://kernelci.org/test/case/id/62c67fec1037195bb5a39bce
new failure (last pass: v5.10.126-cip11-1-gc5218dc69ff1)


cip-gitlab/ci/iwamatsu/linux-5.10.y-cip-rc kselftest-lkdtm: 7 runs, 2 regressions (v5.10.126-cip11-116-gef362fbbff528) #kernelci

kernelci.org bot <bot@...>
 

cip-gitlab/ci/iwamatsu/linux-5.10.y-cip-rc kselftest-lkdtm: 7 runs, 2 regressions (v5.10.126-cip11-116-gef362fbbff528)

Regressions Summary
-------------------

platform | arch | lab | compiler | defconfig | regressions
--------------------------+--------+---------------+----------+------------------------------+------------
asus-C433TA-AJ0005-rammus | x86_64 | lab-collabora | gcc-10 | x86_64_defcon...ok+kselftest | 1
hp-11A-G6-EE-grunt | x86_64 | lab-collabora | gcc-10 | x86_64_defcon...ok+kselftest | 1

Details: https://kernelci.org/test/job/cip-gitlab/branch/ci%2Fiwamatsu%2Flinux-5.10.y-cip-rc/kernel/v5.10.126-cip11-116-gef362fbbff528/plan/kselftest-lkdtm/

Test: kselftest-lkdtm
Tree: cip-gitlab
Branch: ci/iwamatsu/linux-5.10.y-cip-rc
Describe: v5.10.126-cip11-116-gef362fbbff528
URL: https://gitlab.com/cip-project/cip-kernel/linux-cip.git
SHA: ef362fbbff528b6dc0695b488cfc8cde20b404e4


Test Regressions
----------------


platform | arch | lab | compiler | defconfig | regressions
--------------------------+--------+---------------+----------+------------------------------+------------
asus-C433TA-AJ0005-rammus | x86_64 | lab-collabora | gcc-10 | x86_64_defcon...ok+kselftest | 1

Details: https://kernelci.org/test/plan/id/62c67340778474c121a39bd1

Results: 37 PASS, 17 FAIL, 25 SKIP
Full config: x86_64_defconfig+x86-chromebook+kselftest
Compiler: gcc-10 (gcc (Debian 10.2.1-6) 10.2.1 20210110)
Plain log: https://storage.kernelci.org//cip-gitlab/ci-iwamatsu-linux-5.10.y-cip-rc/v5.10.126-cip11-116-gef362fbbff528/x86_64/x86_64_defconfig+x86-chromebook+kselftest/gcc-10/lab-collabora/kselftest-lkdtm-asus-C433TA-AJ0005-rammus.txt
HTML log: https://storage.kernelci.org//cip-gitlab/ci-iwamatsu-linux-5.10.y-cip-rc/v5.10.126-cip11-116-gef362fbbff528/x86_64/x86_64_defconfig+x86-chromebook+kselftest/gcc-10/lab-collabora/kselftest-lkdtm-asus-C433TA-AJ0005-rammus.html
Rootfs: http://storage.kernelci.org/images/rootfs/debian/bullseye-kselftest/20220624.0/amd64/initrd.cpio.gz


* kselftest-lkdtm.lkdtm_USERCOPY_STACK_FRAME_FROM_sh: https://kernelci.org/test/case/id/62c67340778474c121a39bd7
failing since 12 days (last pass: v5.10.118-465-g0af29783a3c9, first fail: v5.10.121-cip9-272-g3fb28d4c623b)



platform | arch | lab | compiler | defconfig | regressions
--------------------------+--------+---------------+----------+------------------------------+------------
hp-11A-G6-EE-grunt | x86_64 | lab-collabora | gcc-10 | x86_64_defcon...ok+kselftest | 1

Details: https://kernelci.org/test/plan/id/62c67354c069a1ba68a39bfb

Results: 36 PASS, 18 FAIL, 25 SKIP
Full config: x86_64_defconfig+x86-chromebook+kselftest
Compiler: gcc-10 (gcc (Debian 10.2.1-6) 10.2.1 20210110)
Plain log: https://storage.kernelci.org//cip-gitlab/ci-iwamatsu-linux-5.10.y-cip-rc/v5.10.126-cip11-116-gef362fbbff528/x86_64/x86_64_defconfig+x86-chromebook+kselftest/gcc-10/lab-collabora/kselftest-lkdtm-hp-11A-G6-EE-grunt.txt
HTML log: https://storage.kernelci.org//cip-gitlab/ci-iwamatsu-linux-5.10.y-cip-rc/v5.10.126-cip11-116-gef362fbbff528/x86_64/x86_64_defconfig+x86-chromebook+kselftest/gcc-10/lab-collabora/kselftest-lkdtm-hp-11A-G6-EE-grunt.html
Rootfs: http://storage.kernelci.org/images/rootfs/debian/bullseye-kselftest/20220624.0/amd64/initrd.cpio.gz


* kselftest-lkdtm.lkdtm_USERCOPY_STACK_FRAME_FROM_sh: https://kernelci.org/test/case/id/62c67354c069a1ba68a39c2b
failing since 12 days (last pass: v5.10.118-465-g0af29783a3c9, first fail: v5.10.121-cip9-272-g3fb28d4c623b)


cip-gitlab/ci/iwamatsu/linux-5.10.y-cip-rc kselftest-lib: 12 runs, 2 regressions (v5.10.126-cip11-116-gef362fbbff528) #kernelci

kernelci.org bot <bot@...>
 

cip-gitlab/ci/iwamatsu/linux-5.10.y-cip-rc kselftest-lib: 12 runs, 2 regressions (v5.10.126-cip11-116-gef362fbbff528)

Regressions Summary
-------------------

platform | arch | lab | compiler | defconfig | regressions
-----------------------------+-------+--------------+----------+---------------------+------------
meson-g12b-odroid-n2 | arm64 | lab-baylibre | gcc-10 | defconfig+kselftest | 1
meson-gxl-s905x-libretech-cc | arm64 | lab-baylibre | gcc-10 | defconfig+kselftest | 1

Details: https://kernelci.org/test/job/cip-gitlab/branch/ci%2Fiwamatsu%2Flinux-5.10.y-cip-rc/kernel/v5.10.126-cip11-116-gef362fbbff528/plan/kselftest-lib/

Test: kselftest-lib
Tree: cip-gitlab
Branch: ci/iwamatsu/linux-5.10.y-cip-rc
Describe: v5.10.126-cip11-116-gef362fbbff528
URL: https://gitlab.com/cip-project/cip-kernel/linux-cip.git
SHA: ef362fbbff528b6dc0695b488cfc8cde20b404e4


Test Regressions
----------------


platform | arch | lab | compiler | defconfig | regressions
-----------------------------+-------+--------------+----------+---------------------+------------
meson-g12b-odroid-n2 | arm64 | lab-baylibre | gcc-10 | defconfig+kselftest | 1

Details: https://kernelci.org/test/plan/id/62c67689f1f12cc0eca39bf8

Results: 0 PASS, 1 FAIL, 0 SKIP
Full config: defconfig+kselftest
Compiler: gcc-10 (aarch64-linux-gnu-gcc (Debian 10.2.1-6) 10.2.1 20210110)
Plain log: https://storage.kernelci.org//cip-gitlab/ci-iwamatsu-linux-5.10.y-cip-rc/v5.10.126-cip11-116-gef362fbbff528/arm64/defconfig+kselftest/gcc-10/lab-baylibre/kselftest-lib-meson-g12b-odroid-n2.txt
HTML log: https://storage.kernelci.org//cip-gitlab/ci-iwamatsu-linux-5.10.y-cip-rc/v5.10.126-cip11-116-gef362fbbff528/arm64/defconfig+kselftest/gcc-10/lab-baylibre/kselftest-lib-meson-g12b-odroid-n2.html
Rootfs: http://storage.kernelci.org/images/rootfs/debian/bullseye-kselftest/20220624.0/arm64/initrd.cpio.gz


* kselftest-lib.login: https://kernelci.org/test/case/id/62c67689f1f12cc0eca39bf9
new failure (last pass: v5.10.125-cip10-119-g603acbe1aceb)



platform | arch | lab | compiler | defconfig | regressions
-----------------------------+-------+--------------+----------+---------------------+------------
meson-gxl-s905x-libretech-cc | arm64 | lab-baylibre | gcc-10 | defconfig+kselftest | 1

Details: https://kernelci.org/test/plan/id/62c67722317bb8a33da39bda

Results: 0 PASS, 1 FAIL, 0 SKIP
Full config: defconfig+kselftest
Compiler: gcc-10 (aarch64-linux-gnu-gcc (Debian 10.2.1-6) 10.2.1 20210110)
Plain log: https://storage.kernelci.org//cip-gitlab/ci-iwamatsu-linux-5.10.y-cip-rc/v5.10.126-cip11-116-gef362fbbff528/arm64/defconfig+kselftest/gcc-10/lab-baylibre/kselftest-lib-meson-gxl-s905x-libretech-cc.txt
HTML log: https://storage.kernelci.org//cip-gitlab/ci-iwamatsu-linux-5.10.y-cip-rc/v5.10.126-cip11-116-gef362fbbff528/arm64/defconfig+kselftest/gcc-10/lab-baylibre/kselftest-lib-meson-gxl-s905x-libretech-cc.html
Rootfs: http://storage.kernelci.org/images/rootfs/debian/bullseye-kselftest/20220624.0/arm64/initrd.cpio.gz


* kselftest-lib.login: https://kernelci.org/test/case/id/62c67722317bb8a33da39bdb
new failure (last pass: v5.10.126-cip11-1-gc5218dc69ff1)


cip-gitlab/ci/iwamatsu/linux-5.10.y-cip-rc kselftest-futex: 10 runs, 1 regressions (v5.10.126-cip11-116-gef362fbbff528) #kernelci

kernelci.org bot <bot@...>
 

cip-gitlab/ci/iwamatsu/linux-5.10.y-cip-rc kselftest-futex: 10 runs, 1 regressions (v5.10.126-cip11-116-gef362fbbff528)

Regressions Summary
-------------------

platform | arch | lab | compiler | defconfig | regressions
-----------------------------+-------+--------------+----------+-----------+------------
meson-gxl-s905x-libretech-cc | arm64 | lab-baylibre | gcc-10 | defconfig | 1

Details: https://kernelci.org/test/job/cip-gitlab/branch/ci%2Fiwamatsu%2Flinux-5.10.y-cip-rc/kernel/v5.10.126-cip11-116-gef362fbbff528/plan/kselftest-futex/

Test: kselftest-futex
Tree: cip-gitlab
Branch: ci/iwamatsu/linux-5.10.y-cip-rc
Describe: v5.10.126-cip11-116-gef362fbbff528
URL: https://gitlab.com/cip-project/cip-kernel/linux-cip.git
SHA: ef362fbbff528b6dc0695b488cfc8cde20b404e4


Test Regressions
----------------


platform | arch | lab | compiler | defconfig | regressions
-----------------------------+-------+--------------+----------+-----------+------------
meson-gxl-s905x-libretech-cc | arm64 | lab-baylibre | gcc-10 | defconfig | 1

Details: https://kernelci.org/test/plan/id/62c67528b6f77c25eda39c11

Results: 0 PASS, 1 FAIL, 0 SKIP
Full config: defconfig
Compiler: gcc-10 (aarch64-linux-gnu-gcc (Debian 10.2.1-6) 10.2.1 20210110)
Plain log: https://storage.kernelci.org//cip-gitlab/ci-iwamatsu-linux-5.10.y-cip-rc/v5.10.126-cip11-116-gef362fbbff528/arm64/defconfig/gcc-10/lab-baylibre/kselftest-futex-meson-gxl-s905x-libretech-cc.txt
HTML log: https://storage.kernelci.org//cip-gitlab/ci-iwamatsu-linux-5.10.y-cip-rc/v5.10.126-cip11-116-gef362fbbff528/arm64/defconfig/gcc-10/lab-baylibre/kselftest-futex-meson-gxl-s905x-libretech-cc.html
Rootfs: http://storage.kernelci.org/images/rootfs/debian/bullseye-kselftest/20220624.0/arm64/initrd.cpio.gz


* kselftest-futex.login: https://kernelci.org/test/case/id/62c67528b6f77c25eda39c12
failing since 4 days (last pass: v5.10.121-cip9-287-ge9094c8446fc, first fail: v5.10.125-cip10-118-gb03e159be974)


cip-gitlab/ci/iwamatsu/linux-5.10.y-cip-rc baseline: 144 runs, 17 regressions (v5.10.126-cip11-116-gef362fbbff528) #kernelci

kernelci.org bot <bot@...>
 

cip-gitlab/ci/iwamatsu/linux-5.10.y-cip-rc baseline: 144 runs, 17 regressions (v5.10.126-cip11-116-gef362fbbff528)

Regressions Summary
-------------------

platform | arch | lab | compiler | defconfig | regressions
---------------------------+-------+---------------+----------+----------------------------+------------
qemu_arm64-virt-gicv2 | arm64 | lab-baylibre | gcc-10 | defconfig | 1
qemu_arm64-virt-gicv2 | arm64 | lab-baylibre | gcc-10 | defconfig+arm64-chromebook | 1
qemu_arm64-virt-gicv2 | arm64 | lab-broonie | gcc-10 | defconfig | 1
qemu_arm64-virt-gicv2 | arm64 | lab-broonie | gcc-10 | defconfig+arm64-chromebook | 1
qemu_arm64-virt-gicv2-uefi | arm64 | lab-baylibre | gcc-10 | defconfig | 1
qemu_arm64-virt-gicv2-uefi | arm64 | lab-baylibre | gcc-10 | defconfig+arm64-chromebook | 1
qemu_arm64-virt-gicv2-uefi | arm64 | lab-broonie | gcc-10 | defconfig | 1
qemu_arm64-virt-gicv2-uefi | arm64 | lab-broonie | gcc-10 | defconfig+arm64-chromebook | 1
qemu_arm64-virt-gicv3 | arm64 | lab-baylibre | gcc-10 | defconfig | 1
qemu_arm64-virt-gicv3 | arm64 | lab-baylibre | gcc-10 | defconfig+arm64-chromebook | 1
qemu_arm64-virt-gicv3 | arm64 | lab-broonie | gcc-10 | defconfig | 1
qemu_arm64-virt-gicv3 | arm64 | lab-broonie | gcc-10 | defconfig+arm64-chromebook | 1
qemu_arm64-virt-gicv3-uefi | arm64 | lab-baylibre | gcc-10 | defconfig | 1
qemu_arm64-virt-gicv3-uefi | arm64 | lab-baylibre | gcc-10 | defconfig+arm64-chromebook | 1
qemu_arm64-virt-gicv3-uefi | arm64 | lab-broonie | gcc-10 | defconfig | 1
qemu_arm64-virt-gicv3-uefi | arm64 | lab-broonie | gcc-10 | defconfig+arm64-chromebook | 1
rk3399-gru-kevin | arm64 | lab-collabora | gcc-10 | defconfig+arm64-chromebook | 1

Details: https://kernelci.org/test/job/cip-gitlab/branch/ci%2Fiwamatsu%2Flinux-5.10.y-cip-rc/kernel/v5.10.126-cip11-116-gef362fbbff528/plan/baseline/

Test: baseline
Tree: cip-gitlab
Branch: ci/iwamatsu/linux-5.10.y-cip-rc
Describe: v5.10.126-cip11-116-gef362fbbff528
URL: https://gitlab.com/cip-project/cip-kernel/linux-cip.git
SHA: ef362fbbff528b6dc0695b488cfc8cde20b404e4


Test Regressions
----------------


platform | arch | lab | compiler | defconfig | regressions
---------------------------+-------+---------------+----------+----------------------------+------------
qemu_arm64-virt-gicv2 | arm64 | lab-baylibre | gcc-10 | defconfig | 1

Details: https://kernelci.org/test/plan/id/62c67567d4827e1b38a39be8

Results: 0 PASS, 1 FAIL, 0 SKIP
Full config: defconfig
Compiler: gcc-10 (aarch64-linux-gnu-gcc (Debian 10.2.1-6) 10.2.1 20210110)
Plain log: https://storage.kernelci.org//cip-gitlab/ci-iwamatsu-linux-5.10.y-cip-rc/v5.10.126-cip11-116-gef362fbbff528/arm64/defconfig/gcc-10/lab-baylibre/baseline-qemu_arm64-virt-gicv2.txt
HTML log: https://storage.kernelci.org//cip-gitlab/ci-iwamatsu-linux-5.10.y-cip-rc/v5.10.126-cip11-116-gef362fbbff528/arm64/defconfig/gcc-10/lab-baylibre/baseline-qemu_arm64-virt-gicv2.html
Rootfs: http://storage.kernelci.org/images/rootfs/buildroot/buildroot-baseline/20220624.0/arm64/rootfs.cpio.gz


* baseline.login: https://kernelci.org/test/case/id/62c67567d4827e1b38a39be9
failing since 58 days (last pass: v5.10.112-cip6-88-gf3397cadb2dd6, first fail: v5.10.112-cip6-218-g8253434cd56a)



platform | arch | lab | compiler | defconfig | regressions
---------------------------+-------+---------------+----------+----------------------------+------------
qemu_arm64-virt-gicv2 | arm64 | lab-baylibre | gcc-10 | defconfig+arm64-chromebook | 1

Details: https://kernelci.org/test/plan/id/62c6757904129274e3a39bdb

Results: 0 PASS, 1 FAIL, 0 SKIP
Full config: defconfig+arm64-chromebook
Compiler: gcc-10 (aarch64-linux-gnu-gcc (Debian 10.2.1-6) 10.2.1 20210110)
Plain log: https://storage.kernelci.org//cip-gitlab/ci-iwamatsu-linux-5.10.y-cip-rc/v5.10.126-cip11-116-gef362fbbff528/arm64/defconfig+arm64-chromebook/gcc-10/lab-baylibre/baseline-qemu_arm64-virt-gicv2.txt
HTML log: https://storage.kernelci.org//cip-gitlab/ci-iwamatsu-linux-5.10.y-cip-rc/v5.10.126-cip11-116-gef362fbbff528/arm64/defconfig+arm64-chromebook/gcc-10/lab-baylibre/baseline-qemu_arm64-virt-gicv2.html
Rootfs: http://storage.kernelci.org/images/rootfs/buildroot/buildroot-baseline/20220624.0/arm64/rootfs.cpio.gz


* baseline.login: https://kernelci.org/test/case/id/62c6757904129274e3a39bdc
failing since 55 days (last pass: v5.10.112-cip6-88-gf3397cadb2dd6, first fail: v5.10.112-cip6-289-g2969e096d186)



platform | arch | lab | compiler | defconfig | regressions
---------------------------+-------+---------------+----------+----------------------------+------------
qemu_arm64-virt-gicv2 | arm64 | lab-broonie | gcc-10 | defconfig | 1

Details: https://kernelci.org/test/plan/id/62c6751bf5a22513f9a39bd1

Results: 0 PASS, 1 FAIL, 0 SKIP
Full config: defconfig
Compiler: gcc-10 (aarch64-linux-gnu-gcc (Debian 10.2.1-6) 10.2.1 20210110)
Plain log: https://storage.kernelci.org//cip-gitlab/ci-iwamatsu-linux-5.10.y-cip-rc/v5.10.126-cip11-116-gef362fbbff528/arm64/defconfig/gcc-10/lab-broonie/baseline-qemu_arm64-virt-gicv2.txt
HTML log: https://storage.kernelci.org//cip-gitlab/ci-iwamatsu-linux-5.10.y-cip-rc/v5.10.126-cip11-116-gef362fbbff528/arm64/defconfig/gcc-10/lab-broonie/baseline-qemu_arm64-virt-gicv2.html
Rootfs: http://storage.kernelci.org/images/rootfs/buildroot/buildroot-baseline/20220624.0/arm64/rootfs.cpio.gz


* baseline.login: https://kernelci.org/test/case/id/62c6751bf5a22513f9a39bd2
failing since 58 days (last pass: v5.10.112-cip6-88-gf3397cadb2dd6, first fail: v5.10.112-cip6-218-g8253434cd56a)



platform | arch | lab | compiler | defconfig | regressions
---------------------------+-------+---------------+----------+----------------------------+------------
qemu_arm64-virt-gicv2 | arm64 | lab-broonie | gcc-10 | defconfig+arm64-chromebook | 1

Details: https://kernelci.org/test/plan/id/62c676aa2970b4186aa39bf5

Results: 0 PASS, 1 FAIL, 0 SKIP
Full config: defconfig+arm64-chromebook
Compiler: gcc-10 (aarch64-linux-gnu-gcc (Debian 10.2.1-6) 10.2.1 20210110)
Plain log: https://storage.kernelci.org//cip-gitlab/ci-iwamatsu-linux-5.10.y-cip-rc/v5.10.126-cip11-116-gef362fbbff528/arm64/defconfig+arm64-chromebook/gcc-10/lab-broonie/baseline-qemu_arm64-virt-gicv2.txt
HTML log: https://storage.kernelci.org//cip-gitlab/ci-iwamatsu-linux-5.10.y-cip-rc/v5.10.126-cip11-116-gef362fbbff528/arm64/defconfig+arm64-chromebook/gcc-10/lab-broonie/baseline-qemu_arm64-virt-gicv2.html
Rootfs: http://storage.kernelci.org/images/rootfs/buildroot/buildroot-baseline/20220624.0/arm64/rootfs.cpio.gz


* baseline.login: https://kernelci.org/test/case/id/62c676aa2970b4186aa39bf6
failing since 55 days (last pass: v5.10.112-cip6-88-gf3397cadb2dd6, first fail: v5.10.112-cip6-289-g2969e096d186)



platform | arch | lab | compiler | defconfig | regressions
---------------------------+-------+---------------+----------+----------------------------+------------
qemu_arm64-virt-gicv2-uefi | arm64 | lab-baylibre | gcc-10 | defconfig | 1

Details: https://kernelci.org/test/plan/id/62c67566b0faa4fc2ca39be8

Results: 0 PASS, 1 FAIL, 0 SKIP
Full config: defconfig
Compiler: gcc-10 (aarch64-linux-gnu-gcc (Debian 10.2.1-6) 10.2.1 20210110)
Plain log: https://storage.kernelci.org//cip-gitlab/ci-iwamatsu-linux-5.10.y-cip-rc/v5.10.126-cip11-116-gef362fbbff528/arm64/defconfig/gcc-10/lab-baylibre/baseline-qemu_arm64-virt-gicv2-uefi.txt
HTML log: https://storage.kernelci.org//cip-gitlab/ci-iwamatsu-linux-5.10.y-cip-rc/v5.10.126-cip11-116-gef362fbbff528/arm64/defconfig/gcc-10/lab-baylibre/baseline-qemu_arm64-virt-gicv2-uefi.html
Rootfs: http://storage.kernelci.org/images/rootfs/buildroot/buildroot-baseline/20220624.0/arm64/rootfs.cpio.gz


* baseline.login: https://kernelci.org/test/case/id/62c67566b0faa4fc2ca39be9
failing since 58 days (last pass: v5.10.112-cip6-88-gf3397cadb2dd6, first fail: v5.10.112-cip6-218-g8253434cd56a)



platform | arch | lab | compiler | defconfig | regressions
---------------------------+-------+---------------+----------+----------------------------+------------
qemu_arm64-virt-gicv2-uefi | arm64 | lab-baylibre | gcc-10 | defconfig+arm64-chromebook | 1

Details: https://kernelci.org/test/plan/id/62c6758e9ae2c369f9a39bce

Results: 0 PASS, 1 FAIL, 0 SKIP
Full config: defconfig+arm64-chromebook
Compiler: gcc-10 (aarch64-linux-gnu-gcc (Debian 10.2.1-6) 10.2.1 20210110)
Plain log: https://storage.kernelci.org//cip-gitlab/ci-iwamatsu-linux-5.10.y-cip-rc/v5.10.126-cip11-116-gef362fbbff528/arm64/defconfig+arm64-chromebook/gcc-10/lab-baylibre/baseline-qemu_arm64-virt-gicv2-uefi.txt
HTML log: https://storage.kernelci.org//cip-gitlab/ci-iwamatsu-linux-5.10.y-cip-rc/v5.10.126-cip11-116-gef362fbbff528/arm64/defconfig+arm64-chromebook/gcc-10/lab-baylibre/baseline-qemu_arm64-virt-gicv2-uefi.html
Rootfs: http://storage.kernelci.org/images/rootfs/buildroot/buildroot-baseline/20220624.0/arm64/rootfs.cpio.gz


* baseline.login: https://kernelci.org/test/case/id/62c6758e9ae2c369f9a39bcf
failing since 55 days (last pass: v5.10.112-cip6-88-gf3397cadb2dd6, first fail: v5.10.112-cip6-289-g2969e096d186)



platform | arch | lab | compiler | defconfig | regressions
---------------------------+-------+---------------+----------+----------------------------+------------
qemu_arm64-virt-gicv2-uefi | arm64 | lab-broonie | gcc-10 | defconfig | 1

Details: https://kernelci.org/test/plan/id/62c6751af758531754a39bd7

Results: 0 PASS, 1 FAIL, 0 SKIP
Full config: defconfig
Compiler: gcc-10 (aarch64-linux-gnu-gcc (Debian 10.2.1-6) 10.2.1 20210110)
Plain log: https://storage.kernelci.org//cip-gitlab/ci-iwamatsu-linux-5.10.y-cip-rc/v5.10.126-cip11-116-gef362fbbff528/arm64/defconfig/gcc-10/lab-broonie/baseline-qemu_arm64-virt-gicv2-uefi.txt
HTML log: https://storage.kernelci.org//cip-gitlab/ci-iwamatsu-linux-5.10.y-cip-rc/v5.10.126-cip11-116-gef362fbbff528/arm64/defconfig/gcc-10/lab-broonie/baseline-qemu_arm64-virt-gicv2-uefi.html
Rootfs: http://storage.kernelci.org/images/rootfs/buildroot/buildroot-baseline/20220624.0/arm64/rootfs.cpio.gz


* baseline.login: https://kernelci.org/test/case/id/62c6751af758531754a39bd8
failing since 58 days (last pass: v5.10.112-cip6-88-gf3397cadb2dd6, first fail: v5.10.112-cip6-218-g8253434cd56a)



platform | arch | lab | compiler | defconfig | regressions
---------------------------+-------+---------------+----------+----------------------------+------------
qemu_arm64-virt-gicv2-uefi | arm64 | lab-broonie | gcc-10 | defconfig+arm64-chromebook | 1

Details: https://kernelci.org/test/plan/id/62c676d39c869832f7a39c27

Results: 0 PASS, 1 FAIL, 0 SKIP
Full config: defconfig+arm64-chromebook
Compiler: gcc-10 (aarch64-linux-gnu-gcc (Debian 10.2.1-6) 10.2.1 20210110)
Plain log: https://storage.kernelci.org//cip-gitlab/ci-iwamatsu-linux-5.10.y-cip-rc/v5.10.126-cip11-116-gef362fbbff528/arm64/defconfig+arm64-chromebook/gcc-10/lab-broonie/baseline-qemu_arm64-virt-gicv2-uefi.txt
HTML log: https://storage.kernelci.org//cip-gitlab/ci-iwamatsu-linux-5.10.y-cip-rc/v5.10.126-cip11-116-gef362fbbff528/arm64/defconfig+arm64-chromebook/gcc-10/lab-broonie/baseline-qemu_arm64-virt-gicv2-uefi.html
Rootfs: http://storage.kernelci.org/images/rootfs/buildroot/buildroot-baseline/20220624.0/arm64/rootfs.cpio.gz


* baseline.login: https://kernelci.org/test/case/id/62c676d39c869832f7a39c28
failing since 55 days (last pass: v5.10.112-cip6-88-gf3397cadb2dd6, first fail: v5.10.112-cip6-289-g2969e096d186)



platform | arch | lab | compiler | defconfig | regressions
---------------------------+-------+---------------+----------+----------------------------+------------
qemu_arm64-virt-gicv3 | arm64 | lab-baylibre | gcc-10 | defconfig | 1

Details: https://kernelci.org/test/plan/id/62c67569c8c8a212eea39bf5

Results: 0 PASS, 1 FAIL, 0 SKIP
Full config: defconfig
Compiler: gcc-10 (aarch64-linux-gnu-gcc (Debian 10.2.1-6) 10.2.1 20210110)
Plain log: https://storage.kernelci.org//cip-gitlab/ci-iwamatsu-linux-5.10.y-cip-rc/v5.10.126-cip11-116-gef362fbbff528/arm64/defconfig/gcc-10/lab-baylibre/baseline-qemu_arm64-virt-gicv3.txt
HTML log: https://storage.kernelci.org//cip-gitlab/ci-iwamatsu-linux-5.10.y-cip-rc/v5.10.126-cip11-116-gef362fbbff528/arm64/defconfig/gcc-10/lab-baylibre/baseline-qemu_arm64-virt-gicv3.html
Rootfs: http://storage.kernelci.org/images/rootfs/buildroot/buildroot-baseline/20220624.0/arm64/rootfs.cpio.gz


* baseline.login: https://kernelci.org/test/case/id/62c67569c8c8a212eea39bf6
failing since 58 days (last pass: v5.10.112-cip6-88-gf3397cadb2dd6, first fail: v5.10.112-cip6-218-g8253434cd56a)



platform | arch | lab | compiler | defconfig | regressions
---------------------------+-------+---------------+----------+----------------------------+------------
qemu_arm64-virt-gicv3 | arm64 | lab-baylibre | gcc-10 | defconfig+arm64-chromebook | 1

Details: https://kernelci.org/test/plan/id/62c6757b07f35f8f57a39bd2

Results: 0 PASS, 1 FAIL, 0 SKIP
Full config: defconfig+arm64-chromebook
Compiler: gcc-10 (aarch64-linux-gnu-gcc (Debian 10.2.1-6) 10.2.1 20210110)
Plain log: https://storage.kernelci.org//cip-gitlab/ci-iwamatsu-linux-5.10.y-cip-rc/v5.10.126-cip11-116-gef362fbbff528/arm64/defconfig+arm64-chromebook/gcc-10/lab-baylibre/baseline-qemu_arm64-virt-gicv3.txt
HTML log: https://storage.kernelci.org//cip-gitlab/ci-iwamatsu-linux-5.10.y-cip-rc/v5.10.126-cip11-116-gef362fbbff528/arm64/defconfig+arm64-chromebook/gcc-10/lab-baylibre/baseline-qemu_arm64-virt-gicv3.html
Rootfs: http://storage.kernelci.org/images/rootfs/buildroot/buildroot-baseline/20220624.0/arm64/rootfs.cpio.gz


* baseline.login: https://kernelci.org/test/case/id/62c6757b07f35f8f57a39bd3
failing since 55 days (last pass: v5.10.112-cip6-88-gf3397cadb2dd6, first fail: v5.10.112-cip6-289-g2969e096d186)



platform | arch | lab | compiler | defconfig | regressions
---------------------------+-------+---------------+----------+----------------------------+------------
qemu_arm64-virt-gicv3 | arm64 | lab-broonie | gcc-10 | defconfig | 1

Details: https://kernelci.org/test/plan/id/62c6755697e2e66b5ea39be6

Results: 0 PASS, 1 FAIL, 0 SKIP
Full config: defconfig
Compiler: gcc-10 (aarch64-linux-gnu-gcc (Debian 10.2.1-6) 10.2.1 20210110)
Plain log: https://storage.kernelci.org//cip-gitlab/ci-iwamatsu-linux-5.10.y-cip-rc/v5.10.126-cip11-116-gef362fbbff528/arm64/defconfig/gcc-10/lab-broonie/baseline-qemu_arm64-virt-gicv3.txt
HTML log: https://storage.kernelci.org//cip-gitlab/ci-iwamatsu-linux-5.10.y-cip-rc/v5.10.126-cip11-116-gef362fbbff528/arm64/defconfig/gcc-10/lab-broonie/baseline-qemu_arm64-virt-gicv3.html
Rootfs: http://storage.kernelci.org/images/rootfs/buildroot/buildroot-baseline/20220624.0/arm64/rootfs.cpio.gz


* baseline.login: https://kernelci.org/test/case/id/62c6755697e2e66b5ea39be7
failing since 58 days (last pass: v5.10.112-cip6-88-gf3397cadb2dd6, first fail: v5.10.112-cip6-218-g8253434cd56a)



platform | arch | lab | compiler | defconfig | regressions
---------------------------+-------+---------------+----------+----------------------------+------------
qemu_arm64-virt-gicv3 | arm64 | lab-broonie | gcc-10 | defconfig+arm64-chromebook | 1

Details: https://kernelci.org/test/plan/id/62c676be9c869832f7a39bf1

Results: 0 PASS, 1 FAIL, 0 SKIP
Full config: defconfig+arm64-chromebook
Compiler: gcc-10 (aarch64-linux-gnu-gcc (Debian 10.2.1-6) 10.2.1 20210110)
Plain log: https://storage.kernelci.org//cip-gitlab/ci-iwamatsu-linux-5.10.y-cip-rc/v5.10.126-cip11-116-gef362fbbff528/arm64/defconfig+arm64-chromebook/gcc-10/lab-broonie/baseline-qemu_arm64-virt-gicv3.txt
HTML log: https://storage.kernelci.org//cip-gitlab/ci-iwamatsu-linux-5.10.y-cip-rc/v5.10.126-cip11-116-gef362fbbff528/arm64/defconfig+arm64-chromebook/gcc-10/lab-broonie/baseline-qemu_arm64-virt-gicv3.html
Rootfs: http://storage.kernelci.org/images/rootfs/buildroot/buildroot-baseline/20220624.0/arm64/rootfs.cpio.gz


* baseline.login: https://kernelci.org/test/case/id/62c676be9c869832f7a39bf2
failing since 55 days (last pass: v5.10.112-cip6-88-gf3397cadb2dd6, first fail: v5.10.112-cip6-289-g2969e096d186)



platform | arch | lab | compiler | defconfig | regressions
---------------------------+-------+---------------+----------+----------------------------+------------
qemu_arm64-virt-gicv3-uefi | arm64 | lab-baylibre | gcc-10 | defconfig | 1

Details: https://kernelci.org/test/plan/id/62c6757830c4e42540a39bce

Results: 0 PASS, 1 FAIL, 0 SKIP
Full config: defconfig
Compiler: gcc-10 (aarch64-linux-gnu-gcc (Debian 10.2.1-6) 10.2.1 20210110)
Plain log: https://storage.kernelci.org//cip-gitlab/ci-iwamatsu-linux-5.10.y-cip-rc/v5.10.126-cip11-116-gef362fbbff528/arm64/defconfig/gcc-10/lab-baylibre/baseline-qemu_arm64-virt-gicv3-uefi.txt
HTML log: https://storage.kernelci.org//cip-gitlab/ci-iwamatsu-linux-5.10.y-cip-rc/v5.10.126-cip11-116-gef362fbbff528/arm64/defconfig/gcc-10/lab-baylibre/baseline-qemu_arm64-virt-gicv3-uefi.html
Rootfs: http://storage.kernelci.org/images/rootfs/buildroot/buildroot-baseline/20220624.0/arm64/rootfs.cpio.gz


* baseline.login: https://kernelci.org/test/case/id/62c6757830c4e42540a39bcf
failing since 58 days (last pass: v5.10.112-cip6-88-gf3397cadb2dd6, first fail: v5.10.112-cip6-218-g8253434cd56a)



platform | arch | lab | compiler | defconfig | regressions
---------------------------+-------+---------------+----------+----------------------------+------------
qemu_arm64-virt-gicv3-uefi | arm64 | lab-baylibre | gcc-10 | defconfig+arm64-chromebook | 1

Details: https://kernelci.org/test/plan/id/62c6758c74338ed3a3a39be2

Results: 0 PASS, 1 FAIL, 0 SKIP
Full config: defconfig+arm64-chromebook
Compiler: gcc-10 (aarch64-linux-gnu-gcc (Debian 10.2.1-6) 10.2.1 20210110)
Plain log: https://storage.kernelci.org//cip-gitlab/ci-iwamatsu-linux-5.10.y-cip-rc/v5.10.126-cip11-116-gef362fbbff528/arm64/defconfig+arm64-chromebook/gcc-10/lab-baylibre/baseline-qemu_arm64-virt-gicv3-uefi.txt
HTML log: https://storage.kernelci.org//cip-gitlab/ci-iwamatsu-linux-5.10.y-cip-rc/v5.10.126-cip11-116-gef362fbbff528/arm64/defconfig+arm64-chromebook/gcc-10/lab-baylibre/baseline-qemu_arm64-virt-gicv3-uefi.html
Rootfs: http://storage.kernelci.org/images/rootfs/buildroot/buildroot-baseline/20220624.0/arm64/rootfs.cpio.gz


* baseline.login: https://kernelci.org/test/case/id/62c6758c74338ed3a3a39be3
failing since 55 days (last pass: v5.10.112-cip6-88-gf3397cadb2dd6, first fail: v5.10.112-cip6-289-g2969e096d186)



platform | arch | lab | compiler | defconfig | regressions
---------------------------+-------+---------------+----------+----------------------------+------------
qemu_arm64-virt-gicv3-uefi | arm64 | lab-broonie | gcc-10 | defconfig | 1

Details: https://kernelci.org/test/plan/id/62c674f1d38244cb20a39bdd

Results: 0 PASS, 1 FAIL, 0 SKIP
Full config: defconfig
Compiler: gcc-10 (aarch64-linux-gnu-gcc (Debian 10.2.1-6) 10.2.1 20210110)
Plain log: https://storage.kernelci.org//cip-gitlab/ci-iwamatsu-linux-5.10.y-cip-rc/v5.10.126-cip11-116-gef362fbbff528/arm64/defconfig/gcc-10/lab-broonie/baseline-qemu_arm64-virt-gicv3-uefi.txt
HTML log: https://storage.kernelci.org//cip-gitlab/ci-iwamatsu-linux-5.10.y-cip-rc/v5.10.126-cip11-116-gef362fbbff528/arm64/defconfig/gcc-10/lab-broonie/baseline-qemu_arm64-virt-gicv3-uefi.html
Rootfs: http://storage.kernelci.org/images/rootfs/buildroot/buildroot-baseline/20220624.0/arm64/rootfs.cpio.gz


* baseline.login: https://kernelci.org/test/case/id/62c674f1d38244cb20a39bde
failing since 58 days (last pass: v5.10.112-cip6-88-gf3397cadb2dd6, first fail: v5.10.112-cip6-218-g8253434cd56a)



platform | arch | lab | compiler | defconfig | regressions
---------------------------+-------+---------------+----------+----------------------------+------------
qemu_arm64-virt-gicv3-uefi | arm64 | lab-broonie | gcc-10 | defconfig+arm64-chromebook | 1

Details: https://kernelci.org/test/plan/id/62c676d2f768ee80eba39be4

Results: 0 PASS, 1 FAIL, 0 SKIP
Full config: defconfig+arm64-chromebook
Compiler: gcc-10 (aarch64-linux-gnu-gcc (Debian 10.2.1-6) 10.2.1 20210110)
Plain log: https://storage.kernelci.org//cip-gitlab/ci-iwamatsu-linux-5.10.y-cip-rc/v5.10.126-cip11-116-gef362fbbff528/arm64/defconfig+arm64-chromebook/gcc-10/lab-broonie/baseline-qemu_arm64-virt-gicv3-uefi.txt
HTML log: https://storage.kernelci.org//cip-gitlab/ci-iwamatsu-linux-5.10.y-cip-rc/v5.10.126-cip11-116-gef362fbbff528/arm64/defconfig+arm64-chromebook/gcc-10/lab-broonie/baseline-qemu_arm64-virt-gicv3-uefi.html
Rootfs: http://storage.kernelci.org/images/rootfs/buildroot/buildroot-baseline/20220624.0/arm64/rootfs.cpio.gz


* baseline.login: https://kernelci.org/test/case/id/62c676d2f768ee80eba39be5
failing since 55 days (last pass: v5.10.112-cip6-88-gf3397cadb2dd6, first fail: v5.10.112-cip6-289-g2969e096d186)



platform | arch | lab | compiler | defconfig | regressions
---------------------------+-------+---------------+----------+----------------------------+------------
rk3399-gru-kevin | arm64 | lab-collabora | gcc-10 | defconfig+arm64-chromebook | 1

Details: https://kernelci.org/test/plan/id/62c67573894f593ec3a39bcf

Results: 90 PASS, 2 FAIL, 0 SKIP
Full config: defconfig+arm64-chromebook
Compiler: gcc-10 (aarch64-linux-gnu-gcc (Debian 10.2.1-6) 10.2.1 20210110)
Plain log: https://storage.kernelci.org//cip-gitlab/ci-iwamatsu-linux-5.10.y-cip-rc/v5.10.126-cip11-116-gef362fbbff528/arm64/defconfig+arm64-chromebook/gcc-10/lab-collabora/baseline-rk3399-gru-kevin.txt
HTML log: https://storage.kernelci.org//cip-gitlab/ci-iwamatsu-linux-5.10.y-cip-rc/v5.10.126-cip11-116-gef362fbbff528/arm64/defconfig+arm64-chromebook/gcc-10/lab-collabora/baseline-rk3399-gru-kevin.html
Rootfs: http://storage.kernelci.org/images/rootfs/buildroot/buildroot-baseline/20220624.0/arm64/rootfs.cpio.gz


* baseline.bootrr.rockchip-i2s1-probed: https://kernelci.org/test/case/id/62c67573894f593ec3a39bf1
failing since 120 days (last pass: v5.10.100-cip2-319-gcbff87047566, first fail: v5.10.100-cip2-425-g0a0d92194f39)

2022-07-07T05:55:51.925511 <8>[ 59.590012] <LAVA_SIGNAL_TESTCASE TEST_CASE_ID=rockchip-i2s0-probed RESULT=pass>
2022-07-07T05:55:52.939872 /lava-6771629/1/../bin/lava-test-case
2022-07-07T05:55:52.950879 <8>[ 60.615799] <LAVA_SIGNAL_TESTCASE TEST_CASE_ID=rockchip-i2s1-probed RESULT=fail>


cip-gitlab/ci/iwamatsu/linux-5.10.y-cip-rc baseline-nfs: 45 runs, 3 regressions (v5.10.126-cip11-116-gef362fbbff528) #kernelci

kernelci.org bot <bot@...>
 

cip-gitlab/ci/iwamatsu/linux-5.10.y-cip-rc baseline-nfs: 45 runs, 3 regressions (v5.10.126-cip11-116-gef362fbbff528)

Regressions Summary
-------------------

platform | arch | lab | compiler | defconfig | regressions
-----------------------------+-------+---------------+----------+----------------------------+------------
meson-gxl-s905x-libretech-cc | arm64 | lab-baylibre | gcc-10 | defconfig | 1
r8a77950-salvator-x | arm64 | lab-baylibre | gcc-10 | defconfig | 1
rk3399-gru-kevin | arm64 | lab-collabora | gcc-10 | defconfig+arm64-chromebook | 1

Details: https://kernelci.org/test/job/cip-gitlab/branch/ci%2Fiwamatsu%2Flinux-5.10.y-cip-rc/kernel/v5.10.126-cip11-116-gef362fbbff528/plan/baseline-nfs/

Test: baseline-nfs
Tree: cip-gitlab
Branch: ci/iwamatsu/linux-5.10.y-cip-rc
Describe: v5.10.126-cip11-116-gef362fbbff528
URL: https://gitlab.com/cip-project/cip-kernel/linux-cip.git
SHA: ef362fbbff528b6dc0695b488cfc8cde20b404e4


Test Regressions
----------------


platform | arch | lab | compiler | defconfig | regressions
-----------------------------+-------+---------------+----------+----------------------------+------------
meson-gxl-s905x-libretech-cc | arm64 | lab-baylibre | gcc-10 | defconfig | 1

Details: https://kernelci.org/test/plan/id/62c67512baeb0c8966a39ca8

Results: 0 PASS, 1 FAIL, 0 SKIP
Full config: defconfig
Compiler: gcc-10 (aarch64-linux-gnu-gcc (Debian 10.2.1-6) 10.2.1 20210110)
Plain log: https://storage.kernelci.org//cip-gitlab/ci-iwamatsu-linux-5.10.y-cip-rc/v5.10.126-cip11-116-gef362fbbff528/arm64/defconfig/gcc-10/lab-baylibre/baseline-nfs-meson-gxl-s905x-libretech-cc.txt
HTML log: https://storage.kernelci.org//cip-gitlab/ci-iwamatsu-linux-5.10.y-cip-rc/v5.10.126-cip11-116-gef362fbbff528/arm64/defconfig/gcc-10/lab-baylibre/baseline-nfs-meson-gxl-s905x-libretech-cc.html
Rootfs: http://storage.kernelci.org/images/rootfs/debian/bullseye/20220624.0/arm64/initrd.cpio.gz


* baseline-nfs.login: https://kernelci.org/test/case/id/62c67512baeb0c8966a39ca9
failing since 9 days (last pass: v5.10.121-cip9-272-g3fb28d4c623b, first fail: v5.10.121-cip9-287-ge9094c8446fc)



platform | arch | lab | compiler | defconfig | regressions
-----------------------------+-------+---------------+----------+----------------------------+------------
r8a77950-salvator-x | arm64 | lab-baylibre | gcc-10 | defconfig | 1

Details: https://kernelci.org/test/plan/id/62c67722ed9b758673a39bf8

Results: 0 PASS, 1 FAIL, 0 SKIP
Full config: defconfig
Compiler: gcc-10 (aarch64-linux-gnu-gcc (Debian 10.2.1-6) 10.2.1 20210110)
Plain log: https://storage.kernelci.org//cip-gitlab/ci-iwamatsu-linux-5.10.y-cip-rc/v5.10.126-cip11-116-gef362fbbff528/arm64/defconfig/gcc-10/lab-baylibre/baseline-nfs-r8a77950-salvator-x.txt
HTML log: https://storage.kernelci.org//cip-gitlab/ci-iwamatsu-linux-5.10.y-cip-rc/v5.10.126-cip11-116-gef362fbbff528/arm64/defconfig/gcc-10/lab-baylibre/baseline-nfs-r8a77950-salvator-x.html
Rootfs: http://storage.kernelci.org/images/rootfs/debian/bullseye/20220624.0/arm64/initrd.cpio.gz


* baseline-nfs.login: https://kernelci.org/test/case/id/62c67722ed9b758673a39bf9
new failure (last pass: v5.10.126-cip11-1-gc5218dc69ff1)



platform | arch | lab | compiler | defconfig | regressions
-----------------------------+-------+---------------+----------+----------------------------+------------
rk3399-gru-kevin | arm64 | lab-collabora | gcc-10 | defconfig+arm64-chromebook | 1

Details: https://kernelci.org/test/plan/id/62c6763c6e96385084a39bee

Results: 84 PASS, 4 FAIL, 0 SKIP
Full config: defconfig+arm64-chromebook
Compiler: gcc-10 (aarch64-linux-gnu-gcc (Debian 10.2.1-6) 10.2.1 20210110)
Plain log: https://storage.kernelci.org//cip-gitlab/ci-iwamatsu-linux-5.10.y-cip-rc/v5.10.126-cip11-116-gef362fbbff528/arm64/defconfig+arm64-chromebook/gcc-10/lab-collabora/baseline-nfs-rk3399-gru-kevin.txt
HTML log: https://storage.kernelci.org//cip-gitlab/ci-iwamatsu-linux-5.10.y-cip-rc/v5.10.126-cip11-116-gef362fbbff528/arm64/defconfig+arm64-chromebook/gcc-10/lab-collabora/baseline-nfs-rk3399-gru-kevin.html
Rootfs: http://storage.kernelci.org/images/rootfs/debian/bullseye/20220624.0/arm64/initrd.cpio.gz


* baseline-nfs.bootrr.rockchip-i2s1-probed: https://kernelci.org/test/case/id/62c6763d6e96385084a39c10
failing since 120 days (last pass: v5.10.100-cip2-319-gcbff87047566, first fail: v5.10.100-cip2-425-g0a0d92194f39)

2022-07-07T05:59:09.680198 [ 38.110074] cdn-dp fec00000.dp: Direct firmware load for rockchip/dptx.bin failed with error -2
2022-07-07T05:59:09.690091 [ 38.120101] cdn-dp fec00000.dp: Falling back to sysfs fallback for: rockchip/dptx.bin
2022-07-07T05:59:09.808962 /lava-6771633/1/../bin/lava-test-case
2022-07-07T05:59:09.837681 [ 38.268917] <LAVA_SIGNAL_TESTCASE TEST_CASE_ID=rockchip-i2s1-probed RESULT=fail>


cip-gitlab/ci/iwamatsu/linux-5.10.y-cip-rc baseline-cip-nfs: 13 runs, 3 regressions (v5.10.126-cip11-116-gef362fbbff528) #kernelci

kernelci.org bot <bot@...>
 

cip-gitlab/ci/iwamatsu/linux-5.10.y-cip-rc baseline-cip-nfs: 13 runs, 3 regressions (v5.10.126-cip11-116-gef362fbbff528)

Regressions Summary
-------------------

platform | arch | lab | compiler | defconfig | regressions
-------------------------+-------+-------------+----------+---------------------+------------
beaglebone-black | arm | lab-broonie | gcc-10 | omap2plus_defconfig | 1
beaglebone-black | arm | lab-cip | gcc-10 | omap2plus_defconfig | 1
r8a774a1-hihope-rzg2m-ex | arm64 | lab-cip | gcc-10 | defconfig | 1

Details: https://kernelci.org/test/job/cip-gitlab/branch/ci%2Fiwamatsu%2Flinux-5.10.y-cip-rc/kernel/v5.10.126-cip11-116-gef362fbbff528/plan/baseline-cip-nfs/

Test: baseline-cip-nfs
Tree: cip-gitlab
Branch: ci/iwamatsu/linux-5.10.y-cip-rc
Describe: v5.10.126-cip11-116-gef362fbbff528
URL: https://gitlab.com/cip-project/cip-kernel/linux-cip.git
SHA: ef362fbbff528b6dc0695b488cfc8cde20b404e4


Test Regressions
----------------


platform | arch | lab | compiler | defconfig | regressions
-------------------------+-------+-------------+----------+---------------------+------------
beaglebone-black | arm | lab-broonie | gcc-10 | omap2plus_defconfig | 1

Details: https://kernelci.org/test/plan/id/62c6745ea3bfd66bbba39bd5

Results: 0 PASS, 1 FAIL, 0 SKIP
Full config: omap2plus_defconfig
Compiler: gcc-10 (arm-linux-gnueabihf-gcc (Debian 10.2.1-6) 10.2.1 20210110)
Plain log: https://storage.kernelci.org//cip-gitlab/ci-iwamatsu-linux-5.10.y-cip-rc/v5.10.126-cip11-116-gef362fbbff528/arm/omap2plus_defconfig/gcc-10/lab-broonie/baseline-cip-nfs-beaglebone-black.txt
HTML log: https://storage.kernelci.org//cip-gitlab/ci-iwamatsu-linux-5.10.y-cip-rc/v5.10.126-cip11-116-gef362fbbff528/arm/omap2plus_defconfig/gcc-10/lab-broonie/baseline-cip-nfs-beaglebone-black.html
Rootfs: https://storage.kernelci.org/images/rootfs/cip/20211105/qemu-arm/cip-core-image-kernelci-cip-core-buster-qemu-arm-initrd.img.gz


* baseline-cip-nfs.login: https://kernelci.org/test/case/id/62c6745ea3bfd66bbba39bd6
new failure (last pass: v5.10.126-cip11-1-gc5218dc69ff1)



platform | arch | lab | compiler | defconfig | regressions
-------------------------+-------+-------------+----------+---------------------+------------
beaglebone-black | arm | lab-cip | gcc-10 | omap2plus_defconfig | 1

Details: https://kernelci.org/test/plan/id/62c673d0f5f564d72da39bef

Results: 0 PASS, 1 FAIL, 0 SKIP
Full config: omap2plus_defconfig
Compiler: gcc-10 (arm-linux-gnueabihf-gcc (Debian 10.2.1-6) 10.2.1 20210110)
Plain log: https://storage.kernelci.org//cip-gitlab/ci-iwamatsu-linux-5.10.y-cip-rc/v5.10.126-cip11-116-gef362fbbff528/arm/omap2plus_defconfig/gcc-10/lab-cip/baseline-cip-nfs-beaglebone-black.txt
HTML log: https://storage.kernelci.org//cip-gitlab/ci-iwamatsu-linux-5.10.y-cip-rc/v5.10.126-cip11-116-gef362fbbff528/arm/omap2plus_defconfig/gcc-10/lab-cip/baseline-cip-nfs-beaglebone-black.html
Rootfs: https://storage.kernelci.org/images/rootfs/cip/20211105/qemu-arm/cip-core-image-kernelci-cip-core-buster-qemu-arm-initrd.img.gz


* baseline-cip-nfs.login: https://kernelci.org/test/case/id/62c673d0f5f564d72da39bf0
new failure (last pass: v5.10.126-cip11-1-gc5218dc69ff1)



platform | arch | lab | compiler | defconfig | regressions
-------------------------+-------+-------------+----------+---------------------+------------
r8a774a1-hihope-rzg2m-ex | arm64 | lab-cip | gcc-10 | defconfig | 1

Details: https://kernelci.org/test/plan/id/62c67a245d6c869c76a39bf7

Results: 0 PASS, 1 FAIL, 0 SKIP
Full config: defconfig
Compiler: gcc-10 (aarch64-linux-gnu-gcc (Debian 10.2.1-6) 10.2.1 20210110)
Plain log: https://storage.kernelci.org//cip-gitlab/ci-iwamatsu-linux-5.10.y-cip-rc/v5.10.126-cip11-116-gef362fbbff528/arm64/defconfig/gcc-10/lab-cip/baseline-cip-nfs-r8a774a1-hihope-rzg2m-ex.txt
HTML log: https://storage.kernelci.org//cip-gitlab/ci-iwamatsu-linux-5.10.y-cip-rc/v5.10.126-cip11-116-gef362fbbff528/arm64/defconfig/gcc-10/lab-cip/baseline-cip-nfs-r8a774a1-hihope-rzg2m-ex.html
Rootfs: https://storage.kernelci.org/images/rootfs/cip/20211105/qemu-arm64/cip-core-image-kernelci-cip-core-buster-qemu-arm64-initrd.img.gz


* baseline-cip-nfs.login: https://kernelci.org/test/case/id/62c67a245d6c869c76a39bf8
new failure (last pass: v5.10.126-cip11-1-gc5218dc69ff1)


cip-gitlab/ci/iwamatsu/linux-5.10.y-cip-rc build: 190 builds: 3 failed, 187 passed, 4 errors, 10 warnings (v5.10.126-cip11-116-gef362fbbff528) #kernelci

kernelci.org bot <bot@...>
 

cip-gitlab/ci/iwamatsu/linux-5.10.y-cip-rc build: 190 builds: 3 failed, 187 passed, 4 errors, 10 warnings (v5.10.126-cip11-116-gef362fbbff528)

Full Build Summary: https://kernelci.org/build/cip-gitlab/branch/ci%2Fiwamatsu%2Flinux-5.10.y-cip-rc/kernel/v5.10.126-cip11-116-gef362fbbff528/

Tree: cip-gitlab
Branch: ci/iwamatsu/linux-5.10.y-cip-rc
Git Describe: v5.10.126-cip11-116-gef362fbbff528
Git Commit: ef362fbbff528b6dc0695b488cfc8cde20b404e4
Git URL: https://gitlab.com/cip-project/cip-kernel/linux-cip.git
Built: 7 unique architectures

Build Failures Detected:

arm:
rpc_defconfig: (gcc-10) FAIL

mips:
ip27_defconfig: (gcc-10) FAIL
ip28_defconfig: (gcc-10) FAIL

Errors and Warnings Detected:

arc:

arm64:

arm:
rpc_defconfig (gcc-10): 4 errors

i386:

mips:
32r2el_defconfig (gcc-10): 1 warning
decstation_64_defconfig (gcc-10): 1 warning
decstation_defconfig (gcc-10): 1 warning
decstation_r4k_defconfig (gcc-10): 1 warning
lemote2f_defconfig (gcc-10): 1 warning
rm200_defconfig (gcc-10): 1 warning

riscv:
rv32_defconfig (gcc-10): 4 warnings

x86_64:

Errors summary:

2 arm-linux-gnueabihf-gcc: error: unrecognized -march target: armv3m
2 arm-linux-gnueabihf-gcc: error: missing argument to ‘-march=’

Warnings summary:

3 kernel/rcu/tasks.h:710:13: warning: ‘show_rcu_tasks_rude_gp_kthread’ defined but not used [-Wunused-function]
2 <stdin>:830:2: warning: #warning syscall fstat64 not implemented [-Wcpp]
2 <stdin>:1127:2: warning: #warning syscall fstatat64 not implemented [-Wcpp]
1 net/mac80211/mlme.c:4349:1: warning: the frame size of 1040 bytes is larger than 1024 bytes [-Wframe-larger-than=]
1 drivers/block/paride/bpck.c:32: warning: "PC" redefined
1 WARNING: modpost: Symbol info of vmlinux is missing. Unresolved symbol check will be entirely skipped.

Section mismatches summary:

1 WARNING: modpost: vmlinux.o(___ksymtab_gpl+ixp4xx_timer_setup+0x0): Section mismatch in reference from the variable __ksymtab_ixp4xx_timer_setup to the function .init.text:ixp4xx_timer_setup()
1 WARNING: modpost: vmlinux.o(___ksymtab_gpl+ixp4xx_irq_init+0x0): Section mismatch in reference from the variable __ksymtab_ixp4xx_irq_init to the function .init.text:ixp4xx_irq_init()
1 WARNING: modpost: vmlinux.o(___ksymtab+prom_init_numa_memory+0x0): Section mismatch in reference from the variable __ksymtab_prom_init_numa_memory to the function .init.text:prom_init_numa_memory()

================================================================================

Detailed per-defconfig build reports:

--------------------------------------------------------------------------------
32r2el_defconfig (mips, gcc-10) — PASS, 0 errors, 1 warning, 0 section mismatches

Warnings:
WARNING: modpost: Symbol info of vmlinux is missing. Unresolved symbol check will be entirely skipped.

--------------------------------------------------------------------------------
allnoconfig (i386, gcc-10) — PASS, 0 errors, 0 warnings, 0 section mismatches

--------------------------------------------------------------------------------
allnoconfig (x86_64, gcc-10) — PASS, 0 errors, 0 warnings, 0 section mismatches

--------------------------------------------------------------------------------
allnoconfig (arc, gcc-10) — PASS, 0 errors, 0 warnings, 0 section mismatches

--------------------------------------------------------------------------------
am200epdkit_defconfig (arm, gcc-10) — PASS, 0 errors, 0 warnings, 0 section mismatches

--------------------------------------------------------------------------------
ar7_defconfig (mips, gcc-10) — PASS, 0 errors, 0 warnings, 0 section mismatches

--------------------------------------------------------------------------------
aspeed_g4_defconfig (arm, gcc-10) — PASS, 0 errors, 0 warnings, 0 section mismatches

--------------------------------------------------------------------------------
aspeed_g5_defconfig (arm, gcc-10) — PASS, 0 errors, 0 warnings, 0 section mismatches

--------------------------------------------------------------------------------
assabet_defconfig (arm, gcc-10) — PASS, 0 errors, 0 warnings, 0 section mismatches

--------------------------------------------------------------------------------
at91_dt_defconfig (arm, gcc-10) — PASS, 0 errors, 0 warnings, 0 section mismatches

--------------------------------------------------------------------------------
ath25_defconfig (mips, gcc-10) — PASS, 0 errors, 0 warnings, 0 section mismatches

--------------------------------------------------------------------------------
ath79_defconfig (mips, gcc-10) — PASS, 0 errors, 0 warnings, 0 section mismatches

--------------------------------------------------------------------------------
axm55xx_defconfig (arm, gcc-10) — PASS, 0 errors, 0 warnings, 0 section mismatches

--------------------------------------------------------------------------------
axs103_defconfig (arc, gcc-10) — PASS, 0 errors, 0 warnings, 0 section mismatches

--------------------------------------------------------------------------------
axs103_smp_defconfig (arc, gcc-10) — PASS, 0 errors, 0 warnings, 0 section mismatches

--------------------------------------------------------------------------------
badge4_defconfig (arm, gcc-10) — PASS, 0 errors, 0 warnings, 0 section mismatches

--------------------------------------------------------------------------------
bcm2835_defconfig (arm, gcc-10) — PASS, 0 errors, 0 warnings, 0 section mismatches

--------------------------------------------------------------------------------
bcm47xx_defconfig (mips, gcc-10) — PASS, 0 errors, 0 warnings, 0 section mismatches

--------------------------------------------------------------------------------
bcm63xx_defconfig (mips, gcc-10) — PASS, 0 errors, 0 warnings, 0 section mismatches

--------------------------------------------------------------------------------
bigsur_defconfig (mips, gcc-10) — PASS, 0 errors, 0 warnings, 0 section mismatches

--------------------------------------------------------------------------------
bmips_be_defconfig (mips, gcc-10) — PASS, 0 errors, 0 warnings, 0 section mismatches

--------------------------------------------------------------------------------
bmips_stb_defconfig (mips, gcc-10) — PASS, 0 errors, 0 warnings, 0 section mismatches

--------------------------------------------------------------------------------
capcella_defconfig (mips, gcc-10) — PASS, 0 errors, 0 warnings, 0 section mismatches

--------------------------------------------------------------------------------
cavium_octeon_defconfig (mips, gcc-10) — PASS, 0 errors, 0 warnings, 0 section mismatches

--------------------------------------------------------------------------------
cerfcube_defconfig (arm, gcc-10) — PASS, 0 errors, 0 warnings, 0 section mismatches

--------------------------------------------------------------------------------
ci20_defconfig (mips, gcc-10) — PASS, 0 errors, 0 warnings, 0 section mismatches

--------------------------------------------------------------------------------
cm_x300_defconfig (arm, gcc-10) — PASS, 0 errors, 0 warnings, 0 section mismatches

--------------------------------------------------------------------------------
cobalt_defconfig (mips, gcc-10) — PASS, 0 errors, 0 warnings, 0 section mismatches

--------------------------------------------------------------------------------
colibri_pxa270_defconfig (arm, gcc-10) — PASS, 0 errors, 0 warnings, 0 section mismatches

--------------------------------------------------------------------------------
colibri_pxa300_defconfig (arm, gcc-10) — PASS, 0 errors, 0 warnings, 0 section mismatches

--------------------------------------------------------------------------------
collie_defconfig (arm, gcc-10) — PASS, 0 errors, 0 warnings, 0 section mismatches

--------------------------------------------------------------------------------
corgi_defconfig (arm, gcc-10) — PASS, 0 errors, 0 warnings, 0 section mismatches

--------------------------------------------------------------------------------
cu1000-neo_defconfig (mips, gcc-10) — PASS, 0 errors, 0 warnings, 0 section mismatches

--------------------------------------------------------------------------------
cu1830-neo_defconfig (mips, gcc-10) — PASS, 0 errors, 0 warnings, 0 section mismatches

--------------------------------------------------------------------------------
davinci_all_defconfig (arm, gcc-10) — PASS, 0 errors, 0 warnings, 0 section mismatches

--------------------------------------------------------------------------------
db1xxx_defconfig (mips, gcc-10) — PASS, 0 errors, 0 warnings, 0 section mismatches

--------------------------------------------------------------------------------
decstation_64_defconfig (mips, gcc-10) — PASS, 0 errors, 1 warning, 0 section mismatches

Warnings:
kernel/rcu/tasks.h:710:13: warning: ‘show_rcu_tasks_rude_gp_kthread’ defined but not used [-Wunused-function]

--------------------------------------------------------------------------------
decstation_defconfig (mips, gcc-10) — PASS, 0 errors, 1 warning, 0 section mismatches

Warnings:
kernel/rcu/tasks.h:710:13: warning: ‘show_rcu_tasks_rude_gp_kthread’ defined but not used [-Wunused-function]

--------------------------------------------------------------------------------
decstation_r4k_defconfig (mips, gcc-10) — PASS, 0 errors, 1 warning, 0 section mismatches

Warnings:
kernel/rcu/tasks.h:710:13: warning: ‘show_rcu_tasks_rude_gp_kthread’ defined but not used [-Wunused-function]

--------------------------------------------------------------------------------
defconfig (riscv, gcc-10) — PASS, 0 errors, 0 warnings, 0 section mismatches

--------------------------------------------------------------------------------
defconfig (arm64, gcc-10) — PASS, 0 errors, 0 warnings, 0 section mismatches

--------------------------------------------------------------------------------
defconfig+arm64-chromebook (arm64, gcc-10) — PASS, 0 errors, 0 warnings, 0 section mismatches

--------------------------------------------------------------------------------
defconfig+arm64-chromebook+kselftest (arm64, gcc-10) — PASS, 0 errors, 0 warnings, 0 section mismatches

--------------------------------------------------------------------------------
defconfig+kselftest (arm64, gcc-10) — PASS, 0 errors, 0 warnings, 0 section mismatches

--------------------------------------------------------------------------------
dove_defconfig (arm, gcc-10) — PASS, 0 errors, 0 warnings, 0 section mismatches

--------------------------------------------------------------------------------
e55_defconfig (mips, gcc-10) — PASS, 0 errors, 0 warnings, 0 section mismatches

--------------------------------------------------------------------------------
ebsa110_defconfig (arm, gcc-10) — PASS, 0 errors, 0 warnings, 0 section mismatches

--------------------------------------------------------------------------------
efm32_defconfig (arm, gcc-10) — PASS, 0 errors, 0 warnings, 0 section mismatches

--------------------------------------------------------------------------------
ep93xx_defconfig (arm, gcc-10) — PASS, 0 errors, 0 warnings, 0 section mismatches

--------------------------------------------------------------------------------
eseries_pxa_defconfig (arm, gcc-10) — PASS, 0 errors, 0 warnings, 0 section mismatches

--------------------------------------------------------------------------------
exynos_defconfig (arm, gcc-10) — PASS, 0 errors, 0 warnings, 0 section mismatches

--------------------------------------------------------------------------------
ezx_defconfig (arm, gcc-10) — PASS, 0 errors, 0 warnings, 0 section mismatches

--------------------------------------------------------------------------------
footbridge_defconfig (arm, gcc-10) — PASS, 0 errors, 0 warnings, 0 section mismatches

--------------------------------------------------------------------------------
fuloong2e_defconfig (mips, gcc-10) — PASS, 0 errors, 0 warnings, 0 section mismatches

--------------------------------------------------------------------------------
gcw0_defconfig (mips, gcc-10) — PASS, 0 errors, 0 warnings, 0 section mismatches

--------------------------------------------------------------------------------
gemini_defconfig (arm, gcc-10) — PASS, 0 errors, 0 warnings, 0 section mismatches

--------------------------------------------------------------------------------
gpr_defconfig (mips, gcc-10) — PASS, 0 errors, 0 warnings, 0 section mismatches

--------------------------------------------------------------------------------
h3600_defconfig (arm, gcc-10) — PASS, 0 errors, 0 warnings, 0 section mismatches

--------------------------------------------------------------------------------
h5000_defconfig (arm, gcc-10) — PASS, 0 errors, 0 warnings, 0 section mismatches

--------------------------------------------------------------------------------
hackkit_defconfig (arm, gcc-10) — PASS, 0 errors, 0 warnings, 0 section mismatches

--------------------------------------------------------------------------------
haps_hs_defconfig (arc, gcc-10) — PASS, 0 errors, 0 warnings, 0 section mismatches

--------------------------------------------------------------------------------
haps_hs_smp_defconfig (arc, gcc-10) — PASS, 0 errors, 0 warnings, 0 section mismatches

--------------------------------------------------------------------------------
hisi_defconfig (arm, gcc-10) — PASS, 0 errors, 0 warnings, 0 section mismatches

--------------------------------------------------------------------------------
hsdk_defconfig (arc, gcc-10) — PASS, 0 errors, 0 warnings, 0 section mismatches

--------------------------------------------------------------------------------
i386_defconfig (i386, gcc-10) — PASS, 0 errors, 0 warnings, 0 section mismatches

--------------------------------------------------------------------------------
imote2_defconfig (arm, gcc-10) — PASS, 0 errors, 0 warnings, 0 section mismatches

--------------------------------------------------------------------------------
imx_v4_v5_defconfig (arm, gcc-10) — PASS, 0 errors, 0 warnings, 0 section mismatches

--------------------------------------------------------------------------------
imx_v6_v7_defconfig (arm, gcc-10) — PASS, 0 errors, 0 warnings, 0 section mismatches

--------------------------------------------------------------------------------
integrator_defconfig (arm, gcc-10) — PASS, 0 errors, 0 warnings, 0 section mismatches

--------------------------------------------------------------------------------
iop32x_defconfig (arm, gcc-10) — PASS, 0 errors, 0 warnings, 0 section mismatches

--------------------------------------------------------------------------------
ip22_defconfig (mips, gcc-10) — PASS, 0 errors, 0 warnings, 0 section mismatches

--------------------------------------------------------------------------------
ip27_defconfig (mips, gcc-10) — FAIL, 0 errors, 0 warnings, 0 section mismatches

--------------------------------------------------------------------------------
ip28_defconfig (mips, gcc-10) — FAIL, 0 errors, 0 warnings, 0 section mismatches

--------------------------------------------------------------------------------
ip32_defconfig (mips, gcc-10) — PASS, 0 errors, 0 warnings, 0 section mismatches

--------------------------------------------------------------------------------
ixp4xx_defconfig (arm, gcc-10) — PASS, 0 errors, 0 warnings, 0 section mismatches

Section mismatches:
WARNING: modpost: vmlinux.o(___ksymtab_gpl+ixp4xx_irq_init+0x0): Section mismatch in reference from the variable __ksymtab_ixp4xx_irq_init to the function .init.text:ixp4xx_irq_init()
WARNING: modpost: vmlinux.o(___ksymtab_gpl+ixp4xx_timer_setup+0x0): Section mismatch in reference from the variable __ksymtab_ixp4xx_timer_setup to the function .init.text:ixp4xx_timer_setup()

--------------------------------------------------------------------------------
jazz_defconfig (mips, gcc-10) — PASS, 0 errors, 0 warnings, 0 section mismatches

--------------------------------------------------------------------------------
jmr3927_defconfig (mips, gcc-10) — PASS, 0 errors, 0 warnings, 0 section mismatches

--------------------------------------------------------------------------------
jornada720_defconfig (arm, gcc-10) — PASS, 0 errors, 0 warnings, 0 section mismatches

--------------------------------------------------------------------------------
keystone_defconfig (arm, gcc-10) — PASS, 0 errors, 0 warnings, 0 section mismatches

--------------------------------------------------------------------------------
lart_defconfig (arm, gcc-10) — PASS, 0 errors, 0 warnings, 0 section mismatches

--------------------------------------------------------------------------------
lemote2f_defconfig (mips, gcc-10) — PASS, 0 errors, 1 warning, 0 section mismatches

Warnings:
net/mac80211/mlme.c:4349:1: warning: the frame size of 1040 bytes is larger than 1024 bytes [-Wframe-larger-than=]

--------------------------------------------------------------------------------
loongson1b_defconfig (mips, gcc-10) — PASS, 0 errors, 0 warnings, 0 section mismatches

--------------------------------------------------------------------------------
loongson1c_defconfig (mips, gcc-10) — PASS, 0 errors, 0 warnings, 0 section mismatches

--------------------------------------------------------------------------------
loongson3_defconfig (mips, gcc-10) — PASS, 0 errors, 0 warnings, 0 section mismatches

Section mismatches:
WARNING: modpost: vmlinux.o(___ksymtab+prom_init_numa_memory+0x0): Section mismatch in reference from the variable __ksymtab_prom_init_numa_memory to the function .init.text:prom_init_numa_memory()

--------------------------------------------------------------------------------
lpc18xx_defconfig (arm, gcc-10) — PASS, 0 errors, 0 warnings, 0 section mismatches

--------------------------------------------------------------------------------
lpc32xx_defconfig (arm, gcc-10) — PASS, 0 errors, 0 warnings, 0 section mismatches

--------------------------------------------------------------------------------
lpd270_defconfig (arm, gcc-10) — PASS, 0 errors, 0 warnings, 0 section mismatches

--------------------------------------------------------------------------------
lubbock_defconfig (arm, gcc-10) — PASS, 0 errors, 0 warnings, 0 section mismatches

--------------------------------------------------------------------------------
magician_defconfig (arm, gcc-10) — PASS, 0 errors, 0 warnings, 0 section mismatches

--------------------------------------------------------------------------------
mainstone_defconfig (arm, gcc-10) — PASS, 0 errors, 0 warnings, 0 section mismatches

--------------------------------------------------------------------------------
malta_defconfig (mips, gcc-10) — PASS, 0 errors, 0 warnings, 0 section mismatches

--------------------------------------------------------------------------------
malta_kvm_defconfig (mips, gcc-10) — PASS, 0 errors, 0 warnings, 0 section mismatches

--------------------------------------------------------------------------------
malta_kvm_guest_defconfig (mips, gcc-10) — PASS, 0 errors, 0 warnings, 0 section mismatches

--------------------------------------------------------------------------------
malta_qemu_32r6_defconfig (mips, gcc-10) — PASS, 0 errors, 0 warnings, 0 section mismatches

--------------------------------------------------------------------------------
maltaaprp_defconfig (mips, gcc-10) — PASS, 0 errors, 0 warnings, 0 section mismatches

--------------------------------------------------------------------------------
maltasmvp_defconfig (mips, gcc-10) — PASS, 0 errors, 0 warnings, 0 section mismatches

--------------------------------------------------------------------------------
maltasmvp_eva_defconfig (mips, gcc-10) — PASS, 0 errors, 0 warnings, 0 section mismatches

--------------------------------------------------------------------------------
maltaup_defconfig (mips, gcc-10) — PASS, 0 errors, 0 warnings, 0 section mismatches

--------------------------------------------------------------------------------
maltaup_xpa_defconfig (mips, gcc-10) — PASS, 0 errors, 0 warnings, 0 section mismatches

--------------------------------------------------------------------------------
milbeaut_m10v_defconfig (arm, gcc-10) — PASS, 0 errors, 0 warnings, 0 section mismatches

--------------------------------------------------------------------------------
mini2440_defconfig (arm, gcc-10) — PASS, 0 errors, 0 warnings, 0 section mismatches

--------------------------------------------------------------------------------
mmp2_defconfig (arm, gcc-10) — PASS, 0 errors, 0 warnings, 0 section mismatches

--------------------------------------------------------------------------------
moxart_defconfig (arm, gcc-10) — PASS, 0 errors, 0 warnings, 0 section mismatches

--------------------------------------------------------------------------------
mpc30x_defconfig (mips, gcc-10) — PASS, 0 errors, 0 warnings, 0 section mismatches

--------------------------------------------------------------------------------
mps2_defconfig (arm, gcc-10) — PASS, 0 errors, 0 warnings, 0 section mismatches

--------------------------------------------------------------------------------
mtx1_defconfig (mips, gcc-10) — PASS, 0 errors, 0 warnings, 0 section mismatches

--------------------------------------------------------------------------------
multi_v4t_defconfig (arm, gcc-10) — PASS, 0 errors, 0 warnings, 0 section mismatches

--------------------------------------------------------------------------------
multi_v5_defconfig (arm, gcc-10) — PASS, 0 errors, 0 warnings, 0 section mismatches

--------------------------------------------------------------------------------
multi_v7_defconfig (arm, gcc-10) — PASS, 0 errors, 0 warnings, 0 section mismatches

--------------------------------------------------------------------------------
multi_v7_defconfig+kselftest (arm, gcc-10) — PASS, 0 errors, 0 warnings, 0 section mismatches

--------------------------------------------------------------------------------
mvebu_v5_defconfig (arm, gcc-10) — PASS, 0 errors, 0 warnings, 0 section mismatches

--------------------------------------------------------------------------------
mvebu_v7_defconfig (arm, gcc-10) — PASS, 0 errors, 0 warnings, 0 section mismatches

--------------------------------------------------------------------------------
mxs_defconfig (arm, gcc-10) — PASS, 0 errors, 0 warnings, 0 section mismatches

--------------------------------------------------------------------------------
neponset_defconfig (arm, gcc-10) — PASS, 0 errors, 0 warnings, 0 section mismatches

--------------------------------------------------------------------------------
netwinder_defconfig (arm, gcc-10) — PASS, 0 errors, 0 warnings, 0 section mismatches

--------------------------------------------------------------------------------
nhk8815_defconfig (arm, gcc-10) — PASS, 0 errors, 0 warnings, 0 section mismatches

--------------------------------------------------------------------------------
nlm_xlp_defconfig (mips, gcc-10) — PASS, 0 errors, 0 warnings, 0 section mismatches

--------------------------------------------------------------------------------
nlm_xlr_defconfig (mips, gcc-10) — PASS, 0 errors, 0 warnings, 0 section mismatches

--------------------------------------------------------------------------------
nommu_k210_defconfig (riscv, gcc-10) — PASS, 0 errors, 0 warnings, 0 section mismatches

--------------------------------------------------------------------------------
nsimosci_hs_defconfig (arc, gcc-10) — PASS, 0 errors, 0 warnings, 0 section mismatches

--------------------------------------------------------------------------------
nsimosci_hs_smp_defconfig (arc, gcc-10) — PASS, 0 errors, 0 warnings, 0 section mismatches

--------------------------------------------------------------------------------
omap1_defconfig (arm, gcc-10) — PASS, 0 errors, 0 warnings, 0 section mismatches

--------------------------------------------------------------------------------
omap2plus_defconfig (arm, gcc-10) — PASS, 0 errors, 0 warnings, 0 section mismatches

--------------------------------------------------------------------------------
omega2p_defconfig (mips, gcc-10) — PASS, 0 errors, 0 warnings, 0 section mismatches

--------------------------------------------------------------------------------
orion5x_defconfig (arm, gcc-10) — PASS, 0 errors, 0 warnings, 0 section mismatches

--------------------------------------------------------------------------------
oxnas_v6_defconfig (arm, gcc-10) — PASS, 0 errors, 0 warnings, 0 section mismatches

--------------------------------------------------------------------------------
palmz72_defconfig (arm, gcc-10) — PASS, 0 errors, 0 warnings, 0 section mismatches

--------------------------------------------------------------------------------
pcm027_defconfig (arm, gcc-10) — PASS, 0 errors, 0 warnings, 0 section mismatches

--------------------------------------------------------------------------------
pic32mzda_defconfig (mips, gcc-10) — PASS, 0 errors, 0 warnings, 0 section mismatches

--------------------------------------------------------------------------------
pistachio_defconfig (mips, gcc-10) — PASS, 0 errors, 0 warnings, 0 section mismatches

--------------------------------------------------------------------------------
pleb_defconfig (arm, gcc-10) — PASS, 0 errors, 0 warnings, 0 section mismatches

--------------------------------------------------------------------------------
prima2_defconfig (arm, gcc-10) — PASS, 0 errors, 0 warnings, 0 section mismatches

--------------------------------------------------------------------------------
pxa168_defconfig (arm, gcc-10) — PASS, 0 errors, 0 warnings, 0 section mismatches

--------------------------------------------------------------------------------
pxa255-idp_defconfig (arm, gcc-10) — PASS, 0 errors, 0 warnings, 0 section mismatches

--------------------------------------------------------------------------------
pxa3xx_defconfig (arm, gcc-10) — PASS, 0 errors, 0 warnings, 0 section mismatches

--------------------------------------------------------------------------------
pxa910_defconfig (arm, gcc-10) — PASS, 0 errors, 0 warnings, 0 section mismatches

--------------------------------------------------------------------------------
pxa_defconfig (arm, gcc-10) — PASS, 0 errors, 0 warnings, 0 section mismatches

--------------------------------------------------------------------------------
qcom_defconfig (arm, gcc-10) — PASS, 0 errors, 0 warnings, 0 section mismatches

--------------------------------------------------------------------------------
qi_lb60_defconfig (mips, gcc-10) — PASS, 0 errors, 0 warnings, 0 section mismatches

--------------------------------------------------------------------------------
rb532_defconfig (mips, gcc-10) — PASS, 0 errors, 0 warnings, 0 section mismatches

--------------------------------------------------------------------------------
rbtx49xx_defconfig (mips, gcc-10) — PASS, 0 errors, 0 warnings, 0 section mismatches

--------------------------------------------------------------------------------
realview_defconfig (arm, gcc-10) — PASS, 0 errors, 0 warnings, 0 section mismatches

--------------------------------------------------------------------------------
rm200_defconfig (mips, gcc-10) — PASS, 0 errors, 1 warning, 0 section mismatches

Warnings:
drivers/block/paride/bpck.c:32: warning: "PC" redefined

--------------------------------------------------------------------------------
rpc_defconfig (arm, gcc-10) — FAIL, 4 errors, 0 warnings, 0 section mismatches

Errors:
arm-linux-gnueabihf-gcc: error: unrecognized -march target: armv3m
arm-linux-gnueabihf-gcc: error: missing argument to ‘-march=’
arm-linux-gnueabihf-gcc: error: unrecognized -march target: armv3m
arm-linux-gnueabihf-gcc: error: missing argument to ‘-march=’

--------------------------------------------------------------------------------
rs90_defconfig (mips, gcc-10) — PASS, 0 errors, 0 warnings, 0 section mismatches

--------------------------------------------------------------------------------
rt305x_defconfig (mips, gcc-10) — PASS, 0 errors, 0 warnings, 0 section mismatches

--------------------------------------------------------------------------------
rv32_defconfig (riscv, gcc-10) — PASS, 0 errors, 4 warnings, 0 section mismatches

Warnings:
<stdin>:830:2: warning: #warning syscall fstat64 not implemented [-Wcpp]
<stdin>:1127:2: warning: #warning syscall fstatat64 not implemented [-Wcpp]
<stdin>:830:2: warning: #warning syscall fstat64 not implemented [-Wcpp]
<stdin>:1127:2: warning: #warning syscall fstatat64 not implemented [-Wcpp]

--------------------------------------------------------------------------------
s3c2410_defconfig (arm, gcc-10) — PASS, 0 errors, 0 warnings, 0 section mismatches

--------------------------------------------------------------------------------
s3c6400_defconfig (arm, gcc-10) — PASS, 0 errors, 0 warnings, 0 section mismatches

--------------------------------------------------------------------------------
s5pv210_defconfig (arm, gcc-10) — PASS, 0 errors, 0 warnings, 0 section mismatches

--------------------------------------------------------------------------------
sama5_defconfig (arm, gcc-10) — PASS, 0 errors, 0 warnings, 0 section mismatches

--------------------------------------------------------------------------------
sb1250_swarm_defconfig (mips, gcc-10) — PASS, 0 errors, 0 warnings, 0 section mismatches

--------------------------------------------------------------------------------
shannon_defconfig (arm, gcc-10) — PASS, 0 errors, 0 warnings, 0 section mismatches

--------------------------------------------------------------------------------
shmobile_defconfig (arm, gcc-10) — PASS, 0 errors, 0 warnings, 0 section mismatches

--------------------------------------------------------------------------------
simpad_defconfig (arm, gcc-10) — PASS, 0 errors, 0 warnings, 0 section mismatches

--------------------------------------------------------------------------------
socfpga_defconfig (arm, gcc-10) — PASS, 0 errors, 0 warnings, 0 section mismatches

--------------------------------------------------------------------------------
spear13xx_defconfig (arm, gcc-10) — PASS, 0 errors, 0 warnings, 0 section mismatches

--------------------------------------------------------------------------------
spear3xx_defconfig (arm, gcc-10) — PASS, 0 errors, 0 warnings, 0 section mismatches

--------------------------------------------------------------------------------
spear6xx_defconfig (arm, gcc-10) — PASS, 0 errors, 0 warnings, 0 section mismatches

--------------------------------------------------------------------------------
spitz_defconfig (arm, gcc-10) — PASS, 0 errors, 0 warnings, 0 section mismatches

--------------------------------------------------------------------------------
stm32_defconfig (arm, gcc-10) — PASS, 0 errors, 0 warnings, 0 section mismatches

--------------------------------------------------------------------------------
sunxi_defconfig (arm, gcc-10) — PASS, 0 errors, 0 warnings, 0 section mismatches

--------------------------------------------------------------------------------
tango4_defconfig (arm, gcc-10) — PASS, 0 errors, 0 warnings, 0 section mismatches

--------------------------------------------------------------------------------
tb0219_defconfig (mips, gcc-10) — PASS, 0 errors, 0 warnings, 0 section mismatches

--------------------------------------------------------------------------------
tb0226_defconfig (mips, gcc-10) — PASS, 0 errors, 0 warnings, 0 section mismatches

--------------------------------------------------------------------------------
tb0287_defconfig (mips, gcc-10) — PASS, 0 errors, 0 warnings, 0 section mismatches

--------------------------------------------------------------------------------
tct_hammer_defconfig (arm, gcc-10) — PASS, 0 errors, 0 warnings, 0 section mismatches

--------------------------------------------------------------------------------
tegra_defconfig (arm, gcc-10) — PASS, 0 errors, 0 warnings, 0 section mismatches

--------------------------------------------------------------------------------
tinyconfig (arc, gcc-10) — PASS, 0 errors, 0 warnings, 0 section mismatches

--------------------------------------------------------------------------------
tinyconfig (x86_64, gcc-10) — PASS, 0 errors, 0 warnings, 0 section mismatches

--------------------------------------------------------------------------------
tinyconfig (i386, gcc-10) — PASS, 0 errors, 0 warnings, 0 section mismatches

--------------------------------------------------------------------------------
trizeps4_defconfig (arm, gcc-10) — PASS, 0 errors, 0 warnings, 0 section mismatches

--------------------------------------------------------------------------------
u300_defconfig (arm, gcc-10) — PASS, 0 errors, 0 warnings, 0 section mismatches

--------------------------------------------------------------------------------
u8500_defconfig (arm, gcc-10) — PASS, 0 errors, 0 warnings, 0 section mismatches

--------------------------------------------------------------------------------
vdk_hs38_defconfig (arc, gcc-10) — PASS, 0 errors, 0 warnings, 0 section mismatches

--------------------------------------------------------------------------------
vdk_hs38_smp_defconfig (arc, gcc-10) — PASS, 0 errors, 0 warnings, 0 section mismatches

--------------------------------------------------------------------------------
versatile_defconfig (arm, gcc-10) — PASS, 0 errors, 0 warnings, 0 section mismatches

--------------------------------------------------------------------------------
vexpress_defconfig (arm, gcc-10) — PASS, 0 errors, 0 warnings, 0 section mismatches

--------------------------------------------------------------------------------
vf610m4_defconfig (arm, gcc-10) — PASS, 0 errors, 0 warnings, 0 section mismatches

--------------------------------------------------------------------------------
viper_defconfig (arm, gcc-10) — PASS, 0 errors, 0 warnings, 0 section mismatches

--------------------------------------------------------------------------------
vocore2_defconfig (mips, gcc-10) — PASS, 0 errors, 0 warnings, 0 section mismatches

--------------------------------------------------------------------------------
vt8500_v6_v7_defconfig (arm, gcc-10) — PASS, 0 errors, 0 warnings, 0 section mismatches

--------------------------------------------------------------------------------
workpad_defconfig (mips, gcc-10) — PASS, 0 errors, 0 warnings, 0 section mismatches

--------------------------------------------------------------------------------
x86_64_defconfig (x86_64, gcc-10) — PASS, 0 errors, 0 warnings, 0 section mismatches

--------------------------------------------------------------------------------
x86_64_defconfig+kselftest (x86_64, gcc-10) — PASS, 0 errors, 0 warnings, 0 section mismatches

--------------------------------------------------------------------------------
x86_64_defconfig+x86-chromebook (x86_64, gcc-10) — PASS, 0 errors, 0 warnings, 0 section mismatches

--------------------------------------------------------------------------------
x86_64_defconfig+x86-chromebook+kselftest (x86_64, gcc-10) — PASS, 0 errors, 0 warnings, 0 section mismatches

--------------------------------------------------------------------------------
xcep_defconfig (arm, gcc-10) — PASS, 0 errors, 0 warnings, 0 section mismatches

--------------------------------------------------------------------------------
zeus_defconfig (arm, gcc-10) — PASS, 0 errors, 0 warnings, 0 section mismatches

--------------------------------------------------------------------------------
zx_defconfig (arm, gcc-10) — PASS, 0 errors, 0 warnings, 0 section mismatches

---
For more info write to <info@...>


cip-gitlab/ci/iwamatsu/linux-4.4.y-cip-rc baseline: 87 runs, 8 regressions (v4.9.196-8580-gf266375ffc61) #kernelci

kernelci.org bot <bot@...>
 

cip-gitlab/ci/iwamatsu/linux-4.4.y-cip-rc baseline: 87 runs, 8 regressions (v4.9.196-8580-gf266375ffc61)

Regressions Summary
-------------------

platform | arch | lab | compiler | defconfig | regressions
----------------------+-------+--------------+----------+----------------------------+------------
qemu_arm64-virt-gicv2 | arm64 | lab-baylibre | gcc-10 | defconfig+arm64-chromebook | 1
qemu_arm64-virt-gicv2 | arm64 | lab-baylibre | gcc-10 | defconfig | 1
qemu_arm64-virt-gicv2 | arm64 | lab-broonie | gcc-10 | defconfig+arm64-chromebook | 1
qemu_arm64-virt-gicv2 | arm64 | lab-broonie | gcc-10 | defconfig | 1
qemu_arm64-virt-gicv3 | arm64 | lab-baylibre | gcc-10 | defconfig+arm64-chromebook | 1
qemu_arm64-virt-gicv3 | arm64 | lab-baylibre | gcc-10 | defconfig | 1
qemu_arm64-virt-gicv3 | arm64 | lab-broonie | gcc-10 | defconfig+arm64-chromebook | 1
qemu_arm64-virt-gicv3 | arm64 | lab-broonie | gcc-10 | defconfig | 1

Details: https://kernelci.org/test/job/cip-gitlab/branch/ci%2Fiwamatsu%2Flinux-4.4.y-cip-rc/kernel/v4.9.196-8580-gf266375ffc61/plan/baseline/

Test: baseline
Tree: cip-gitlab
Branch: ci/iwamatsu/linux-4.4.y-cip-rc
Describe: v4.9.196-8580-gf266375ffc61
URL: https://gitlab.com/cip-project/cip-kernel/linux-cip.git
SHA: f266375ffc610dd9f3a80109cd6070c2e886487a


Test Regressions
----------------


platform | arch | lab | compiler | defconfig | regressions
----------------------+-------+--------------+----------+----------------------------+------------
qemu_arm64-virt-gicv2 | arm64 | lab-baylibre | gcc-10 | defconfig+arm64-chromebook | 1

Details: https://kernelci.org/test/plan/id/62c641b0445744776aa39bf0

Results: 0 PASS, 1 FAIL, 0 SKIP
Full config: defconfig+arm64-chromebook
Compiler: gcc-10 (aarch64-linux-gnu-gcc (Debian 10.2.1-6) 10.2.1 20210110)
Plain log: https://storage.kernelci.org//cip-gitlab/ci-iwamatsu-linux-4.4.y-cip-rc/v4.9.196-8580-gf266375ffc61/arm64/defconfig+arm64-chromebook/gcc-10/lab-baylibre/baseline-qemu_arm64-virt-gicv2.txt
HTML log: https://storage.kernelci.org//cip-gitlab/ci-iwamatsu-linux-4.4.y-cip-rc/v4.9.196-8580-gf266375ffc61/arm64/defconfig+arm64-chromebook/gcc-10/lab-baylibre/baseline-qemu_arm64-virt-gicv2.html
Rootfs: http://storage.kernelci.org/images/rootfs/buildroot/buildroot-baseline/20220624.0/arm64/rootfs.cpio.gz


* baseline.login: https://kernelci.org/test/case/id/62c641b0445744776aa39bf1
failing since 0 day (last pass: v4.4.302-1082-g00b9de85d40e, first fail: v4.4.302-1085-gb83ed90eb98d)



platform | arch | lab | compiler | defconfig | regressions
----------------------+-------+--------------+----------+----------------------------+------------
qemu_arm64-virt-gicv2 | arm64 | lab-baylibre | gcc-10 | defconfig | 1

Details: https://kernelci.org/test/plan/id/62c6432c4c1206a06ca39bd3

Results: 0 PASS, 1 FAIL, 0 SKIP
Full config: defconfig
Compiler: gcc-10 (aarch64-linux-gnu-gcc (Debian 10.2.1-6) 10.2.1 20210110)
Plain log: https://storage.kernelci.org//cip-gitlab/ci-iwamatsu-linux-4.4.y-cip-rc/v4.9.196-8580-gf266375ffc61/arm64/defconfig/gcc-10/lab-baylibre/baseline-qemu_arm64-virt-gicv2.txt
HTML log: https://storage.kernelci.org//cip-gitlab/ci-iwamatsu-linux-4.4.y-cip-rc/v4.9.196-8580-gf266375ffc61/arm64/defconfig/gcc-10/lab-baylibre/baseline-qemu_arm64-virt-gicv2.html
Rootfs: http://storage.kernelci.org/images/rootfs/buildroot/buildroot-baseline/20220624.0/arm64/rootfs.cpio.gz


* baseline.login: https://kernelci.org/test/case/id/62c6432c4c1206a06ca39bd4
failing since 1 day (last pass: v4.4.302-1082-g00b9de85d40e, first fail: v4.4.302-1083-g94e3113365c2)



platform | arch | lab | compiler | defconfig | regressions
----------------------+-------+--------------+----------+----------------------------+------------
qemu_arm64-virt-gicv2 | arm64 | lab-broonie | gcc-10 | defconfig+arm64-chromebook | 1

Details: https://kernelci.org/test/plan/id/62c641be445744776aa39c10

Results: 0 PASS, 1 FAIL, 0 SKIP
Full config: defconfig+arm64-chromebook
Compiler: gcc-10 (aarch64-linux-gnu-gcc (Debian 10.2.1-6) 10.2.1 20210110)
Plain log: https://storage.kernelci.org//cip-gitlab/ci-iwamatsu-linux-4.4.y-cip-rc/v4.9.196-8580-gf266375ffc61/arm64/defconfig+arm64-chromebook/gcc-10/lab-broonie/baseline-qemu_arm64-virt-gicv2.txt
HTML log: https://storage.kernelci.org//cip-gitlab/ci-iwamatsu-linux-4.4.y-cip-rc/v4.9.196-8580-gf266375ffc61/arm64/defconfig+arm64-chromebook/gcc-10/lab-broonie/baseline-qemu_arm64-virt-gicv2.html
Rootfs: http://storage.kernelci.org/images/rootfs/buildroot/buildroot-baseline/20220624.0/arm64/rootfs.cpio.gz


* baseline.login: https://kernelci.org/test/case/id/62c641be445744776aa39c11
failing since 0 day (last pass: v4.4.302-1082-g00b9de85d40e, first fail: v4.4.302-1085-gb83ed90eb98d)



platform | arch | lab | compiler | defconfig | regressions
----------------------+-------+--------------+----------+----------------------------+------------
qemu_arm64-virt-gicv2 | arm64 | lab-broonie | gcc-10 | defconfig | 1

Details: https://kernelci.org/test/plan/id/62c64440686e3b2f3ca39c0e

Results: 0 PASS, 1 FAIL, 0 SKIP
Full config: defconfig
Compiler: gcc-10 (aarch64-linux-gnu-gcc (Debian 10.2.1-6) 10.2.1 20210110)
Plain log: https://storage.kernelci.org//cip-gitlab/ci-iwamatsu-linux-4.4.y-cip-rc/v4.9.196-8580-gf266375ffc61/arm64/defconfig/gcc-10/lab-broonie/baseline-qemu_arm64-virt-gicv2.txt
HTML log: https://storage.kernelci.org//cip-gitlab/ci-iwamatsu-linux-4.4.y-cip-rc/v4.9.196-8580-gf266375ffc61/arm64/defconfig/gcc-10/lab-broonie/baseline-qemu_arm64-virt-gicv2.html
Rootfs: http://storage.kernelci.org/images/rootfs/buildroot/buildroot-baseline/20220624.0/arm64/rootfs.cpio.gz


* baseline.login: https://kernelci.org/test/case/id/62c64440686e3b2f3ca39c0f
failing since 1 day (last pass: v4.4.302-1082-g00b9de85d40e, first fail: v4.4.302-1083-g94e3113365c2)



platform | arch | lab | compiler | defconfig | regressions
----------------------+-------+--------------+----------+----------------------------+------------
qemu_arm64-virt-gicv3 | arm64 | lab-baylibre | gcc-10 | defconfig+arm64-chromebook | 1

Details: https://kernelci.org/test/plan/id/62c641b2ff5d27a1b8a39be9

Results: 0 PASS, 1 FAIL, 0 SKIP
Full config: defconfig+arm64-chromebook
Compiler: gcc-10 (aarch64-linux-gnu-gcc (Debian 10.2.1-6) 10.2.1 20210110)
Plain log: https://storage.kernelci.org//cip-gitlab/ci-iwamatsu-linux-4.4.y-cip-rc/v4.9.196-8580-gf266375ffc61/arm64/defconfig+arm64-chromebook/gcc-10/lab-baylibre/baseline-qemu_arm64-virt-gicv3.txt
HTML log: https://storage.kernelci.org//cip-gitlab/ci-iwamatsu-linux-4.4.y-cip-rc/v4.9.196-8580-gf266375ffc61/arm64/defconfig+arm64-chromebook/gcc-10/lab-baylibre/baseline-qemu_arm64-virt-gicv3.html
Rootfs: http://storage.kernelci.org/images/rootfs/buildroot/buildroot-baseline/20220624.0/arm64/rootfs.cpio.gz


* baseline.login: https://kernelci.org/test/case/id/62c641b2ff5d27a1b8a39bea
failing since 0 day (last pass: v4.4.302-1082-g00b9de85d40e, first fail: v4.4.302-1085-gb83ed90eb98d)



platform | arch | lab | compiler | defconfig | regressions
----------------------+-------+--------------+----------+----------------------------+------------
qemu_arm64-virt-gicv3 | arm64 | lab-baylibre | gcc-10 | defconfig | 1

Details: https://kernelci.org/test/plan/id/62c6432ecc8a9ed6e7a39bd6

Results: 0 PASS, 1 FAIL, 0 SKIP
Full config: defconfig
Compiler: gcc-10 (aarch64-linux-gnu-gcc (Debian 10.2.1-6) 10.2.1 20210110)
Plain log: https://storage.kernelci.org//cip-gitlab/ci-iwamatsu-linux-4.4.y-cip-rc/v4.9.196-8580-gf266375ffc61/arm64/defconfig/gcc-10/lab-baylibre/baseline-qemu_arm64-virt-gicv3.txt
HTML log: https://storage.kernelci.org//cip-gitlab/ci-iwamatsu-linux-4.4.y-cip-rc/v4.9.196-8580-gf266375ffc61/arm64/defconfig/gcc-10/lab-baylibre/baseline-qemu_arm64-virt-gicv3.html
Rootfs: http://storage.kernelci.org/images/rootfs/buildroot/buildroot-baseline/20220624.0/arm64/rootfs.cpio.gz


* baseline.login: https://kernelci.org/test/case/id/62c6432ecc8a9ed6e7a39bd7
failing since 1 day (last pass: v4.4.302-1082-g00b9de85d40e, first fail: v4.4.302-1083-g94e3113365c2)



platform | arch | lab | compiler | defconfig | regressions
----------------------+-------+--------------+----------+----------------------------+------------
qemu_arm64-virt-gicv3 | arm64 | lab-broonie | gcc-10 | defconfig+arm64-chromebook | 1

Details: https://kernelci.org/test/plan/id/62c641bfd62ca580a9a39bcd

Results: 0 PASS, 1 FAIL, 0 SKIP
Full config: defconfig+arm64-chromebook
Compiler: gcc-10 (aarch64-linux-gnu-gcc (Debian 10.2.1-6) 10.2.1 20210110)
Plain log: https://storage.kernelci.org//cip-gitlab/ci-iwamatsu-linux-4.4.y-cip-rc/v4.9.196-8580-gf266375ffc61/arm64/defconfig+arm64-chromebook/gcc-10/lab-broonie/baseline-qemu_arm64-virt-gicv3.txt
HTML log: https://storage.kernelci.org//cip-gitlab/ci-iwamatsu-linux-4.4.y-cip-rc/v4.9.196-8580-gf266375ffc61/arm64/defconfig+arm64-chromebook/gcc-10/lab-broonie/baseline-qemu_arm64-virt-gicv3.html
Rootfs: http://storage.kernelci.org/images/rootfs/buildroot/buildroot-baseline/20220624.0/arm64/rootfs.cpio.gz


* baseline.login: https://kernelci.org/test/case/id/62c641bfd62ca580a9a39bce
failing since 0 day (last pass: v4.4.302-1082-g00b9de85d40e, first fail: v4.4.302-1085-gb83ed90eb98d)



platform | arch | lab | compiler | defconfig | regressions
----------------------+-------+--------------+----------+----------------------------+------------
qemu_arm64-virt-gicv3 | arm64 | lab-broonie | gcc-10 | defconfig | 1

Details: https://kernelci.org/test/plan/id/62c64466ae120cac4ba39bdb

Results: 0 PASS, 1 FAIL, 0 SKIP
Full config: defconfig
Compiler: gcc-10 (aarch64-linux-gnu-gcc (Debian 10.2.1-6) 10.2.1 20210110)
Plain log: https://storage.kernelci.org//cip-gitlab/ci-iwamatsu-linux-4.4.y-cip-rc/v4.9.196-8580-gf266375ffc61/arm64/defconfig/gcc-10/lab-broonie/baseline-qemu_arm64-virt-gicv3.txt
HTML log: https://storage.kernelci.org//cip-gitlab/ci-iwamatsu-linux-4.4.y-cip-rc/v4.9.196-8580-gf266375ffc61/arm64/defconfig/gcc-10/lab-broonie/baseline-qemu_arm64-virt-gicv3.html
Rootfs: http://storage.kernelci.org/images/rootfs/buildroot/buildroot-baseline/20220624.0/arm64/rootfs.cpio.gz


* baseline.login: https://kernelci.org/test/case/id/62c64466ae120cac4ba39bdc
failing since 1 day (last pass: v4.4.302-1082-g00b9de85d40e, first fail: v4.4.302-1083-g94e3113365c2)


cip-gitlab/ci/iwamatsu/linux-4.4.y-cip-rc build: 188 builds: 3 failed, 185 passed, 2 errors, 34 warnings (v4.9.196-8580-gf266375ffc61) #kernelci

kernelci.org bot <bot@...>
 

cip-gitlab/ci/iwamatsu/linux-4.4.y-cip-rc build: 188 builds: 3 failed, 185 passed, 2 errors, 34 warnings (v4.9.196-8580-gf266375ffc61)

Full Build Summary: https://kernelci.org/build/cip-gitlab/branch/ci%2Fiwamatsu%2Flinux-4.4.y-cip-rc/kernel/v4.9.196-8580-gf266375ffc61/

Tree: cip-gitlab
Branch: ci/iwamatsu/linux-4.4.y-cip-rc
Git Describe: v4.9.196-8580-gf266375ffc61
Git Commit: f266375ffc610dd9f3a80109cd6070c2e886487a
Git URL: https://gitlab.com/cip-project/cip-kernel/linux-cip.git
Built: 6 unique architectures

Build Failures Detected:

arm:
rpc_defconfig: (gcc-10) FAIL

mips:
ip27_defconfig: (gcc-10) FAIL
ip28_defconfig: (gcc-10) FAIL

Errors and Warnings Detected:

arc:

arm64:

arm:
mini2440_defconfig (gcc-10): 1 warning
omap1_defconfig (gcc-10): 1 warning
rpc_defconfig (gcc-10): 2 errors
s3c2410_defconfig (gcc-10): 1 warning

i386:
allnoconfig (gcc-10): 3 warnings
i386_defconfig (gcc-10): 3 warnings
tinyconfig (gcc-10): 3 warnings

mips:
mtx1_defconfig (gcc-10): 3 warnings

x86_64:
allnoconfig (gcc-10): 5 warnings
tinyconfig (gcc-10): 4 warnings
x86_64_defconfig (gcc-10): 5 warnings
x86_64_defconfig+x86-chromebook (gcc-10): 5 warnings

Errors summary:

1 arm-linux-gnueabihf-gcc: error: unrecognized -march target: armv3
1 arm-linux-gnueabihf-gcc: error: missing argument to ‘-march=’

Warnings summary:

7 ld: warning: creating DT_TEXTREL in a PIE
7 arch/x86/kernel/process.c:460: Warning: no instruction mnemonic suffix given and no register operands; using default for `btr'
4 ld: arch/x86/boot/compressed/head_64.o: warning: relocation in read-only section `.head.text'
4 arch/x86/entry/entry_64.S:1565: Warning: no instruction mnemonic suffix given and no register operands; using default for `sysret'
3 ld: arch/x86/boot/compressed/head_32.o: warning: relocation in read-only section `.head.text'
3 arch/x86/entry/entry_32.S:452: Warning: no instruction mnemonic suffix given and no register operands; using default for `btr'
2 sound/pci/echoaudio/echoaudio_dsp.c:647:9: warning: iteration 1073741824 invokes undefined behavior [-Waggressive-loop-optimizations]
2 drivers/tty/serial/samsung.c:1783:34: warning: array ‘s3c24xx_uart_dt_match’ assumed to have one element
1 sound/pci/echoaudio/echoaudio_dsp.c:658:9: warning: iteration 1073741824 invokes undefined behavior [-Waggressive-loop-optimizations]
1 drivers/gpio/gpio-omap.c:1135:34: warning: array ‘omap_gpio_match’ assumed to have one element

Section mismatches summary:

15 WARNING: modpost: Found 1 section mismatch(es).

================================================================================

Detailed per-defconfig build reports:

--------------------------------------------------------------------------------
acs5k_defconfig (arm, gcc-10) — PASS, 0 errors, 0 warnings, 0 section mismatches

--------------------------------------------------------------------------------
acs5k_tiny_defconfig (arm, gcc-10) — PASS, 0 errors, 0 warnings, 0 section mismatches

--------------------------------------------------------------------------------
allnoconfig (x86_64, gcc-10) — PASS, 0 errors, 5 warnings, 0 section mismatches

Warnings:
arch/x86/entry/entry_64.S:1565: Warning: no instruction mnemonic suffix given and no register operands; using default for `sysret'
arch/x86/kernel/process.c:460: Warning: no instruction mnemonic suffix given and no register operands; using default for `btr'
arch/x86/kernel/process.c:460: Warning: no instruction mnemonic suffix given and no register operands; using default for `btr'
ld: arch/x86/boot/compressed/head_64.o: warning: relocation in read-only section `.head.text'
ld: warning: creating DT_TEXTREL in a PIE

--------------------------------------------------------------------------------
allnoconfig (arc, gcc-10) — PASS, 0 errors, 0 warnings, 0 section mismatches

--------------------------------------------------------------------------------
allnoconfig (i386, gcc-10) — PASS, 0 errors, 3 warnings, 0 section mismatches

Warnings:
arch/x86/entry/entry_32.S:452: Warning: no instruction mnemonic suffix given and no register operands; using default for `btr'
ld: arch/x86/boot/compressed/head_32.o: warning: relocation in read-only section `.head.text'
ld: warning: creating DT_TEXTREL in a PIE

--------------------------------------------------------------------------------
allnoconfig (mips, gcc-10) — PASS, 0 errors, 0 warnings, 0 section mismatches

--------------------------------------------------------------------------------
am200epdkit_defconfig (arm, gcc-10) — PASS, 0 errors, 0 warnings, 0 section mismatches

--------------------------------------------------------------------------------
ar7_defconfig (mips, gcc-10) — PASS, 0 errors, 0 warnings, 0 section mismatches

--------------------------------------------------------------------------------
aspeed_g4_defconfig (arm, gcc-10) — PASS, 0 errors, 0 warnings, 0 section mismatches

--------------------------------------------------------------------------------
aspeed_g5_defconfig (arm, gcc-10) — PASS, 0 errors, 0 warnings, 0 section mismatches

--------------------------------------------------------------------------------
assabet_defconfig (arm, gcc-10) — PASS, 0 errors, 0 warnings, 0 section mismatches

--------------------------------------------------------------------------------
at91_dt_defconfig (arm, gcc-10) — PASS, 0 errors, 0 warnings, 0 section mismatches

--------------------------------------------------------------------------------
ath25_defconfig (mips, gcc-10) — PASS, 0 errors, 0 warnings, 0 section mismatches

--------------------------------------------------------------------------------
ath79_defconfig (mips, gcc-10) — PASS, 0 errors, 0 warnings, 0 section mismatches

--------------------------------------------------------------------------------
axm55xx_defconfig (arm, gcc-10) — PASS, 0 errors, 0 warnings, 0 section mismatches

--------------------------------------------------------------------------------
axs103_defconfig (arc, gcc-10) — PASS, 0 errors, 0 warnings, 0 section mismatches

--------------------------------------------------------------------------------
axs103_smp_defconfig (arc, gcc-10) — PASS, 0 errors, 0 warnings, 0 section mismatches

--------------------------------------------------------------------------------
badge4_defconfig (arm, gcc-10) — PASS, 0 errors, 0 warnings, 0 section mismatches

--------------------------------------------------------------------------------
bcm2835_defconfig (arm, gcc-10) — PASS, 0 errors, 0 warnings, 0 section mismatches

--------------------------------------------------------------------------------
bcm47xx_defconfig (mips, gcc-10) — PASS, 0 errors, 0 warnings, 0 section mismatches

--------------------------------------------------------------------------------
bcm63xx_defconfig (mips, gcc-10) — PASS, 0 errors, 0 warnings, 0 section mismatches

--------------------------------------------------------------------------------
bigsur_defconfig (mips, gcc-10) — PASS, 0 errors, 0 warnings, 0 section mismatches

--------------------------------------------------------------------------------
bmips_be_defconfig (mips, gcc-10) — PASS, 0 errors, 0 warnings, 0 section mismatches

Section mismatches:
WARNING: modpost: Found 1 section mismatch(es).

--------------------------------------------------------------------------------
bmips_stb_defconfig (mips, gcc-10) — PASS, 0 errors, 0 warnings, 0 section mismatches

Section mismatches:
WARNING: modpost: Found 1 section mismatch(es).

--------------------------------------------------------------------------------
capcella_defconfig (mips, gcc-10) — PASS, 0 errors, 0 warnings, 0 section mismatches

--------------------------------------------------------------------------------
cavium_octeon_defconfig (mips, gcc-10) — PASS, 0 errors, 0 warnings, 0 section mismatches

--------------------------------------------------------------------------------
cerfcube_defconfig (arm, gcc-10) — PASS, 0 errors, 0 warnings, 0 section mismatches

--------------------------------------------------------------------------------
ci20_defconfig (mips, gcc-10) — PASS, 0 errors, 0 warnings, 0 section mismatches

--------------------------------------------------------------------------------
cm_x2xx_defconfig (arm, gcc-10) — PASS, 0 errors, 0 warnings, 0 section mismatches

--------------------------------------------------------------------------------
cm_x300_defconfig (arm, gcc-10) — PASS, 0 errors, 0 warnings, 0 section mismatches

--------------------------------------------------------------------------------
cobalt_defconfig (mips, gcc-10) — PASS, 0 errors, 0 warnings, 0 section mismatches

--------------------------------------------------------------------------------
colibri_pxa270_defconfig (arm, gcc-10) — PASS, 0 errors, 0 warnings, 0 section mismatches

--------------------------------------------------------------------------------
colibri_pxa300_defconfig (arm, gcc-10) — PASS, 0 errors, 0 warnings, 0 section mismatches

--------------------------------------------------------------------------------
collie_defconfig (arm, gcc-10) — PASS, 0 errors, 0 warnings, 0 section mismatches

--------------------------------------------------------------------------------
corgi_defconfig (arm, gcc-10) — PASS, 0 errors, 0 warnings, 0 section mismatches

--------------------------------------------------------------------------------
davinci_all_defconfig (arm, gcc-10) — PASS, 0 errors, 0 warnings, 0 section mismatches

--------------------------------------------------------------------------------
db1xxx_defconfig (mips, gcc-10) — PASS, 0 errors, 0 warnings, 0 section mismatches

--------------------------------------------------------------------------------
decstation_defconfig (mips, gcc-10) — PASS, 0 errors, 0 warnings, 0 section mismatches

--------------------------------------------------------------------------------
defconfig (arm64, gcc-10) — PASS, 0 errors, 0 warnings, 0 section mismatches

Section mismatches:
WARNING: modpost: Found 1 section mismatch(es).

--------------------------------------------------------------------------------
defconfig+arm64-chromebook (arm64, gcc-10) — PASS, 0 errors, 0 warnings, 0 section mismatches

Section mismatches:
WARNING: modpost: Found 1 section mismatch(es).

--------------------------------------------------------------------------------
dove_defconfig (arm, gcc-10) — PASS, 0 errors, 0 warnings, 0 section mismatches

--------------------------------------------------------------------------------
e55_defconfig (mips, gcc-10) — PASS, 0 errors, 0 warnings, 0 section mismatches

--------------------------------------------------------------------------------
ebsa110_defconfig (arm, gcc-10) — PASS, 0 errors, 0 warnings, 0 section mismatches

--------------------------------------------------------------------------------
efm32_defconfig (arm, gcc-10) — PASS, 0 errors, 0 warnings, 0 section mismatches

--------------------------------------------------------------------------------
em_x270_defconfig (arm, gcc-10) — PASS, 0 errors, 0 warnings, 0 section mismatches

--------------------------------------------------------------------------------
ep93xx_defconfig (arm, gcc-10) — PASS, 0 errors, 0 warnings, 0 section mismatches

Section mismatches:
WARNING: modpost: Found 1 section mismatch(es).

--------------------------------------------------------------------------------
eseries_pxa_defconfig (arm, gcc-10) — PASS, 0 errors, 0 warnings, 0 section mismatches

--------------------------------------------------------------------------------
exynos_defconfig (arm, gcc-10) — PASS, 0 errors, 0 warnings, 0 section mismatches

--------------------------------------------------------------------------------
ezx_defconfig (arm, gcc-10) — PASS, 0 errors, 0 warnings, 0 section mismatches

--------------------------------------------------------------------------------
footbridge_defconfig (arm, gcc-10) — PASS, 0 errors, 0 warnings, 0 section mismatches

--------------------------------------------------------------------------------
fuloong2e_defconfig (mips, gcc-10) — PASS, 0 errors, 0 warnings, 0 section mismatches

--------------------------------------------------------------------------------
gpr_defconfig (mips, gcc-10) — PASS, 0 errors, 0 warnings, 0 section mismatches

--------------------------------------------------------------------------------
h3600_defconfig (arm, gcc-10) — PASS, 0 errors, 0 warnings, 0 section mismatches

--------------------------------------------------------------------------------
h5000_defconfig (arm, gcc-10) — PASS, 0 errors, 0 warnings, 0 section mismatches

--------------------------------------------------------------------------------
hackkit_defconfig (arm, gcc-10) — PASS, 0 errors, 0 warnings, 0 section mismatches

--------------------------------------------------------------------------------
hisi_defconfig (arm, gcc-10) — PASS, 0 errors, 0 warnings, 0 section mismatches

--------------------------------------------------------------------------------
i386_defconfig (i386, gcc-10) — PASS, 0 errors, 3 warnings, 0 section mismatches

Warnings:
arch/x86/entry/entry_32.S:452: Warning: no instruction mnemonic suffix given and no register operands; using default for `btr'
ld: arch/x86/boot/compressed/head_32.o: warning: relocation in read-only section `.head.text'
ld: warning: creating DT_TEXTREL in a PIE

--------------------------------------------------------------------------------
imote2_defconfig (arm, gcc-10) — PASS, 0 errors, 0 warnings, 0 section mismatches

--------------------------------------------------------------------------------
imx_v4_v5_defconfig (arm, gcc-10) — PASS, 0 errors, 0 warnings, 0 section mismatches

--------------------------------------------------------------------------------
imx_v6_v7_defconfig (arm, gcc-10) — PASS, 0 errors, 0 warnings, 0 section mismatches

--------------------------------------------------------------------------------
integrator_defconfig (arm, gcc-10) — PASS, 0 errors, 0 warnings, 0 section mismatches

Section mismatches:
WARNING: modpost: Found 1 section mismatch(es).

--------------------------------------------------------------------------------
iop13xx_defconfig (arm, gcc-10) — PASS, 0 errors, 0 warnings, 0 section mismatches

--------------------------------------------------------------------------------
iop32x_defconfig (arm, gcc-10) — PASS, 0 errors, 0 warnings, 0 section mismatches

--------------------------------------------------------------------------------
iop33x_defconfig (arm, gcc-10) — PASS, 0 errors, 0 warnings, 0 section mismatches

--------------------------------------------------------------------------------
ip22_defconfig (mips, gcc-10) — PASS, 0 errors, 0 warnings, 0 section mismatches

--------------------------------------------------------------------------------
ip27_defconfig (mips, gcc-10) — FAIL, 0 errors, 0 warnings, 0 section mismatches

--------------------------------------------------------------------------------
ip28_defconfig (mips, gcc-10) — FAIL, 0 errors, 0 warnings, 0 section mismatches

--------------------------------------------------------------------------------
ip32_defconfig (mips, gcc-10) — PASS, 0 errors, 0 warnings, 0 section mismatches

--------------------------------------------------------------------------------
ixp4xx_defconfig (arm, gcc-10) — PASS, 0 errors, 0 warnings, 0 section mismatches

--------------------------------------------------------------------------------
jazz_defconfig (mips, gcc-10) — PASS, 0 errors, 0 warnings, 0 section mismatches

--------------------------------------------------------------------------------
jmr3927_defconfig (mips, gcc-10) — PASS, 0 errors, 0 warnings, 0 section mismatches

--------------------------------------------------------------------------------
jornada720_defconfig (arm, gcc-10) — PASS, 0 errors, 0 warnings, 0 section mismatches

--------------------------------------------------------------------------------
keystone_defconfig (arm, gcc-10) — PASS, 0 errors, 0 warnings, 0 section mismatches

--------------------------------------------------------------------------------
ks8695_defconfig (arm, gcc-10) — PASS, 0 errors, 0 warnings, 0 section mismatches

--------------------------------------------------------------------------------
lart_defconfig (arm, gcc-10) — PASS, 0 errors, 0 warnings, 0 section mismatches

--------------------------------------------------------------------------------
lasat_defconfig (mips, gcc-10) — PASS, 0 errors, 0 warnings, 0 section mismatches

--------------------------------------------------------------------------------
lemote2f_defconfig (mips, gcc-10) — PASS, 0 errors, 0 warnings, 0 section mismatches

--------------------------------------------------------------------------------
loongson1b_defconfig (mips, gcc-10) — PASS, 0 errors, 0 warnings, 0 section mismatches

--------------------------------------------------------------------------------
loongson1c_defconfig (mips, gcc-10) — PASS, 0 errors, 0 warnings, 0 section mismatches

--------------------------------------------------------------------------------
loongson3_defconfig (mips, gcc-10) — PASS, 0 errors, 0 warnings, 0 section mismatches

--------------------------------------------------------------------------------
lpc18xx_defconfig (arm, gcc-10) — PASS, 0 errors, 0 warnings, 0 section mismatches

--------------------------------------------------------------------------------
lpc32xx_defconfig (arm, gcc-10) — PASS, 0 errors, 0 warnings, 0 section mismatches

--------------------------------------------------------------------------------
lpd270_defconfig (arm, gcc-10) — PASS, 0 errors, 0 warnings, 0 section mismatches

--------------------------------------------------------------------------------
lubbock_defconfig (arm, gcc-10) — PASS, 0 errors, 0 warnings, 0 section mismatches

--------------------------------------------------------------------------------
magician_defconfig (arm, gcc-10) — PASS, 0 errors, 0 warnings, 0 section mismatches

--------------------------------------------------------------------------------
mainstone_defconfig (arm, gcc-10) — PASS, 0 errors, 0 warnings, 0 section mismatches

--------------------------------------------------------------------------------
malta_defconfig (mips, gcc-10) — PASS, 0 errors, 0 warnings, 0 section mismatches

--------------------------------------------------------------------------------
malta_kvm_defconfig (mips, gcc-10) — PASS, 0 errors, 0 warnings, 0 section mismatches

--------------------------------------------------------------------------------
malta_kvm_guest_defconfig (mips, gcc-10) — PASS, 0 errors, 0 warnings, 0 section mismatches

--------------------------------------------------------------------------------
malta_qemu_32r6_defconfig (mips, gcc-10) — PASS, 0 errors, 0 warnings, 0 section mismatches

--------------------------------------------------------------------------------
maltaaprp_defconfig (mips, gcc-10) — PASS, 0 errors, 0 warnings, 0 section mismatches

--------------------------------------------------------------------------------
maltasmvp_defconfig (mips, gcc-10) — PASS, 0 errors, 0 warnings, 0 section mismatches

--------------------------------------------------------------------------------
maltasmvp_eva_defconfig (mips, gcc-10) — PASS, 0 errors, 0 warnings, 0 section mismatches

--------------------------------------------------------------------------------
maltaup_defconfig (mips, gcc-10) — PASS, 0 errors, 0 warnings, 0 section mismatches

--------------------------------------------------------------------------------
maltaup_xpa_defconfig (mips, gcc-10) — PASS, 0 errors, 0 warnings, 0 section mismatches

--------------------------------------------------------------------------------
markeins_defconfig (mips, gcc-10) — PASS, 0 errors, 0 warnings, 0 section mismatches

--------------------------------------------------------------------------------
mini2440_defconfig (arm, gcc-10) — PASS, 0 errors, 1 warning, 0 section mismatches

Warnings:
drivers/tty/serial/samsung.c:1783:34: warning: array ‘s3c24xx_uart_dt_match’ assumed to have one element

--------------------------------------------------------------------------------
mips_paravirt_defconfig (mips, gcc-10) — PASS, 0 errors, 0 warnings, 0 section mismatches

--------------------------------------------------------------------------------
mmp2_defconfig (arm, gcc-10) — PASS, 0 errors, 0 warnings, 0 section mismatches

--------------------------------------------------------------------------------
mpc30x_defconfig (mips, gcc-10) — PASS, 0 errors, 0 warnings, 0 section mismatches

--------------------------------------------------------------------------------
mps2_defconfig (arm, gcc-10) — PASS, 0 errors, 0 warnings, 0 section mismatches

--------------------------------------------------------------------------------
msp71xx_defconfig (mips, gcc-10) — PASS, 0 errors, 0 warnings, 0 section mismatches

--------------------------------------------------------------------------------
mtx1_defconfig (mips, gcc-10) — PASS, 0 errors, 3 warnings, 0 section mismatches

Warnings:
sound/pci/echoaudio/echoaudio_dsp.c:647:9: warning: iteration 1073741824 invokes undefined behavior [-Waggressive-loop-optimizations]
sound/pci/echoaudio/echoaudio_dsp.c:658:9: warning: iteration 1073741824 invokes undefined behavior [-Waggressive-loop-optimizations]
sound/pci/echoaudio/echoaudio_dsp.c:647:9: warning: iteration 1073741824 invokes undefined behavior [-Waggressive-loop-optimizations]

--------------------------------------------------------------------------------
multi_v4t_defconfig (arm, gcc-10) — PASS, 0 errors, 0 warnings, 0 section mismatches

--------------------------------------------------------------------------------
multi_v5_defconfig (arm, gcc-10) — PASS, 0 errors, 0 warnings, 0 section mismatches

Section mismatches:
WARNING: modpost: Found 1 section mismatch(es).

--------------------------------------------------------------------------------
multi_v7_defconfig (arm, gcc-10) — PASS, 0 errors, 0 warnings, 0 section mismatches

--------------------------------------------------------------------------------
mvebu_v5_defconfig (arm, gcc-10) — PASS, 0 errors, 0 warnings, 0 section mismatches

--------------------------------------------------------------------------------
mvebu_v7_defconfig (arm, gcc-10) — PASS, 0 errors, 0 warnings, 0 section mismatches

--------------------------------------------------------------------------------
mxs_defconfig (arm, gcc-10) — PASS, 0 errors, 0 warnings, 0 section mismatches

--------------------------------------------------------------------------------
neponset_defconfig (arm, gcc-10) — PASS, 0 errors, 0 warnings, 0 section mismatches

--------------------------------------------------------------------------------
netwinder_defconfig (arm, gcc-10) — PASS, 0 errors, 0 warnings, 0 section mismatches

--------------------------------------------------------------------------------
netx_defconfig (arm, gcc-10) — PASS, 0 errors, 0 warnings, 0 section mismatches

Section mismatches:
WARNING: modpost: Found 1 section mismatch(es).

--------------------------------------------------------------------------------
nhk8815_defconfig (arm, gcc-10) — PASS, 0 errors, 0 warnings, 0 section mismatches

Section mismatches:
WARNING: modpost: Found 1 section mismatch(es).

--------------------------------------------------------------------------------
nlm_xlp_defconfig (mips, gcc-10) — PASS, 0 errors, 0 warnings, 0 section mismatches

--------------------------------------------------------------------------------
nlm_xlr_defconfig (mips, gcc-10) — PASS, 0 errors, 0 warnings, 0 section mismatches

--------------------------------------------------------------------------------
nsim_hs_defconfig (arc, gcc-10) — PASS, 0 errors, 0 warnings, 0 section mismatches

--------------------------------------------------------------------------------
nsim_hs_smp_defconfig (arc, gcc-10) — PASS, 0 errors, 0 warnings, 0 section mismatches

--------------------------------------------------------------------------------
nsimosci_hs_defconfig (arc, gcc-10) — PASS, 0 errors, 0 warnings, 0 section mismatches

--------------------------------------------------------------------------------
nsimosci_hs_smp_defconfig (arc, gcc-10) — PASS, 0 errors, 0 warnings, 0 section mismatches

--------------------------------------------------------------------------------
nuc910_defconfig (arm, gcc-10) — PASS, 0 errors, 0 warnings, 0 section mismatches

--------------------------------------------------------------------------------
nuc950_defconfig (arm, gcc-10) — PASS, 0 errors, 0 warnings, 0 section mismatches

--------------------------------------------------------------------------------
nuc960_defconfig (arm, gcc-10) — PASS, 0 errors, 0 warnings, 0 section mismatches

--------------------------------------------------------------------------------
omap1_defconfig (arm, gcc-10) — PASS, 0 errors, 1 warning, 0 section mismatches

Warnings:
drivers/gpio/gpio-omap.c:1135:34: warning: array ‘omap_gpio_match’ assumed to have one element

--------------------------------------------------------------------------------
omap2plus_defconfig (arm, gcc-10) — PASS, 0 errors, 0 warnings, 0 section mismatches

--------------------------------------------------------------------------------
orion5x_defconfig (arm, gcc-10) — PASS, 0 errors, 0 warnings, 0 section mismatches

--------------------------------------------------------------------------------
palmz72_defconfig (arm, gcc-10) — PASS, 0 errors, 0 warnings, 0 section mismatches

--------------------------------------------------------------------------------
pcm027_defconfig (arm, gcc-10) — PASS, 0 errors, 0 warnings, 0 section mismatches

--------------------------------------------------------------------------------
pic32mzda_defconfig (mips, gcc-10) — PASS, 0 errors, 0 warnings, 0 section mismatches

--------------------------------------------------------------------------------
pleb_defconfig (arm, gcc-10) — PASS, 0 errors, 0 warnings, 0 section mismatches

--------------------------------------------------------------------------------
pnx8335_stb225_defconfig (mips, gcc-10) — PASS, 0 errors, 0 warnings, 0 section mismatches

--------------------------------------------------------------------------------
prima2_defconfig (arm, gcc-10) — PASS, 0 errors, 0 warnings, 0 section mismatches

--------------------------------------------------------------------------------
pxa168_defconfig (arm, gcc-10) — PASS, 0 errors, 0 warnings, 0 section mismatches

--------------------------------------------------------------------------------
pxa255-idp_defconfig (arm, gcc-10) — PASS, 0 errors, 0 warnings, 0 section mismatches

--------------------------------------------------------------------------------
pxa3xx_defconfig (arm, gcc-10) — PASS, 0 errors, 0 warnings, 0 section mismatches

--------------------------------------------------------------------------------
pxa910_defconfig (arm, gcc-10) — PASS, 0 errors, 0 warnings, 0 section mismatches

--------------------------------------------------------------------------------
pxa_defconfig (arm, gcc-10) — PASS, 0 errors, 0 warnings, 0 section mismatches

--------------------------------------------------------------------------------
qcom_defconfig (arm, gcc-10) — PASS, 0 errors, 0 warnings, 0 section mismatches

--------------------------------------------------------------------------------
qi_lb60_defconfig (mips, gcc-10) — PASS, 0 errors, 0 warnings, 0 section mismatches

--------------------------------------------------------------------------------
raumfeld_defconfig (arm, gcc-10) — PASS, 0 errors, 0 warnings, 0 section mismatches

--------------------------------------------------------------------------------
rb532_defconfig (mips, gcc-10) — PASS, 0 errors, 0 warnings, 0 section mismatches

--------------------------------------------------------------------------------
rbtx49xx_defconfig (mips, gcc-10) — PASS, 0 errors, 0 warnings, 0 section mismatches

--------------------------------------------------------------------------------
realview_defconfig (arm, gcc-10) — PASS, 0 errors, 0 warnings, 0 section mismatches

--------------------------------------------------------------------------------
rm200_defconfig (mips, gcc-10) — PASS, 0 errors, 0 warnings, 0 section mismatches

--------------------------------------------------------------------------------
rpc_defconfig (arm, gcc-10) — FAIL, 2 errors, 0 warnings, 0 section mismatches

Errors:
arm-linux-gnueabihf-gcc: error: unrecognized -march target: armv3
arm-linux-gnueabihf-gcc: error: missing argument to ‘-march=’

--------------------------------------------------------------------------------
rt305x_defconfig (mips, gcc-10) — PASS, 0 errors, 0 warnings, 0 section mismatches

--------------------------------------------------------------------------------
s3c2410_defconfig (arm, gcc-10) — PASS, 0 errors, 1 warning, 0 section mismatches

Warnings:
drivers/tty/serial/samsung.c:1783:34: warning: array ‘s3c24xx_uart_dt_match’ assumed to have one element

--------------------------------------------------------------------------------
s3c6400_defconfig (arm, gcc-10) — PASS, 0 errors, 0 warnings, 0 section mismatches

Section mismatches:
WARNING: modpost: Found 1 section mismatch(es).

--------------------------------------------------------------------------------
s5pv210_defconfig (arm, gcc-10) — PASS, 0 errors, 0 warnings, 0 section mismatches

Section mismatches:
WARNING: modpost: Found 1 section mismatch(es).

--------------------------------------------------------------------------------
sama5_defconfig (arm, gcc-10) — PASS, 0 errors, 0 warnings, 0 section mismatches

--------------------------------------------------------------------------------
sb1250_swarm_defconfig (mips, gcc-10) — PASS, 0 errors, 0 warnings, 0 section mismatches

--------------------------------------------------------------------------------
shannon_defconfig (arm, gcc-10) — PASS, 0 errors, 0 warnings, 0 section mismatches

--------------------------------------------------------------------------------
shmobile_defconfig (arm, gcc-10) — PASS, 0 errors, 0 warnings, 0 section mismatches

--------------------------------------------------------------------------------
simpad_defconfig (arm, gcc-10) — PASS, 0 errors, 0 warnings, 0 section mismatches

--------------------------------------------------------------------------------
socfpga_defconfig (arm, gcc-10) — PASS, 0 errors, 0 warnings, 0 section mismatches

--------------------------------------------------------------------------------
spear13xx_defconfig (arm, gcc-10) — PASS, 0 errors, 0 warnings, 0 section mismatches

--------------------------------------------------------------------------------
spear3xx_defconfig (arm, gcc-10) — PASS, 0 errors, 0 warnings, 0 section mismatches

Section mismatches:
WARNING: modpost: Found 1 section mismatch(es).

--------------------------------------------------------------------------------
spear6xx_defconfig (arm, gcc-10) — PASS, 0 errors, 0 warnings, 0 section mismatches

Section mismatches:
WARNING: modpost: Found 1 section mismatch(es).

--------------------------------------------------------------------------------
spitz_defconfig (arm, gcc-10) — PASS, 0 errors, 0 warnings, 0 section mismatches

--------------------------------------------------------------------------------
stm32_defconfig (arm, gcc-10) — PASS, 0 errors, 0 warnings, 0 section mismatches

--------------------------------------------------------------------------------
sunxi_defconfig (arm, gcc-10) — PASS, 0 errors, 0 warnings, 0 section mismatches

--------------------------------------------------------------------------------
tb0219_defconfig (mips, gcc-10) — PASS, 0 errors, 0 warnings, 0 section mismatches

--------------------------------------------------------------------------------
tb0226_defconfig (mips, gcc-10) — PASS, 0 errors, 0 warnings, 0 section mismatches

--------------------------------------------------------------------------------
tb0287_defconfig (mips, gcc-10) — PASS, 0 errors, 0 warnings, 0 section mismatches

--------------------------------------------------------------------------------
tct_hammer_defconfig (arm, gcc-10) — PASS, 0 errors, 0 warnings, 0 section mismatches

--------------------------------------------------------------------------------
tegra_defconfig (arm, gcc-10) — PASS, 0 errors, 0 warnings, 0 section mismatches

--------------------------------------------------------------------------------
tinyconfig (mips, gcc-10) — PASS, 0 errors, 0 warnings, 0 section mismatches

--------------------------------------------------------------------------------
tinyconfig (i386, gcc-10) — PASS, 0 errors, 3 warnings, 0 section mismatches

Warnings:
arch/x86/entry/entry_32.S:452: Warning: no instruction mnemonic suffix given and no register operands; using default for `btr'
ld: arch/x86/boot/compressed/head_32.o: warning: relocation in read-only section `.head.text'
ld: warning: creating DT_TEXTREL in a PIE

--------------------------------------------------------------------------------
tinyconfig (arc, gcc-10) — PASS, 0 errors, 0 warnings, 0 section mismatches

--------------------------------------------------------------------------------
tinyconfig (x86_64, gcc-10) — PASS, 0 errors, 4 warnings, 0 section mismatches

Warnings:
arch/x86/entry/entry_64.S:1565: Warning: no instruction mnemonic suffix given and no register operands; using default for `sysret'
arch/x86/kernel/process.c:460: Warning: no instruction mnemonic suffix given and no register operands; using default for `btr'
ld: arch/x86/boot/compressed/head_64.o: warning: relocation in read-only section `.head.text'
ld: warning: creating DT_TEXTREL in a PIE

--------------------------------------------------------------------------------
trizeps4_defconfig (arm, gcc-10) — PASS, 0 errors, 0 warnings, 0 section mismatches

--------------------------------------------------------------------------------
u300_defconfig (arm, gcc-10) — PASS, 0 errors, 0 warnings, 0 section mismatches

Section mismatches:
WARNING: modpost: Found 1 section mismatch(es).

--------------------------------------------------------------------------------
u8500_defconfig (arm, gcc-10) — PASS, 0 errors, 0 warnings, 0 section mismatches

--------------------------------------------------------------------------------
vdk_hs38_defconfig (arc, gcc-10) — PASS, 0 errors, 0 warnings, 0 section mismatches

--------------------------------------------------------------------------------
vdk_hs38_smp_defconfig (arc, gcc-10) — PASS, 0 errors, 0 warnings, 0 section mismatches

--------------------------------------------------------------------------------
versatile_defconfig (arm, gcc-10) — PASS, 0 errors, 0 warnings, 0 section mismatches

Section mismatches:
WARNING: modpost: Found 1 section mismatch(es).

--------------------------------------------------------------------------------
vexpress_defconfig (arm, gcc-10) — PASS, 0 errors, 0 warnings, 0 section mismatches

--------------------------------------------------------------------------------
vf610m4_defconfig (arm, gcc-10) — PASS, 0 errors, 0 warnings, 0 section mismatches

--------------------------------------------------------------------------------
viper_defconfig (arm, gcc-10) — PASS, 0 errors, 0 warnings, 0 section mismatches

--------------------------------------------------------------------------------
vt8500_v6_v7_defconfig (arm, gcc-10) — PASS, 0 errors, 0 warnings, 0 section mismatches

--------------------------------------------------------------------------------
workpad_defconfig (mips, gcc-10) — PASS, 0 errors, 0 warnings, 0 section mismatches

--------------------------------------------------------------------------------
x86_64_defconfig (x86_64, gcc-10) — PASS, 0 errors, 5 warnings, 0 section mismatches

Warnings:
arch/x86/entry/entry_64.S:1565: Warning: no instruction mnemonic suffix given and no register operands; using default for `sysret'
arch/x86/kernel/process.c:460: Warning: no instruction mnemonic suffix given and no register operands; using default for `btr'
arch/x86/kernel/process.c:460: Warning: no instruction mnemonic suffix given and no register operands; using default for `btr'
ld: arch/x86/boot/compressed/head_64.o: warning: relocation in read-only section `.head.text'
ld: warning: creating DT_TEXTREL in a PIE

--------------------------------------------------------------------------------
x86_64_defconfig+x86-chromebook (x86_64, gcc-10) — PASS, 0 errors, 5 warnings, 0 section mismatches

Warnings:
arch/x86/entry/entry_64.S:1565: Warning: no instruction mnemonic suffix given and no register operands; using default for `sysret'
arch/x86/kernel/process.c:460: Warning: no instruction mnemonic suffix given and no register operands; using default for `btr'
arch/x86/kernel/process.c:460: Warning: no instruction mnemonic suffix given and no register operands; using default for `btr'
ld: arch/x86/boot/compressed/head_64.o: warning: relocation in read-only section `.head.text'
ld: warning: creating DT_TEXTREL in a PIE

--------------------------------------------------------------------------------
xcep_defconfig (arm, gcc-10) — PASS, 0 errors, 0 warnings, 0 section mismatches

--------------------------------------------------------------------------------
xilfpga_defconfig (mips, gcc-10) — PASS, 0 errors, 0 warnings, 0 section mismatches

--------------------------------------------------------------------------------
zebu_hs_defconfig (arc, gcc-10) — PASS, 0 errors, 0 warnings, 0 section mismatches

--------------------------------------------------------------------------------
zebu_hs_smp_defconfig (arc, gcc-10) — PASS, 0 errors, 0 warnings, 0 section mismatches

--------------------------------------------------------------------------------
zeus_defconfig (arm, gcc-10) — PASS, 0 errors, 0 warnings, 0 section mismatches

--------------------------------------------------------------------------------
zx_defconfig (arm, gcc-10) — PASS, 0 errors, 0 warnings, 0 section mismatches

---
For more info write to <info@...>


New CVE entries this week

Masami Ichikawa
 

Hi !

It's this week's CVE report.

This week reported 8 CVEs and 2 updated CVEs.

* New CVEs

CVE-2022-2318: UAF vulnerabilities in rose protocol

CVSS v3 score is not assigned.

A use-after-free bug was found in net/rose/rose_timer.c. An attacker
will be able to crash system via this vulnerability.
4.4 kernel is vulnerable too.

No CIP member enables CONFIG_ROSE.

Fixed status
mainline: [9cc02ede696272c5271a401e4f27c262359bc2f6]

CVE-2022-26365: Xen Linux disk/nic frontends data leaks

CVSS v3 score is not assigned.

When allocating a shared page in
fill_grant_buffer()/blkfront_setup_indirect() via alloc_page(), it
doesn't initialize the allocated page.
In the result, unintended data in the page will leak.

4.4 kernel seems to be vulnerable.

Fixed status
mainline: [2f446ffe9d737e9a844b97887919c4fda18246e7]

CVE-2022-33740: Xen Linux disk/nic frontends data leaks

CVSS v3 score is not assigned.

When allocating a shared page in xennet_alloc_one_rx_buffer() via
alloc_page(), it doesn't initialize the allocated page.
In the result, unintended data in the page will leak.

4.4 kernel seems to be vulnerable.

Fixed status
mainline: [307c8de2b02344805ebead3440d8feed28f2f010]

CVE-2022-33741: Xen Linux disk/nic frontends data leaks

CVSS v3 score is not assigned.

Xen backend will be able to read data from a shared page which is not
related to this backend.

Commit 4491001 ("xen/netfront: force data bouncing when backend is
untrusted") is based on commit fd07160 ("xen-netfront: avoid packet
loss when ethernet header crosses page boundary") which is not merged
in 4.4.

Fixed status
mainline: [4491001c2e0fa69efbb748c96ec96b100a5cdb7e]

CVE-2022-33742: Xen Linux disk/nic frontends data leaks

CVSS v3 score is not assigned.

Xen backend will be able to read data from a shared page which is not
related to this backend.

Commit 2400617 ("xen/blkfront: force data bouncing when backend is
untrusted") is based on commit 3df0e50 ("xen/blkfront: pseudo support
for multi hardware queues/rings") which is not merged in 4.4.

Fixed status
mainline: [2400617da7eebf9167d71a46122828bc479d64c9]

CVE-2022-33743: Xen network backend may cause Linux netfront to use freed SKBs

CVSS v3 score is not assigned.

Xen's network backend will use freed SKBs which will cause system crash.

4.4 seems vulnerable.
Apply commit f63c2c2 will fail because it modifies blkif_free_ring()
which is introduced by commit 3df0e50 ("xen/blkfront: pseudo support
for multi hardware queues/rings").

Fixed status
mainline: [f63c2c2032c2e3caad9add3b82cc6e91c376fd26]

CVE-2022-33744: Xen Arm guests can cause Dom0 DoS via PV devices

CVSS v3 score is not assigned.

Arm guests can cause Dom0 DoS via PV devices When mapping pages of
guests on Arm.
4.4 seems to be vulnerable.

Fixed status
mainline: [b75cd218274e01d026dc5240e86fdeb44bbed0c8]

CVE-2022-34918: netfilter: nf_tables: stricter validation of element data

CVSS v3 score is not assigned.

A heap overflow bug was found in nft_set_elem_init() in netfilter
subsystem. This bug lead to a local privilege escalation.
This vulnerability was introduced by commit fdb9c40 ("netfilter:
nf_tables: allow up to 64 bytes in the set element data area") which
is merged in 5.8-r1. The commit fdb9c40 is not backported to 4.x
stable kernels.
However, commit 7e6bc1f ("netfilter: nf_tables: stricter validation of
element data") mentions 7d7402642ea ("netfilter: nf_tables: variable
sized set element keys / data") introduced this bug. So, it seems that
a vulnerability was introduced by commit fdb9c40 and a bug not
vulnerable bug was introduced by commit 7d7402642eaf.

Fixed status
Fixed in netdev
tree(https://git.kernel.org/pub/scm/linux/kernel/git/netdev/net.git/commit/?id=7e6bc1f6cabcd30aba0b11219d8e01b952eacbb6)but
not merged into the mainline yet.

* Updated CVEs

CVE-2021-33624: Linux kernel BPF protection against speculative
execution attacks can be bypassed to read arbitrary kernel memory

Commit 30ea1c5 ("bpf, selftests: Adjust few selftest outcomes wrt
unreachable code") was added to stable/5.10.

Fixed status
mainline: [d203b0fd863a2261e5d00b97f3d060c4c2a6db71,
fe9a5ca7e370e613a9a75a13008a3845ea759d6e,
9183671af6dbf60a1219371d4ed73e23f43b49db,
973377ffe8148180b2651825b92ae91988141b05]
stable/4.19: [0abc8c9754c953f5cd0ac7488c668ca8d53ffc90,
c510c1845f7b54214b4117272e0d87dff8732af6,
9df311b2e743642c5427ecf563c5050ceb355d1d,
c15b387769446c37a892f958b169744dabf7ff23]
stable/5.10: [e9d271731d21647f8f9e9a261582cf47b868589a,
8c82c52d1de931532200b447df8b4fc92129cfd9,
5fc6ed1831ca5a30fb0ceefd5e33c7c689e7627b,
30ea1c535291e88e41413464277fcf98a95cf8c6]
stable/5.12: [408a4956acde24413f3c684912b1d3e404bed8e2,
68a1936e1812653b68c5b68e698d88fb35018835,
4a99047ed51c98a09a537fe2c12420d815dfe296,
e5e2010ac3e27efa1e6e830b250f491da82d51b4]
stable/5.4: [283d742988f6b304f32110f39e189a00d4e52b92,
d2f790327f83b457db357e7c66f942bc00d43462,
fd568de5806f8859190e6305a1792ba8cb20de61,
a0f66ddf05c2050e1b7f53256bd9c25c2bb3022b]

CVE-2022-23038: Xen: fix race conditions, resulting in potential data
leaks, data corruption, DoS by malicious backends

stable 4.19 was fixed this week.

Fixed status
mainline: [6b1775f26a2da2b05a6dc8ec2b5d14e9a4701a1a,
33172ab50a53578a95691310f49567c9266968b0]
stable/4.19: [17659846fe336366b1663194f5669d10f5947f53,
62a696c15cfcfd32527f81ca3d94f2bde57475dc]
stable/4.9: [73e1d9b33f2bd93ce30719dfc8990b6328243b7e,
98bdfdf89e987406f4afdc7694cbdbb715383d8e]
stable/5.10: [3d81e85f30a8f712c3e4f2a507553d9063a20ed6,
3047255182774266950b22acc29c22a2d76e859e]

Currently tracking CVEs

CVE-2021-31615: Unencrypted Bluetooth Low Energy baseband links in
Bluetooth Core Specifications 4.0 through 5.2

There is no fix information.

CVE-2020-26556: kernel: malleable commitment Bluetooth Mesh Provisioning

No fix information.

CVE-2020-26557: kernel: predictable Authvalue in Bluetooth Mesh
Provisioning Leads to MITM

No fix information.

CVE-2020-26559: kernel: Authvalue leak in Bluetooth Mesh Provisioning

No fix information.

CVE-2020-26560: kernel: impersonation attack in Bluetooth Mesh Provisioning

No fix information.

Regards,
--
Masami Ichikawa
Cybertrust Japan Co., Ltd.

Email :masami.ichikawa@...
:masami.ichikawa@...


cip-gitlab/ci/iwamatsu/linux-4.4.y-cip-rc baseline: 36 runs, 4 regressions (v4.4.302-1085-gb83ed90eb98d) #kernelci

kernelci.org bot <bot@...>
 

cip-gitlab/ci/iwamatsu/linux-4.4.y-cip-rc baseline: 36 runs, 4 regressions (v4.4.302-1085-gb83ed90eb98d)

Regressions Summary
-------------------

platform | arch | lab | compiler | defconfig | regressions
----------------------+-------+--------------+----------+----------------------------+------------
qemu_arm64-virt-gicv2 | arm64 | lab-baylibre | gcc-10 | defconfig+arm64-chromebook | 1
qemu_arm64-virt-gicv2 | arm64 | lab-broonie | gcc-10 | defconfig+arm64-chromebook | 1
qemu_arm64-virt-gicv3 | arm64 | lab-baylibre | gcc-10 | defconfig+arm64-chromebook | 1
qemu_arm64-virt-gicv3 | arm64 | lab-broonie | gcc-10 | defconfig+arm64-chromebook | 1

Details: https://kernelci.org/test/job/cip-gitlab/branch/ci%2Fiwamatsu%2Flinux-4.4.y-cip-rc/kernel/v4.4.302-1085-gb83ed90eb98d/plan/baseline/

Test: baseline
Tree: cip-gitlab
Branch: ci/iwamatsu/linux-4.4.y-cip-rc
Describe: v4.4.302-1085-gb83ed90eb98d
URL: https://gitlab.com/cip-project/cip-kernel/linux-cip.git
SHA: b83ed90eb98d96fda5562e79c3b9e30afd7ee105


Test Regressions
----------------


platform | arch | lab | compiler | defconfig | regressions
----------------------+-------+--------------+----------+----------------------------+------------
qemu_arm64-virt-gicv2 | arm64 | lab-baylibre | gcc-10 | defconfig+arm64-chromebook | 1

Details: https://kernelci.org/test/plan/id/62c5522e42b4cce542a39bd8

Results: 0 PASS, 1 FAIL, 0 SKIP
Full config: defconfig+arm64-chromebook
Compiler: gcc-10 (aarch64-linux-gnu-gcc (Debian 10.2.1-6) 10.2.1 20210110)
Plain log: https://storage.kernelci.org//cip-gitlab/ci-iwamatsu-linux-4.4.y-cip-rc/v4.4.302-1085-gb83ed90eb98d/arm64/defconfig+arm64-chromebook/gcc-10/lab-baylibre/baseline-qemu_arm64-virt-gicv2.txt
HTML log: https://storage.kernelci.org//cip-gitlab/ci-iwamatsu-linux-4.4.y-cip-rc/v4.4.302-1085-gb83ed90eb98d/arm64/defconfig+arm64-chromebook/gcc-10/lab-baylibre/baseline-qemu_arm64-virt-gicv2.html
Rootfs: http://storage.kernelci.org/images/rootfs/buildroot/buildroot-baseline/20220624.0/arm64/rootfs.cpio.gz


* baseline.login: https://kernelci.org/test/case/id/62c5522e42b4cce542a39bd9
new failure (last pass: v4.4.302-1082-g00b9de85d40e)



platform | arch | lab | compiler | defconfig | regressions
----------------------+-------+--------------+----------+----------------------------+------------
qemu_arm64-virt-gicv2 | arm64 | lab-broonie | gcc-10 | defconfig+arm64-chromebook | 1

Details: https://kernelci.org/test/plan/id/62c5523c42b4cce542a39be3

Results: 0 PASS, 1 FAIL, 0 SKIP
Full config: defconfig+arm64-chromebook
Compiler: gcc-10 (aarch64-linux-gnu-gcc (Debian 10.2.1-6) 10.2.1 20210110)
Plain log: https://storage.kernelci.org//cip-gitlab/ci-iwamatsu-linux-4.4.y-cip-rc/v4.4.302-1085-gb83ed90eb98d/arm64/defconfig+arm64-chromebook/gcc-10/lab-broonie/baseline-qemu_arm64-virt-gicv2.txt
HTML log: https://storage.kernelci.org//cip-gitlab/ci-iwamatsu-linux-4.4.y-cip-rc/v4.4.302-1085-gb83ed90eb98d/arm64/defconfig+arm64-chromebook/gcc-10/lab-broonie/baseline-qemu_arm64-virt-gicv2.html
Rootfs: http://storage.kernelci.org/images/rootfs/buildroot/buildroot-baseline/20220624.0/arm64/rootfs.cpio.gz


* baseline.login: https://kernelci.org/test/case/id/62c5523c42b4cce542a39be4
new failure (last pass: v4.4.302-1082-g00b9de85d40e)



platform | arch | lab | compiler | defconfig | regressions
----------------------+-------+--------------+----------+----------------------------+------------
qemu_arm64-virt-gicv3 | arm64 | lab-baylibre | gcc-10 | defconfig+arm64-chromebook | 1

Details: https://kernelci.org/test/plan/id/62c5522d42b4cce542a39bd2

Results: 0 PASS, 1 FAIL, 0 SKIP
Full config: defconfig+arm64-chromebook
Compiler: gcc-10 (aarch64-linux-gnu-gcc (Debian 10.2.1-6) 10.2.1 20210110)
Plain log: https://storage.kernelci.org//cip-gitlab/ci-iwamatsu-linux-4.4.y-cip-rc/v4.4.302-1085-gb83ed90eb98d/arm64/defconfig+arm64-chromebook/gcc-10/lab-baylibre/baseline-qemu_arm64-virt-gicv3.txt
HTML log: https://storage.kernelci.org//cip-gitlab/ci-iwamatsu-linux-4.4.y-cip-rc/v4.4.302-1085-gb83ed90eb98d/arm64/defconfig+arm64-chromebook/gcc-10/lab-baylibre/baseline-qemu_arm64-virt-gicv3.html
Rootfs: http://storage.kernelci.org/images/rootfs/buildroot/buildroot-baseline/20220624.0/arm64/rootfs.cpio.gz


* baseline.login: https://kernelci.org/test/case/id/62c5522d42b4cce542a39bd3
new failure (last pass: v4.4.302-1082-g00b9de85d40e)



platform | arch | lab | compiler | defconfig | regressions
----------------------+-------+--------------+----------+----------------------------+------------
qemu_arm64-virt-gicv3 | arm64 | lab-broonie | gcc-10 | defconfig+arm64-chromebook | 1

Details: https://kernelci.org/test/plan/id/62c5523b42b4cce542a39bdf

Results: 0 PASS, 1 FAIL, 0 SKIP
Full config: defconfig+arm64-chromebook
Compiler: gcc-10 (aarch64-linux-gnu-gcc (Debian 10.2.1-6) 10.2.1 20210110)
Plain log: https://storage.kernelci.org//cip-gitlab/ci-iwamatsu-linux-4.4.y-cip-rc/v4.4.302-1085-gb83ed90eb98d/arm64/defconfig+arm64-chromebook/gcc-10/lab-broonie/baseline-qemu_arm64-virt-gicv3.txt
HTML log: https://storage.kernelci.org//cip-gitlab/ci-iwamatsu-linux-4.4.y-cip-rc/v4.4.302-1085-gb83ed90eb98d/arm64/defconfig+arm64-chromebook/gcc-10/lab-broonie/baseline-qemu_arm64-virt-gicv3.html
Rootfs: http://storage.kernelci.org/images/rootfs/buildroot/buildroot-baseline/20220624.0/arm64/rootfs.cpio.gz


* baseline.login: https://kernelci.org/test/case/id/62c5523b42b4cce542a39be0
new failure (last pass: v4.4.302-1082-g00b9de85d40e)


cip-gitlab/ci/iwamatsu/linux-4.4.y-cip-rc build: 162 builds: 4 failed, 158 passed, 4 errors, 30 warnings (v4.4.302-1085-gb83ed90eb98d) #kernelci

kernelci.org bot <bot@...>
 

cip-gitlab/ci/iwamatsu/linux-4.4.y-cip-rc build: 162 builds: 4 failed, 158 passed, 4 errors, 30 warnings (v4.4.302-1085-gb83ed90eb98d)

Full Build Summary: https://kernelci.org/build/cip-gitlab/branch/ci%2Fiwamatsu%2Flinux-4.4.y-cip-rc/kernel/v4.4.302-1085-gb83ed90eb98d/

Tree: cip-gitlab
Branch: ci/iwamatsu/linux-4.4.y-cip-rc
Git Describe: v4.4.302-1085-gb83ed90eb98d
Git Commit: b83ed90eb98d96fda5562e79c3b9e30afd7ee105
Git URL: https://gitlab.com/cip-project/cip-kernel/linux-cip.git
Built: 6 unique architectures

Build Failures Detected:

mips:
fuloong2e_defconfig: (gcc-10) FAIL
ip27_defconfig: (gcc-10) FAIL
ip28_defconfig: (gcc-10) FAIL
lemote2f_defconfig: (gcc-10) FAIL

Errors and Warnings Detected:

arc:

arm64:
defconfig (gcc-10): 1 warning
defconfig+arm64-chromebook (gcc-10): 1 warning

arm:
davinci_all_defconfig (gcc-10): 1 warning
lpc32xx_defconfig (gcc-10): 1 warning
mini2440_defconfig (gcc-10): 1 warning
mxs_defconfig (gcc-10): 1 warning
omap1_defconfig (gcc-10): 1 warning
omap2plus_defconfig (gcc-10): 1 warning
s3c2410_defconfig (gcc-10): 1 warning
s3c6400_defconfig (gcc-10): 2 warnings

i386:
i386_defconfig (gcc-10): 2 warnings

mips:
fuloong2e_defconfig (gcc-10): 2 errors
ip22_defconfig (gcc-10): 1 warning
lemote2f_defconfig (gcc-10): 2 errors
mtx1_defconfig (gcc-10): 3 warnings

x86_64:
allnoconfig (gcc-10): 4 warnings
tinyconfig (gcc-10): 3 warnings
x86_64_defconfig (gcc-10): 6 warnings

Errors summary:

4 cc1: error: ‘-mloongson-mmi’ must be used with ‘-mhard-float’

Warnings summary:

5 arch/x86/kernel/process.c:456: Warning: no instruction mnemonic suffix given and no register operands; using default for `btr'
3 drivers/tty/serial/samsung.c:1780:34: warning: array ‘s3c24xx_uart_dt_match’ assumed to have one element
3 arch/x86/entry/entry_64.S:487: Warning: no instruction mnemonic suffix given and no register operands; using default for `btr'
3 arch/x86/entry/entry_64.S:1642: Warning: no instruction mnemonic suffix given and no register operands; using default for `sysret'
2 sound/pci/echoaudio/echoaudio_dsp.c:647:9: warning: iteration 1073741824 invokes undefined behavior [-Waggressive-loop-optimizations]
2 ld: warning: creating DT_TEXTREL in a PIE
2 drivers/net/ethernet/apm/xgene/xgene_enet_main.c:32:36: warning: array ‘xgene_enet_acpi_match’ assumed to have one element
1 sound/pci/echoaudio/echoaudio_dsp.c:658:9: warning: iteration 1073741824 invokes undefined behavior [-Waggressive-loop-optimizations]
1 ld: arch/x86/boot/compressed/head_64.o: warning: relocation in read-only section `.head.text'
1 ld: arch/x86/boot/compressed/head_32.o: warning: relocation in read-only section `.head.text'
1 drivers/net/ethernet/seeq/sgiseeq.c:804:26: warning: passing argument 5 of ‘dma_free_attrs’ makes pointer from integer without a cast [-Wint-conversion]
1 drivers/mmc/host/sdhci-s3c.c:429:34: warning: array ‘sdhci_s3c_dt_match’ assumed to have one element
1 drivers/gpio/gpio-omap.c:1161:34: warning: array ‘omap_gpio_match’ assumed to have one element
1 drivers/cpufreq/ti-cpufreq.c:250:24: warning: passing argument 1 of ‘PTR_ERR_OR_ZERO’ makes pointer from integer without a cast [-Wint-conversion]
1 arch/arm/mach-mxs/mach-mxs.c:285:26: warning: duplicate ‘const’ declaration specifier [-Wduplicate-decl-specifier]
1 arch/arm/mach-lpc32xx/phy3250.c:215:36: warning: duplicate ‘const’ declaration specifier [-Wduplicate-decl-specifier]
1 arch/arm/mach-davinci/da8xx-dt.c:23:34: warning: duplicate ‘const’ declaration specifier [-Wduplicate-decl-specifier]

================================================================================

Detailed per-defconfig build reports:

--------------------------------------------------------------------------------
acs5k_defconfig (arm, gcc-10) — PASS, 0 errors, 0 warnings, 0 section mismatches

--------------------------------------------------------------------------------
acs5k_tiny_defconfig (arm, gcc-10) — PASS, 0 errors, 0 warnings, 0 section mismatches

--------------------------------------------------------------------------------
allnoconfig (x86_64, gcc-10) — PASS, 0 errors, 4 warnings, 0 section mismatches

Warnings:
arch/x86/entry/entry_64.S:487: Warning: no instruction mnemonic suffix given and no register operands; using default for `btr'
arch/x86/entry/entry_64.S:1642: Warning: no instruction mnemonic suffix given and no register operands; using default for `sysret'
arch/x86/kernel/process.c:456: Warning: no instruction mnemonic suffix given and no register operands; using default for `btr'
arch/x86/kernel/process.c:456: Warning: no instruction mnemonic suffix given and no register operands; using default for `btr'

--------------------------------------------------------------------------------
allnoconfig (mips, gcc-10) — PASS, 0 errors, 0 warnings, 0 section mismatches

--------------------------------------------------------------------------------
allnoconfig (arm, gcc-10) — PASS, 0 errors, 0 warnings, 0 section mismatches

--------------------------------------------------------------------------------
allnoconfig (arc, gcc-10) — PASS, 0 errors, 0 warnings, 0 section mismatches

--------------------------------------------------------------------------------
allnoconfig (i386, gcc-10) — PASS, 0 errors, 0 warnings, 0 section mismatches

--------------------------------------------------------------------------------
am200epdkit_defconfig (arm, gcc-10) — PASS, 0 errors, 0 warnings, 0 section mismatches

--------------------------------------------------------------------------------
assabet_defconfig (arm, gcc-10) — PASS, 0 errors, 0 warnings, 0 section mismatches

--------------------------------------------------------------------------------
at91_dt_defconfig (arm, gcc-10) — PASS, 0 errors, 0 warnings, 0 section mismatches

--------------------------------------------------------------------------------
axs103_defconfig (arc, gcc-10) — PASS, 0 errors, 0 warnings, 0 section mismatches

--------------------------------------------------------------------------------
axs103_smp_defconfig (arc, gcc-10) — PASS, 0 errors, 0 warnings, 0 section mismatches

--------------------------------------------------------------------------------
badge4_defconfig (arm, gcc-10) — PASS, 0 errors, 0 warnings, 0 section mismatches

--------------------------------------------------------------------------------
bcm47xx_defconfig (mips, gcc-10) — PASS, 0 errors, 0 warnings, 0 section mismatches

--------------------------------------------------------------------------------
bcm63xx_defconfig (mips, gcc-10) — PASS, 0 errors, 0 warnings, 0 section mismatches

--------------------------------------------------------------------------------
bcm_defconfig (arm, gcc-10) — PASS, 0 errors, 0 warnings, 0 section mismatches

--------------------------------------------------------------------------------
bigsur_defconfig (mips, gcc-10) — PASS, 0 errors, 0 warnings, 0 section mismatches

--------------------------------------------------------------------------------
bmips_be_defconfig (mips, gcc-10) — PASS, 0 errors, 0 warnings, 0 section mismatches

--------------------------------------------------------------------------------
bmips_stb_defconfig (mips, gcc-10) — PASS, 0 errors, 0 warnings, 0 section mismatches

--------------------------------------------------------------------------------
cavium_octeon_defconfig (mips, gcc-10) — PASS, 0 errors, 0 warnings, 0 section mismatches

--------------------------------------------------------------------------------
cerfcube_defconfig (arm, gcc-10) — PASS, 0 errors, 0 warnings, 0 section mismatches

--------------------------------------------------------------------------------
ci20_defconfig (mips, gcc-10) — PASS, 0 errors, 0 warnings, 0 section mismatches

--------------------------------------------------------------------------------
cm_x2xx_defconfig (arm, gcc-10) — PASS, 0 errors, 0 warnings, 0 section mismatches

--------------------------------------------------------------------------------
cm_x300_defconfig (arm, gcc-10) — PASS, 0 errors, 0 warnings, 0 section mismatches

--------------------------------------------------------------------------------
cobalt_defconfig (mips, gcc-10) — PASS, 0 errors, 0 warnings, 0 section mismatches

--------------------------------------------------------------------------------
colibri_pxa270_defconfig (arm, gcc-10) — PASS, 0 errors, 0 warnings, 0 section mismatches

--------------------------------------------------------------------------------
colibri_pxa300_defconfig (arm, gcc-10) — PASS, 0 errors, 0 warnings, 0 section mismatches

--------------------------------------------------------------------------------
collie_defconfig (arm, gcc-10) — PASS, 0 errors, 0 warnings, 0 section mismatches

--------------------------------------------------------------------------------
corgi_defconfig (arm, gcc-10) — PASS, 0 errors, 0 warnings, 0 section mismatches

--------------------------------------------------------------------------------
davinci_all_defconfig (arm, gcc-10) — PASS, 0 errors, 1 warning, 0 section mismatches

Warnings:
arch/arm/mach-davinci/da8xx-dt.c:23:34: warning: duplicate ‘const’ declaration specifier [-Wduplicate-decl-specifier]

--------------------------------------------------------------------------------
db1xxx_defconfig (mips, gcc-10) — PASS, 0 errors, 0 warnings, 0 section mismatches

--------------------------------------------------------------------------------
decstation_defconfig (mips, gcc-10) — PASS, 0 errors, 0 warnings, 0 section mismatches

--------------------------------------------------------------------------------
defconfig (arm64, gcc-10) — PASS, 0 errors, 1 warning, 0 section mismatches

Warnings:
drivers/net/ethernet/apm/xgene/xgene_enet_main.c:32:36: warning: array ‘xgene_enet_acpi_match’ assumed to have one element

--------------------------------------------------------------------------------
defconfig+arm64-chromebook (arm64, gcc-10) — PASS, 0 errors, 1 warning, 0 section mismatches

Warnings:
drivers/net/ethernet/apm/xgene/xgene_enet_main.c:32:36: warning: array ‘xgene_enet_acpi_match’ assumed to have one element

--------------------------------------------------------------------------------
dove_defconfig (arm, gcc-10) — PASS, 0 errors, 0 warnings, 0 section mismatches

--------------------------------------------------------------------------------
ebsa110_defconfig (arm, gcc-10) — PASS, 0 errors, 0 warnings, 0 section mismatches

--------------------------------------------------------------------------------
efm32_defconfig (arm, gcc-10) — PASS, 0 errors, 0 warnings, 0 section mismatches

--------------------------------------------------------------------------------
em_x270_defconfig (arm, gcc-10) — PASS, 0 errors, 0 warnings, 0 section mismatches

--------------------------------------------------------------------------------
ep93xx_defconfig (arm, gcc-10) — PASS, 0 errors, 0 warnings, 0 section mismatches

--------------------------------------------------------------------------------
eseries_pxa_defconfig (arm, gcc-10) — PASS, 0 errors, 0 warnings, 0 section mismatches

--------------------------------------------------------------------------------
exynos_defconfig (arm, gcc-10) — PASS, 0 errors, 0 warnings, 0 section mismatches

--------------------------------------------------------------------------------
ezx_defconfig (arm, gcc-10) — PASS, 0 errors, 0 warnings, 0 section mismatches

--------------------------------------------------------------------------------
footbridge_defconfig (arm, gcc-10) — PASS, 0 errors, 0 warnings, 0 section mismatches

--------------------------------------------------------------------------------
fuloong2e_defconfig (mips, gcc-10) — FAIL, 2 errors, 0 warnings, 0 section mismatches

Errors:
cc1: error: ‘-mloongson-mmi’ must be used with ‘-mhard-float’
cc1: error: ‘-mloongson-mmi’ must be used with ‘-mhard-float’

--------------------------------------------------------------------------------
gpr_defconfig (mips, gcc-10) — PASS, 0 errors, 0 warnings, 0 section mismatches

--------------------------------------------------------------------------------
h3600_defconfig (arm, gcc-10) — PASS, 0 errors, 0 warnings, 0 section mismatches

--------------------------------------------------------------------------------
h5000_defconfig (arm, gcc-10) — PASS, 0 errors, 0 warnings, 0 section mismatches

--------------------------------------------------------------------------------
hackkit_defconfig (arm, gcc-10) — PASS, 0 errors, 0 warnings, 0 section mismatches

--------------------------------------------------------------------------------
hisi_defconfig (arm, gcc-10) — PASS, 0 errors, 0 warnings, 0 section mismatches

--------------------------------------------------------------------------------
i386_defconfig (i386, gcc-10) — PASS, 0 errors, 2 warnings, 0 section mismatches

Warnings:
ld: arch/x86/boot/compressed/head_32.o: warning: relocation in read-only section `.head.text'
ld: warning: creating DT_TEXTREL in a PIE

--------------------------------------------------------------------------------
imote2_defconfig (arm, gcc-10) — PASS, 0 errors, 0 warnings, 0 section mismatches

--------------------------------------------------------------------------------
imx_v4_v5_defconfig (arm, gcc-10) — PASS, 0 errors, 0 warnings, 0 section mismatches

--------------------------------------------------------------------------------
imx_v6_v7_defconfig (arm, gcc-10) — PASS, 0 errors, 0 warnings, 0 section mismatches

--------------------------------------------------------------------------------
integrator_defconfig (arm, gcc-10) — PASS, 0 errors, 0 warnings, 0 section mismatches

--------------------------------------------------------------------------------
iop32x_defconfig (arm, gcc-10) — PASS, 0 errors, 0 warnings, 0 section mismatches

--------------------------------------------------------------------------------
iop33x_defconfig (arm, gcc-10) — PASS, 0 errors, 0 warnings, 0 section mismatches

--------------------------------------------------------------------------------
ip22_defconfig (mips, gcc-10) — PASS, 0 errors, 1 warning, 0 section mismatches

Warnings:
drivers/net/ethernet/seeq/sgiseeq.c:804:26: warning: passing argument 5 of ‘dma_free_attrs’ makes pointer from integer without a cast [-Wint-conversion]

--------------------------------------------------------------------------------
ip27_defconfig (mips, gcc-10) — FAIL, 0 errors, 0 warnings, 0 section mismatches

--------------------------------------------------------------------------------
ip28_defconfig (mips, gcc-10) — FAIL, 0 errors, 0 warnings, 0 section mismatches

--------------------------------------------------------------------------------
ip32_defconfig (mips, gcc-10) — PASS, 0 errors, 0 warnings, 0 section mismatches

--------------------------------------------------------------------------------
ixp4xx_defconfig (arm, gcc-10) — PASS, 0 errors, 0 warnings, 0 section mismatches

--------------------------------------------------------------------------------
jazz_defconfig (mips, gcc-10) — PASS, 0 errors, 0 warnings, 0 section mismatches

--------------------------------------------------------------------------------
jmr3927_defconfig (mips, gcc-10) — PASS, 0 errors, 0 warnings, 0 section mismatches

--------------------------------------------------------------------------------
jornada720_defconfig (arm, gcc-10) — PASS, 0 errors, 0 warnings, 0 section mismatches

--------------------------------------------------------------------------------
keystone_defconfig (arm, gcc-10) — PASS, 0 errors, 0 warnings, 0 section mismatches

--------------------------------------------------------------------------------
ks8695_defconfig (arm, gcc-10) — PASS, 0 errors, 0 warnings, 0 section mismatches

--------------------------------------------------------------------------------
lart_defconfig (arm, gcc-10) — PASS, 0 errors, 0 warnings, 0 section mismatches

--------------------------------------------------------------------------------
lasat_defconfig (mips, gcc-10) — PASS, 0 errors, 0 warnings, 0 section mismatches

--------------------------------------------------------------------------------
lemote2f_defconfig (mips, gcc-10) — FAIL, 2 errors, 0 warnings, 0 section mismatches

Errors:
cc1: error: ‘-mloongson-mmi’ must be used with ‘-mhard-float’
cc1: error: ‘-mloongson-mmi’ must be used with ‘-mhard-float’

--------------------------------------------------------------------------------
loongson3_defconfig (mips, gcc-10) — PASS, 0 errors, 0 warnings, 0 section mismatches

--------------------------------------------------------------------------------
lpc18xx_defconfig (arm, gcc-10) — PASS, 0 errors, 0 warnings, 0 section mismatches

--------------------------------------------------------------------------------
lpc32xx_defconfig (arm, gcc-10) — PASS, 0 errors, 1 warning, 0 section mismatches

Warnings:
arch/arm/mach-lpc32xx/phy3250.c:215:36: warning: duplicate ‘const’ declaration specifier [-Wduplicate-decl-specifier]

--------------------------------------------------------------------------------
lpd270_defconfig (arm, gcc-10) — PASS, 0 errors, 0 warnings, 0 section mismatches

--------------------------------------------------------------------------------
lubbock_defconfig (arm, gcc-10) — PASS, 0 errors, 0 warnings, 0 section mismatches

--------------------------------------------------------------------------------
magician_defconfig (arm, gcc-10) — PASS, 0 errors, 0 warnings, 0 section mismatches

--------------------------------------------------------------------------------
malta_defconfig (mips, gcc-10) — PASS, 0 errors, 0 warnings, 0 section mismatches

--------------------------------------------------------------------------------
malta_kvm_defconfig (mips, gcc-10) — PASS, 0 errors, 0 warnings, 0 section mismatches

--------------------------------------------------------------------------------
malta_kvm_guest_defconfig (mips, gcc-10) — PASS, 0 errors, 0 warnings, 0 section mismatches

--------------------------------------------------------------------------------
malta_qemu_32r6_defconfig (mips, gcc-10) — PASS, 0 errors, 0 warnings, 0 section mismatches

--------------------------------------------------------------------------------
maltaaprp_defconfig (mips, gcc-10) — PASS, 0 errors, 0 warnings, 0 section mismatches

--------------------------------------------------------------------------------
maltasmvp_defconfig (mips, gcc-10) — PASS, 0 errors, 0 warnings, 0 section mismatches

--------------------------------------------------------------------------------
maltasmvp_eva_defconfig (mips, gcc-10) — PASS, 0 errors, 0 warnings, 0 section mismatches

--------------------------------------------------------------------------------
maltaup_defconfig (mips, gcc-10) — PASS, 0 errors, 0 warnings, 0 section mismatches

--------------------------------------------------------------------------------
maltaup_xpa_defconfig (mips, gcc-10) — PASS, 0 errors, 0 warnings, 0 section mismatches

--------------------------------------------------------------------------------
markeins_defconfig (mips, gcc-10) — PASS, 0 errors, 0 warnings, 0 section mismatches

--------------------------------------------------------------------------------
mini2440_defconfig (arm, gcc-10) — PASS, 0 errors, 1 warning, 0 section mismatches

Warnings:
drivers/tty/serial/samsung.c:1780:34: warning: array ‘s3c24xx_uart_dt_match’ assumed to have one element

--------------------------------------------------------------------------------
mmp2_defconfig (arm, gcc-10) — PASS, 0 errors, 0 warnings, 0 section mismatches

--------------------------------------------------------------------------------
mpc30x_defconfig (mips, gcc-10) — PASS, 0 errors, 0 warnings, 0 section mismatches

--------------------------------------------------------------------------------
msp71xx_defconfig (mips, gcc-10) — PASS, 0 errors, 0 warnings, 0 section mismatches

--------------------------------------------------------------------------------
mtx1_defconfig (mips, gcc-10) — PASS, 0 errors, 3 warnings, 0 section mismatches

Warnings:
sound/pci/echoaudio/echoaudio_dsp.c:647:9: warning: iteration 1073741824 invokes undefined behavior [-Waggressive-loop-optimizations]
sound/pci/echoaudio/echoaudio_dsp.c:658:9: warning: iteration 1073741824 invokes undefined behavior [-Waggressive-loop-optimizations]
sound/pci/echoaudio/echoaudio_dsp.c:647:9: warning: iteration 1073741824 invokes undefined behavior [-Waggressive-loop-optimizations]

--------------------------------------------------------------------------------
multi_v5_defconfig (arm, gcc-10) — PASS, 0 errors, 0 warnings, 0 section mismatches

--------------------------------------------------------------------------------
multi_v7_defconfig (arm, gcc-10) — PASS, 0 errors, 0 warnings, 0 section mismatches

--------------------------------------------------------------------------------
mvebu_v5_defconfig (arm, gcc-10) — PASS, 0 errors, 0 warnings, 0 section mismatches

--------------------------------------------------------------------------------
mvebu_v7_defconfig (arm, gcc-10) — PASS, 0 errors, 0 warnings, 0 section mismatches

--------------------------------------------------------------------------------
mxs_defconfig (arm, gcc-10) — PASS, 0 errors, 1 warning, 0 section mismatches

Warnings:
arch/arm/mach-mxs/mach-mxs.c:285:26: warning: duplicate ‘const’ declaration specifier [-Wduplicate-decl-specifier]

--------------------------------------------------------------------------------
neponset_defconfig (arm, gcc-10) — PASS, 0 errors, 0 warnings, 0 section mismatches

--------------------------------------------------------------------------------
netwinder_defconfig (arm, gcc-10) — PASS, 0 errors, 0 warnings, 0 section mismatches

--------------------------------------------------------------------------------
netx_defconfig (arm, gcc-10) — PASS, 0 errors, 0 warnings, 0 section mismatches

--------------------------------------------------------------------------------
nhk8815_defconfig (arm, gcc-10) — PASS, 0 errors, 0 warnings, 0 section mismatches

--------------------------------------------------------------------------------
nlm_xlp_defconfig (mips, gcc-10) — PASS, 0 errors, 0 warnings, 0 section mismatches

--------------------------------------------------------------------------------
nlm_xlr_defconfig (mips, gcc-10) — PASS, 0 errors, 0 warnings, 0 section mismatches

--------------------------------------------------------------------------------
nsim_hs_defconfig (arc, gcc-10) — PASS, 0 errors, 0 warnings, 0 section mismatches

--------------------------------------------------------------------------------
nsim_hs_smp_defconfig (arc, gcc-10) — PASS, 0 errors, 0 warnings, 0 section mismatches

--------------------------------------------------------------------------------
nsimosci_hs_defconfig (arc, gcc-10) — PASS, 0 errors, 0 warnings, 0 section mismatches

--------------------------------------------------------------------------------
nsimosci_hs_smp_defconfig (arc, gcc-10) — PASS, 0 errors, 0 warnings, 0 section mismatches

--------------------------------------------------------------------------------
nuc910_defconfig (arm, gcc-10) — PASS, 0 errors, 0 warnings, 0 section mismatches

--------------------------------------------------------------------------------
nuc960_defconfig (arm, gcc-10) — PASS, 0 errors, 0 warnings, 0 section mismatches

--------------------------------------------------------------------------------
omap1_defconfig (arm, gcc-10) — PASS, 0 errors, 1 warning, 0 section mismatches

Warnings:
drivers/gpio/gpio-omap.c:1161:34: warning: array ‘omap_gpio_match’ assumed to have one element

--------------------------------------------------------------------------------
omap2plus_defconfig (arm, gcc-10) — PASS, 0 errors, 1 warning, 0 section mismatches

Warnings:
drivers/cpufreq/ti-cpufreq.c:250:24: warning: passing argument 1 of ‘PTR_ERR_OR_ZERO’ makes pointer from integer without a cast [-Wint-conversion]

--------------------------------------------------------------------------------
orion5x_defconfig (arm, gcc-10) — PASS, 0 errors, 0 warnings, 0 section mismatches

--------------------------------------------------------------------------------
palmz72_defconfig (arm, gcc-10) — PASS, 0 errors, 0 warnings, 0 section mismatches

--------------------------------------------------------------------------------
pcm027_defconfig (arm, gcc-10) — PASS, 0 errors, 0 warnings, 0 section mismatches

--------------------------------------------------------------------------------
pleb_defconfig (arm, gcc-10) — PASS, 0 errors, 0 warnings, 0 section mismatches

--------------------------------------------------------------------------------
pnx8335_stb225_defconfig (mips, gcc-10) — PASS, 0 errors, 0 warnings, 0 section mismatches

--------------------------------------------------------------------------------
prima2_defconfig (arm, gcc-10) — PASS, 0 errors, 0 warnings, 0 section mismatches

--------------------------------------------------------------------------------
pxa910_defconfig (arm, gcc-10) — PASS, 0 errors, 0 warnings, 0 section mismatches

--------------------------------------------------------------------------------
qcom_defconfig (arm, gcc-10) — PASS, 0 errors, 0 warnings, 0 section mismatches

--------------------------------------------------------------------------------
qi_lb60_defconfig (mips, gcc-10) — PASS, 0 errors, 0 warnings, 0 section mismatches

--------------------------------------------------------------------------------
raumfeld_defconfig (arm, gcc-10) — PASS, 0 errors, 0 warnings, 0 section mismatches

--------------------------------------------------------------------------------
rb532_defconfig (mips, gcc-10) — PASS, 0 errors, 0 warnings, 0 section mismatches

--------------------------------------------------------------------------------
realview-smp_defconfig (arm, gcc-10) — PASS, 0 errors, 0 warnings, 0 section mismatches

--------------------------------------------------------------------------------
rt305x_defconfig (mips, gcc-10) — PASS, 0 errors, 0 warnings, 0 section mismatches

--------------------------------------------------------------------------------
s3c2410_defconfig (arm, gcc-10) — PASS, 0 errors, 1 warning, 0 section mismatches

Warnings:
drivers/tty/serial/samsung.c:1780:34: warning: array ‘s3c24xx_uart_dt_match’ assumed to have one element

--------------------------------------------------------------------------------
s3c6400_defconfig (arm, gcc-10) — PASS, 0 errors, 2 warnings, 0 section mismatches

Warnings:
drivers/mmc/host/sdhci-s3c.c:429:34: warning: array ‘sdhci_s3c_dt_match’ assumed to have one element
drivers/tty/serial/samsung.c:1780:34: warning: array ‘s3c24xx_uart_dt_match’ assumed to have one element

--------------------------------------------------------------------------------
s5pv210_defconfig (arm, gcc-10) — PASS, 0 errors, 0 warnings, 0 section mismatches

--------------------------------------------------------------------------------
sama5_defconfig (arm, gcc-10) — PASS, 0 errors, 0 warnings, 0 section mismatches

--------------------------------------------------------------------------------
sb1250_swarm_defconfig (mips, gcc-10) — PASS, 0 errors, 0 warnings, 0 section mismatches

--------------------------------------------------------------------------------
sead3_defconfig (mips, gcc-10) — PASS, 0 errors, 0 warnings, 0 section mismatches

--------------------------------------------------------------------------------
sead3micro_defconfig (mips, gcc-10) — PASS, 0 errors, 0 warnings, 0 section mismatches

--------------------------------------------------------------------------------
shannon_defconfig (arm, gcc-10) — PASS, 0 errors, 0 warnings, 0 section mismatches

--------------------------------------------------------------------------------
shmobile_defconfig (arm, gcc-10) — PASS, 0 errors, 0 warnings, 0 section mismatches

--------------------------------------------------------------------------------
simpad_defconfig (arm, gcc-10) — PASS, 0 errors, 0 warnings, 0 section mismatches

--------------------------------------------------------------------------------
spear13xx_defconfig (arm, gcc-10) — PASS, 0 errors, 0 warnings, 0 section mismatches

--------------------------------------------------------------------------------
spear6xx_defconfig (arm, gcc-10) — PASS, 0 errors, 0 warnings, 0 section mismatches

--------------------------------------------------------------------------------
spitz_defconfig (arm, gcc-10) — PASS, 0 errors, 0 warnings, 0 section mismatches

--------------------------------------------------------------------------------
stm32_defconfig (arm, gcc-10) — PASS, 0 errors, 0 warnings, 0 section mismatches

--------------------------------------------------------------------------------
sunxi_defconfig (arm, gcc-10) — PASS, 0 errors, 0 warnings, 0 section mismatches

--------------------------------------------------------------------------------
tb0219_defconfig (mips, gcc-10) — PASS, 0 errors, 0 warnings, 0 section mismatches

--------------------------------------------------------------------------------
tb0226_defconfig (mips, gcc-10) — PASS, 0 errors, 0 warnings, 0 section mismatches

--------------------------------------------------------------------------------
tb0287_defconfig (mips, gcc-10) — PASS, 0 errors, 0 warnings, 0 section mismatches

--------------------------------------------------------------------------------
tct_hammer_defconfig (arm, gcc-10) — PASS, 0 errors, 0 warnings, 0 section mismatches

--------------------------------------------------------------------------------
tegra_defconfig (arm, gcc-10) — PASS, 0 errors, 0 warnings, 0 section mismatches

--------------------------------------------------------------------------------
tinyconfig (arc, gcc-10) — PASS, 0 errors, 0 warnings, 0 section mismatches

--------------------------------------------------------------------------------
tinyconfig (mips, gcc-10) — PASS, 0 errors, 0 warnings, 0 section mismatches

--------------------------------------------------------------------------------
tinyconfig (i386, gcc-10) — PASS, 0 errors, 0 warnings, 0 section mismatches

--------------------------------------------------------------------------------
tinyconfig (x86_64, gcc-10) — PASS, 0 errors, 3 warnings, 0 section mismatches

Warnings:
arch/x86/entry/entry_64.S:487: Warning: no instruction mnemonic suffix given and no register operands; using default for `btr'
arch/x86/entry/entry_64.S:1642: Warning: no instruction mnemonic suffix given and no register operands; using default for `sysret'
arch/x86/kernel/process.c:456: Warning: no instruction mnemonic suffix given and no register operands; using default for `btr'

--------------------------------------------------------------------------------
tinyconfig (arm, gcc-10) — PASS, 0 errors, 0 warnings, 0 section mismatches

--------------------------------------------------------------------------------
trizeps4_defconfig (arm, gcc-10) — PASS, 0 errors, 0 warnings, 0 section mismatches

--------------------------------------------------------------------------------
u300_defconfig (arm, gcc-10) — PASS, 0 errors, 0 warnings, 0 section mismatches

--------------------------------------------------------------------------------
vdk_hs38_defconfig (arc, gcc-10) — PASS, 0 errors, 0 warnings, 0 section mismatches

--------------------------------------------------------------------------------
vdk_hs38_smp_defconfig (arc, gcc-10) — PASS, 0 errors, 0 warnings, 0 section mismatches

--------------------------------------------------------------------------------
versatile_defconfig (arm, gcc-10) — PASS, 0 errors, 0 warnings, 0 section mismatches

--------------------------------------------------------------------------------
vexpress_defconfig (arm, gcc-10) — PASS, 0 errors, 0 warnings, 0 section mismatches

--------------------------------------------------------------------------------
vf610m4_defconfig (arm, gcc-10) — PASS, 0 errors, 0 warnings, 0 section mismatches

--------------------------------------------------------------------------------
vt8500_v6_v7_defconfig (arm, gcc-10) — PASS, 0 errors, 0 warnings, 0 section mismatches

--------------------------------------------------------------------------------
workpad_defconfig (mips, gcc-10) — PASS, 0 errors, 0 warnings, 0 section mismatches

--------------------------------------------------------------------------------
x86_64_defconfig (x86_64, gcc-10) — PASS, 0 errors, 6 warnings, 0 section mismatches

Warnings:
arch/x86/entry/entry_64.S:487: Warning: no instruction mnemonic suffix given and no register operands; using default for `btr'
arch/x86/entry/entry_64.S:1642: Warning: no instruction mnemonic suffix given and no register operands; using default for `sysret'
arch/x86/kernel/process.c:456: Warning: no instruction mnemonic suffix given and no register operands; using default for `btr'
arch/x86/kernel/process.c:456: Warning: no instruction mnemonic suffix given and no register operands; using default for `btr'
ld: arch/x86/boot/compressed/head_64.o: warning: relocation in read-only section `.head.text'
ld: warning: creating DT_TEXTREL in a PIE

--------------------------------------------------------------------------------
xcep_defconfig (arm, gcc-10) — PASS, 0 errors, 0 warnings, 0 section mismatches

--------------------------------------------------------------------------------
xilfpga_defconfig (mips, gcc-10) — PASS, 0 errors, 0 warnings, 0 section mismatches

--------------------------------------------------------------------------------
xway_defconfig (mips, gcc-10) — PASS, 0 errors, 0 warnings, 0 section mismatches

--------------------------------------------------------------------------------
zeus_defconfig (arm, gcc-10) — PASS, 0 errors, 0 warnings, 0 section mismatches

--------------------------------------------------------------------------------
zx_defconfig (arm, gcc-10) — PASS, 0 errors, 0 warnings, 0 section mismatches

---
For more info write to <info@...>


[PATCH isar-cip-core] linux-cip: Switch to kernel.org for fetching tarballs

Jan Kiszka
 

From: Jan Kiszka <jan.kiszka@...>

gitlab.com turned out to be too unreliable for fetching on-the-fly
generated kernel tarballs in CI. Let's hope kernel.org will do better.

Checksums need to be adjusted as the base path in the tarballs differ.

Signed-off-by: Jan Kiszka <jan.kiszka@...>
---
recipes-kernel/linux/linux-cip-common.inc | 4 ++--
recipes-kernel/linux/linux-cip-rt_4.19.245-cip74-rt25.bb | 2 +-
recipes-kernel/linux/linux-cip-rt_4.4.302-cip69-rt39.bb | 2 +-
recipes-kernel/linux/linux-cip-rt_5.10.109-cip5-rt4.bb | 2 +-
recipes-kernel/linux/linux-cip_4.19.249-cip76.bb | 2 +-
recipes-kernel/linux/linux-cip_4.4.302-cip69.bb | 2 +-
recipes-kernel/linux/linux-cip_5.10.126-cip11.bb | 2 +-
7 files changed, 8 insertions(+), 8 deletions(-)

diff --git a/recipes-kernel/linux/linux-cip-common.inc b/recipes-kernel/linux/linux-cip-common.inc
index 0e36bd5..c12a60f 100644
--- a/recipes-kernel/linux/linux-cip-common.inc
+++ b/recipes-kernel/linux/linux-cip-common.inc
@@ -16,7 +16,7 @@ KERNEL_DEFCONFIG ?= "${MACHINE}_defconfig"
require recipes-kernel/linux/linux-custom.inc

SRC_URI += " \
- https://gitlab.com/cip-project/cip-kernel/linux-cip/-/archive/v${PV}/linux-cip-v${PV}.tar.gz \
+ https://git.kernel.org/pub/scm/linux/kernel/git/cip/linux-cip.git/snapshot/linux-cip-${PV}.tar.gz \
"

SRC_URI_append = " ${@ "git://gitlab.com/cip-project/cip-kernel/cip-kernel-config.git;protocol=https;destsuffix=cip-kernel-config;name=cip-kernel-config" \
@@ -27,4 +27,4 @@ SRC_URI_append_bbb = "file://${KERNEL_DEFCONFIG}"

SRCREV_cip-kernel-config ?= "a8d04df6595344091eee2b242c3a0f5e108f966c"

-S = "${WORKDIR}/linux-cip-v${PV}"
+S = "${WORKDIR}/linux-cip-${PV}"
diff --git a/recipes-kernel/linux/linux-cip-rt_4.19.245-cip74-rt25.bb b/recipes-kernel/linux/linux-cip-rt_4.19.245-cip74-rt25.bb
index 7f89253..0fbf34a 100644
--- a/recipes-kernel/linux/linux-cip-rt_4.19.245-cip74-rt25.bb
+++ b/recipes-kernel/linux/linux-cip-rt_4.19.245-cip74-rt25.bb
@@ -13,4 +13,4 @@ require linux-cip-rt-common.inc

KERNEL_DEFCONFIG_VERSION ?= "4.19.y-cip"

-SRC_URI[sha256sum] = "436c7578711e67332c7a569fd5966c69e41d872a89faab211fd6b00fe2077b5b"
+SRC_URI[sha256sum] = "a14a5230356d334a2f06bdd2fed731956d3f6492e085c75dbebc7c4f7b5da1d8"
diff --git a/recipes-kernel/linux/linux-cip-rt_4.4.302-cip69-rt39.bb b/recipes-kernel/linux/linux-cip-rt_4.4.302-cip69-rt39.bb
index c36c51d..ddce99a 100644
--- a/recipes-kernel/linux/linux-cip-rt_4.4.302-cip69-rt39.bb
+++ b/recipes-kernel/linux/linux-cip-rt_4.4.302-cip69-rt39.bb
@@ -13,4 +13,4 @@ require linux-cip-rt-common.inc

KERNEL_DEFCONFIG_VERSION ?= "4.4.y-cip"

-SRC_URI[sha256sum] = "b5f267fa436e5d5e729f1febb741171cb1df5a576400d06999202f733d8e67ed"
+SRC_URI[sha256sum] = "5cbddbd7780739f7af91545691ffaa07a436dab4a0e8380a5e2b9b31e883071f"
diff --git a/recipes-kernel/linux/linux-cip-rt_5.10.109-cip5-rt4.bb b/recipes-kernel/linux/linux-cip-rt_5.10.109-cip5-rt4.bb
index fe20915..3105f43 100644
--- a/recipes-kernel/linux/linux-cip-rt_5.10.109-cip5-rt4.bb
+++ b/recipes-kernel/linux/linux-cip-rt_5.10.109-cip5-rt4.bb
@@ -13,4 +13,4 @@ require linux-cip-rt-common.inc

KERNEL_DEFCONFIG_VERSION ?= "5.10.y-cip"

-SRC_URI[sha256sum] = "ca42d37fa68769259a065d766ed266b7e0ac97b018febbec2ce71db7e19f968a"
+SRC_URI[sha256sum] = "71fba4ed5cb48fa7869e9fe271b68b77fed26775ce5cf2f50891aa8f71c388b3"
diff --git a/recipes-kernel/linux/linux-cip_4.19.249-cip76.bb b/recipes-kernel/linux/linux-cip_4.19.249-cip76.bb
index e061644..a5b240e 100644
--- a/recipes-kernel/linux/linux-cip_4.19.249-cip76.bb
+++ b/recipes-kernel/linux/linux-cip_4.19.249-cip76.bb
@@ -13,4 +13,4 @@ require linux-cip-common.inc

KERNEL_DEFCONFIG_VERSION ?= "4.19.y-cip"

-SRC_URI[sha256sum] = "2dd59ffb3557580f9fae93952206880f1248ad3bd239983a71c0f7113f31880e"
+SRC_URI[sha256sum] = "7068eae8ea25eaded7891e14019e0c1d1fdaf8bb0abe77d42205b34fa059a157"
diff --git a/recipes-kernel/linux/linux-cip_4.4.302-cip69.bb b/recipes-kernel/linux/linux-cip_4.4.302-cip69.bb
index 8948786..2ae0b52 100644
--- a/recipes-kernel/linux/linux-cip_4.4.302-cip69.bb
+++ b/recipes-kernel/linux/linux-cip_4.4.302-cip69.bb
@@ -13,4 +13,4 @@ require linux-cip-common.inc

KERNEL_DEFCONFIG_VERSION ?= "4.4.y-cip"

-SRC_URI[sha256sum] = "70d09ed7c9dcbd227e1c77964a0a912c21253cdbf6130cefe1db7cc7b30e59f0"
+SRC_URI[sha256sum] = "3acecb8f9ee4d9fba58d4a4cf4a2114018f030865f55b65cbc8e385ad04e691e"
diff --git a/recipes-kernel/linux/linux-cip_5.10.126-cip11.bb b/recipes-kernel/linux/linux-cip_5.10.126-cip11.bb
index ac4f620..a59333b 100644
--- a/recipes-kernel/linux/linux-cip_5.10.126-cip11.bb
+++ b/recipes-kernel/linux/linux-cip_5.10.126-cip11.bb
@@ -13,4 +13,4 @@ require linux-cip-common.inc

KERNEL_DEFCONFIG_VERSION ?= "5.10.y-cip"

-SRC_URI[sha256sum] = "2b0742b538bd993538a73905100bcbba3f48b4259773a119a7c0fdb2cff5a0fb"
+SRC_URI[sha256sum] = "fa6b05e52b095ff29c08bbb2cd9d40fc4aedc69e9abf295fc303d30bdce51caf"
--
2.35.3


[PATCH isar-cip-core] start-qemu: Use only 2 cores with armhf

Jan Kiszka
 

From: Jan Kiszka <jan.kiszka@...>

This is what our configs set as upper limit.

Signed-off-by: Jan Kiszka <jan.kiszka@...>
---
start-qemu.sh | 2 +-
1 file changed, 1 insertion(+), 1 deletion(-)

diff --git a/start-qemu.sh b/start-qemu.sh
index 2350612..f7ca87f 100755
--- a/start-qemu.sh
+++ b/start-qemu.sh
@@ -88,7 +88,7 @@ case "${arch}" in
QEMU=qemu-system-arm
QEMU_EXTRA_ARGS=" \
-cpu cortex-a15 \
- -smp 4 \
+ -smp 2 \
-machine virt \
-device virtio-serial-device \
-device virtconsole,chardev=con -chardev vc,id=con \
--
2.35.3


[PATCH isar-cip-core] start-qemu: Mark rootfs read-write

Jan Kiszka
 

From: Jan Kiszka <jan.kiszka@...>

This ensures that early systemd work such as machine ID generation finds
a writable rootfs.

Signed-off-by: Jan Kiszka <jan.kiszka@...>
---
start-qemu.sh | 6 +++---
1 file changed, 3 insertions(+), 3 deletions(-)

diff --git a/start-qemu.sh b/start-qemu.sh
index f066209..2350612 100755
--- a/start-qemu.sh
+++ b/start-qemu.sh
@@ -67,7 +67,7 @@ case "${arch}" in
${QEMU_EXTRA_ARGS} -device ide-hd,drive=disk"
fi
KERNEL_CMDLINE=" \
- root=/dev/sda"
+ root=/dev/sda rw"
;;
arm64|aarch64)
QEMU_ARCH=arm64
@@ -81,7 +81,7 @@ case "${arch}" in
-device virtio-blk-device,drive=disk \
-device virtio-net-device,netdev=net"
KERNEL_CMDLINE=" \
- root=/dev/vda"
+ root=/dev/vda rw"
;;
arm|armhf)
QEMU_ARCH=arm
@@ -95,7 +95,7 @@ case "${arch}" in
-device virtio-blk-device,drive=disk \
-device virtio-net-device,netdev=net"
KERNEL_CMDLINE=" \
- root=/dev/vda"
+ root=/dev/vda rw"
;;
""|--help)
usage
--
2.35.3

1461 - 1480 of 10174