Date   

4.4 & my availability this week

Pavel Machek
 

Hi!

It would not be bad to do 4.4 release this week, but Ill be traveling without internet
access. 4.4-st tree and -cip trees are up-to-date with 4.9.320, with exceptions of random
(and we should probably ignore those) and some TCP changes. I believe we can turn that
into -cip release.

Best regards,
Pavel

--
DENX Software Engineering GmbH, Managing Director: Wolfgang Denk
HRB 165235 Munich, Office: Kirchenstr.5, D-82194 Groebenzell, Germany


Re: [PATCH RESEND 5.10.y-cip 03/13] thermal/drivers: Add TSU driver for RZ/G2L

Biju Das
 

Subject: Re: [cip-dev] [PATCH RESEND 5.10.y-cip 03/13] thermal/drivers:
Add TSU driver for RZ/G2L

Hi!

commit 673c68bd48390dad01f7d17670de3e33b60860ac upstream.

The RZ/G2L SoC incorporates a thermal sensor unit (TSU) that
measures the temperature inside the LSI.

The thermal sensor in this unit measures temperatures in the
range from
???40 degree Celsius to 125 degree Celsius with an accuracy of
??3°C.
The TSU repeats measurement at 20 microseconds intervals and
automatically updates the results of measurement.

The TSU has no interrupts as well as no external pins.

This patch adds Thermal Sensor Unit(TSU) driver for RZ/G2L SoC.
+#define TSU_SS_CONV_RUNNING BIT(0)
+
+#define TS_CODE_AVE_SCALE(x) ((x) * 1000000)
+#define MCELSIUS(temp) ((temp) *
MILLIDEGREE_PER_DEGREE)
+#define TS_CODE_CAP_TIMES 8 /* Capture times */
Two spaces, plus "capture times" does not really explain much.
OK, will fix the 2 spaces. For " capture times" Basically we need to
read TSU_SAD register eight times consecutively at 20 microseconds
interval.

I will try to drop the comment /* Capture times */ from mainline,
if it does not really explain the intention.
Or

What about "Total number of ADC data samples"? Does it better?
Please let me know.
Yes, that sounds better.
OK, will upstream these changes.

Thanks and regards,
Biju


Re: [PATCH RESEND 5.10.y-cip 03/13] thermal/drivers: Add TSU driver for RZ/G2L

Pavel Machek
 

Hi!

commit 673c68bd48390dad01f7d17670de3e33b60860ac upstream.

The RZ/G2L SoC incorporates a thermal sensor unit (TSU) that
measures the temperature inside the LSI.

The thermal sensor in this unit measures temperatures in the range
from
???40 degree Celsius to 125 degree Celsius with an accuracy of ??3°C.
The TSU repeats measurement at 20 microseconds intervals and
automatically updates the results of measurement.

The TSU has no interrupts as well as no external pins.

This patch adds Thermal Sensor Unit(TSU) driver for RZ/G2L SoC.
+#define TSU_SS_CONV_RUNNING BIT(0)
+
+#define TS_CODE_AVE_SCALE(x) ((x) * 1000000)
+#define MCELSIUS(temp) ((temp) * MILLIDEGREE_PER_DEGREE)
+#define TS_CODE_CAP_TIMES 8 /* Capture times */
Two spaces, plus "capture times" does not really explain much.
OK, will fix the 2 spaces. For " capture times" Basically we need to read
TSU_SAD register eight times consecutively at 20 microseconds interval.

I will try to drop the comment /* Capture times */ from mainline, if it
does not really explain the intention.
Or

What about "Total number of ADC data samples"? Does it better?
Please let me know.
Yes, that sounds better.

Thanks,
Pavel

--
DENX Software Engineering GmbH, Managing Director: Wolfgang Denk
HRB 165235 Munich, Office: Kirchenstr.5, D-82194 Groebenzell, Germany


Re: [PATCH RESEND 5.10.y-cip 03/13] thermal/drivers: Add TSU driver for RZ/G2L

Biju Das
 

Hi Pavel,

Subject: RE: [cip-dev] [PATCH RESEND 5.10.y-cip 03/13] thermal/drivers:
Add TSU driver for RZ/G2L

Hi Pavel,

Thanks for the feedback.

Subject: Re: [cip-dev] [PATCH RESEND 5.10.y-cip 03/13] thermal/drivers:
Add TSU driver for RZ/G2L

Hi!

commit 673c68bd48390dad01f7d17670de3e33b60860ac upstream.

The RZ/G2L SoC incorporates a thermal sensor unit (TSU) that
measures the temperature inside the LSI.

The thermal sensor in this unit measures temperatures in the range
from
−40 degree Celsius to 125 degree Celsius with an accuracy of ±3°C.
The TSU repeats measurement at 20 microseconds intervals and
automatically updates the results of measurement.

The TSU has no interrupts as well as no external pins.

This patch adds Thermal Sensor Unit(TSU) driver for RZ/G2L SoC.
+#define TSU_SS_CONV_RUNNING BIT(0)
+
+#define TS_CODE_AVE_SCALE(x) ((x) * 1000000)
+#define MCELSIUS(temp) ((temp) * MILLIDEGREE_PER_DEGREE)
+#define TS_CODE_CAP_TIMES 8 /* Capture times */
Two spaces, plus "capture times" does not really explain much.
OK, will fix the 2 spaces. For " capture times" Basically we need to read
TSU_SAD register eight times consecutively at 20 microseconds interval.

I will try to drop the comment /* Capture times */ from mainline, if it
does not really explain the intention.
Or

What about "Total number of ADC data samples"? Does it better?
Please let me know.

Cheers,
Biju


Re: [PATCH RESEND 5.10.y-cip 03/13] thermal/drivers: Add TSU driver for RZ/G2L

Biju Das
 

Hi Pavel,

Thanks for the feedback.

Subject: Re: [cip-dev] [PATCH RESEND 5.10.y-cip 03/13] thermal/drivers:
Add TSU driver for RZ/G2L

Hi!

commit 673c68bd48390dad01f7d17670de3e33b60860ac upstream.

The RZ/G2L SoC incorporates a thermal sensor unit (TSU) that measures
the temperature inside the LSI.

The thermal sensor in this unit measures temperatures in the range
from
−40 degree Celsius to 125 degree Celsius with an accuracy of ±3°C. The
TSU repeats measurement at 20 microseconds intervals and automatically
updates the results of measurement.

The TSU has no interrupts as well as no external pins.

This patch adds Thermal Sensor Unit(TSU) driver for RZ/G2L SoC.
+#define TSU_SS_CONV_RUNNING BIT(0)
+
+#define TS_CODE_AVE_SCALE(x) ((x) * 1000000)
+#define MCELSIUS(temp) ((temp) * MILLIDEGREE_PER_DEGREE)
+#define TS_CODE_CAP_TIMES 8 /* Capture times */
Two spaces, plus "capture times" does not really explain much.
OK, will fix the 2 spaces. For " capture times" Basically we need to read
TSU_SAD register eight times consecutively at 20 microseconds interval.

I will try to drop the comment /* Capture times */ from mainline, if it does
not really explain the intention.


+static int rzg2l_thermal_get_temp(void *devdata, int *temp) {
+ struct rzg2l_thermal_priv *priv = devdata;
+ u32 result = 0, dsensor, ts_code_ave;
+ int val, i;
+
+ for (i = 0; i < TS_CODE_CAP_TIMES ; i++) {
+ /* TSU repeats measurement at 20 microseconds intervals and
+ * automatically updates the results of
According to CodingStyle, /* should be on separate line.
My bad, will fix this.


+ dev_dbg(dev, "TSU probed with %s caliberation values",
+ rzg2l_thermal_read(priv, OTPTSUTRIM_REG(0)) ? "hw" : "sw");
Typo, should be "calibration" I guess.
OK, will fix this.

Cheers,
Biju


Re: [PATCH RESEND 5.10.y-cip 13/13] watchdog: rzg2l_wdt: Add set_timeout callback

Biju Das
 

Hi Pavel,

Thanks for the feedback.

Subject: Re: [PATCH RESEND 5.10.y-cip 13/13] watchdog: rzg2l_wdt: Add
set_timeout callback

Hi!

commit 4055ee81009e606e830af1acd9e2e35a36249713 upstream.

This patch adds support for set_timeout callback.

Once WDT is started, the WDT cycle setting register(WDTSET) can be
updated only after issuing a module reset. Otherwise, it will ignore
the writes and will hold the previous value. This patch updates the
WDTSET register if it is active.

+++ b/drivers/watchdog/rzg2l_wdt.c
@@ -115,6 +115,25 @@ static int rzg2l_wdt_stop(struct watchdog_device
*wdev)
return 0;
}

+static int rzg2l_wdt_set_timeout(struct watchdog_device *wdev,
+unsigned int timeout) {
+ struct rzg2l_wdt_priv *priv = watchdog_get_drvdata(wdev);
+
+ wdev->timeout = timeout;
+
+ /*
+ * If the watchdog is active, reset the module for updating the
WDTSET
+ * register so that it is updated with new timeout values.
+ */
values->value?
Ok, Will fix this in mainline.


+ if (watchdog_active(wdev)) {
+ pm_runtime_put(wdev->parent);
+ reset_control_reset(priv->rstc);
+ rzg2l_wdt_start(wdev);
+ }
This code is quite tricky. AFAICT it is correct, but calling
rzg2l_wdt_stop() instead would make it more readable.
From readability point, this code holds good as we need to do
Module reset for changing time out values for WDT.

But from code optimization point, whatever you suggested is ok.

What do we do here, readability or optimization? Please suggest.

Cheers,
Biju


Re: [PATCH RESEND 5.10.y-cip 01/13] kernel.h: split out mathematical helpers

Biju Das
 

Hi Pavel,

Thanks for the feedback.

Subject: Re: [PATCH RESEND 5.10.y-cip 01/13] kernel.h: split out
mathematical helpers

Hi!

From: Andy Shevchenko <andriy.shevchenko@...>

commit aa6159ab99a9ab5df835b4750b66cf132a5aa292 upstream

kernel.h is being used as a dump for all kinds of stuff for a long
time.
Here is the attempt to start cleaning it up by splitting out
mathematical helpers.

At the same time convert users in header and lib folder to use new
header. Though for time being include new header back to kernel.h to
avoid twisted indirected includes for existing users.
This is rather intrusive for two lines which we really need, and may
cause rejects in future.

I'd suggest identifying the defines needed by the driver, and just adding
those. kernel.h would be acceptable. Or you can add math.h with just
defines needed, but please avoid code movement.
OK, will send v2. By adding needed defines in kernel.h and replacing driver include
math.h->kernel.h

Cheers,
Biju


---
fs/nfs/callback_proc.c | 5 +
include/linux/bitops.h | 11 ++-
include/linux/dcache.h | 1 +
include/linux/iommu-helper.h | 4 +-
include/linux/kernel.h | 173 +--------------------------------
include/linux/math.h | 177 ++++++++++++++++++++++++++++++++++
include/linux/rcu_node_tree.h | 2 +
include/linux/units.h | 2 +-
lib/errname.c | 1 +
lib/errseq.c | 1 +
lib/find_bit.c | 3 +-
lib/math/div64.c | 4 +-
lib/math/int_pow.c | 2 +-
lib/math/int_sqrt.c | 3 +-
lib/math/reciprocal_div.c | 9 +-
15 files changed, 215 insertions(+), 183 deletions(-) create mode
100644 include/linux/math.h


--
DENX Software Engineering GmbH, Managing Director: Wolfgang Denk
HRB 165235 Munich, Office: Kirchenstr.5, D-82194 Groebenzell, Germany


Re: [PATCH RESEND 5.10.y-cip 13/13] watchdog: rzg2l_wdt: Add set_timeout callback

Pavel Machek
 

Hi!

commit 4055ee81009e606e830af1acd9e2e35a36249713 upstream.

This patch adds support for set_timeout callback.

Once WDT is started, the WDT cycle setting register(WDTSET) can be updated
only after issuing a module reset. Otherwise, it will ignore the writes
and will hold the previous value. This patch updates the WDTSET register
if it is active.

+++ b/drivers/watchdog/rzg2l_wdt.c
@@ -115,6 +115,25 @@ static int rzg2l_wdt_stop(struct watchdog_device *wdev)
return 0;
}

+static int rzg2l_wdt_set_timeout(struct watchdog_device *wdev, unsigned int timeout)
+{
+ struct rzg2l_wdt_priv *priv = watchdog_get_drvdata(wdev);
+
+ wdev->timeout = timeout;
+
+ /*
+ * If the watchdog is active, reset the module for updating the WDTSET
+ * register so that it is updated with new timeout values.
+ */
values->value?

+ if (watchdog_active(wdev)) {
+ pm_runtime_put(wdev->parent);
+ reset_control_reset(priv->rstc);
+ rzg2l_wdt_start(wdev);
+ }
This code is quite tricky. AFAICT it is correct, but calling
rzg2l_wdt_stop() instead would make it more readable.

Best regards,
Pavel
--
DENX Software Engineering GmbH, Managing Director: Wolfgang Denk
HRB 165235 Munich, Office: Kirchenstr.5, D-82194 Groebenzell, Germany


Re: [PATCH RESEND 5.10.y-cip 03/13] thermal/drivers: Add TSU driver for RZ/G2L

Pavel Machek
 

Hi!

commit 673c68bd48390dad01f7d17670de3e33b60860ac upstream.

The RZ/G2L SoC incorporates a thermal sensor unit (TSU) that measures the
temperature inside the LSI.

The thermal sensor in this unit measures temperatures in the range from
−40 degree Celsius to 125 degree Celsius with an accuracy of ±3°C. The
TSU repeats measurement at 20 microseconds intervals and automatically
updates the results of measurement.

The TSU has no interrupts as well as no external pins.

This patch adds Thermal Sensor Unit(TSU) driver for RZ/G2L SoC.
+#define TSU_SS_CONV_RUNNING BIT(0)
+
+#define TS_CODE_AVE_SCALE(x) ((x) * 1000000)
+#define MCELSIUS(temp) ((temp) * MILLIDEGREE_PER_DEGREE)
+#define TS_CODE_CAP_TIMES 8 /* Capture times */
Two spaces, plus "capture times" does not really explain much.

+static int rzg2l_thermal_get_temp(void *devdata, int *temp)
+{
+ struct rzg2l_thermal_priv *priv = devdata;
+ u32 result = 0, dsensor, ts_code_ave;
+ int val, i;
+
+ for (i = 0; i < TS_CODE_CAP_TIMES ; i++) {
+ /* TSU repeats measurement at 20 microseconds intervals and
+ * automatically updates the results of
According to CodingStyle, /* should be on separate line.

+ dev_dbg(dev, "TSU probed with %s caliberation values",
+ rzg2l_thermal_read(priv, OTPTSUTRIM_REG(0)) ? "hw" : "sw");
Typo, should be "calibration" I guess.

Best regards,
Pavel
--
DENX Software Engineering GmbH, Managing Director: Wolfgang Denk
HRB 165235 Munich, Office: Kirchenstr.5, D-82194 Groebenzell, Germany


Re: cip/linux-4.4.y-cip build: 187 builds: 5 failed, 182 passed, 6 errors, 200 warnings (v4.4.302-cip69-508-gd887d54a1be6) #kernelci

Pavel Machek
 

Hi!

cip/linux-4.4.y-cip build: 187 builds: 5 failed, 182 passed, 6 errors, 200 warnings (v4.4.302-cip69-508-gd887d54a1be6)

Full Build Summary: https://kernelci.org/build/cip/branch/linux-4.4.y-cip/kernel/v4.4.302-cip69-508-gd887d54a1be6/

Tree: cip
Branch: linux-4.4.y-cip
Git Describe: v4.4.302-cip69-508-gd887d54a1be6
Git Commit: d887d54a1be6de9a74cb732ba80ecaf1cedefb61
Git URL: https://git.kernel.org/pub/scm/linux/kernel/git/cip/linux-cip.git
Built: 6 unique architectures

Build Failures Detected:

arm:
rpc_defconfig: (gcc-10) FAIL
The log tells me:

arm-linux-gnueabihf-gcc: error: unrecognized -march target: armv3
arm-linux-gnueabihf-gcc: error: missing argument to ‘-march=’

AFAIK armv3 support has been removed from gcc 9, we're using gcc 10
here. If we still care about such boards we would have to switch to a
older compiler (for that config). Don't know yet if that is possible in
kernelci configuration.
I'm not sure what machine "rpc" is. It is quite probable it does not
really need armv3 instruction set.

mips:
fuloong2e_defconfig: (gcc-10) FAIL
ip27_defconfig: (gcc-10) FAIL
ip28_defconfig: (gcc-10) FAIL
lemote2f_defconfig: (gcc-10) FAIL
According to [1] CIP does not have a single mips reference board, so I
assume we could simply skip mips completely, right?

Should we disable mips unconditionally for all branches, or just for
4.4. because it makes problems here? I would vote for 4.4 disablement
only, but no idea if we can configure that in kernelci configuration.
Let's see...
We could. Even better would be running 4.4-stable with same configs,
and see if they fail, too. If -stable works and -cip fails, we might
want to look into that.

Best regards,
Pavel
--
DENX Software Engineering GmbH, Managing Director: Wolfgang Denk
HRB 165235 Munich, Office: Kirchenstr.5, D-82194 Groebenzell, Germany


Re: [PATCH RESEND 5.10.y-cip 01/13] kernel.h: split out mathematical helpers

Pavel Machek
 

Hi!

From: Andy Shevchenko <andriy.shevchenko@...>

commit aa6159ab99a9ab5df835b4750b66cf132a5aa292 upstream

kernel.h is being used as a dump for all kinds of stuff for a long time.
Here is the attempt to start cleaning it up by splitting out
mathematical helpers.

At the same time convert users in header and lib folder to use new
header. Though for time being include new header back to kernel.h to
avoid twisted indirected includes for existing users.
This is rather intrusive for two lines which we really need, and may
cause rejects in future.

I'd suggest identifying the defines needed by the driver, and just
adding those. kernel.h would be acceptable. Or you can add math.h with
just defines needed, but please avoid code movement.

Best regards,
Pavel

---
fs/nfs/callback_proc.c | 5 +
include/linux/bitops.h | 11 ++-
include/linux/dcache.h | 1 +
include/linux/iommu-helper.h | 4 +-
include/linux/kernel.h | 173 +--------------------------------
include/linux/math.h | 177 ++++++++++++++++++++++++++++++++++
include/linux/rcu_node_tree.h | 2 +
include/linux/units.h | 2 +-
lib/errname.c | 1 +
lib/errseq.c | 1 +
lib/find_bit.c | 3 +-
lib/math/div64.c | 4 +-
lib/math/int_pow.c | 2 +-
lib/math/int_sqrt.c | 3 +-
lib/math/reciprocal_div.c | 9 +-
15 files changed, 215 insertions(+), 183 deletions(-)
create mode 100644 include/linux/math.h


--
DENX Software Engineering GmbH, Managing Director: Wolfgang Denk
HRB 165235 Munich, Office: Kirchenstr.5, D-82194 Groebenzell, Germany


Re: [isar-cip-core] README.secuirty-testing.md: Add steps to verify CIP security image

Shreyas.Karmahe@...
 

Hi Jan-San,

I have shared the below MR patch request that covers the documentation steps to verify IEC Layer Test on CIP security image but unable to see this request in mailing list.
Kindly let me know status of this MR

Regards,
Shreyas

-----Original Message-----
From: Shreyas.Karmahe@... <Shreyas.Karmahe@...>
Sent: Friday, July 8, 2022 1:21 PM
To: cip-dev@...; jan.kiszka@...
Cc: karmahe shreyas(TSIP TMIEC ODG Porting) <Shreyas.Karmahe@...>; dinesh kumar(TSIP TMIEC ODG Porting) <dinesh.kumar@...>; pyla venkata(TSIP TMIEC ODG Porting) <Venkata.Pyla@...>; hayashi kazuhiro(林 和宏 □SWC◯ACT) <kazuhiro3.hayashi@...>
Subject: [isar-cip-core] README.secuirty-testing.md: Add steps to verify CIP security image

From: Shreyas Karmahe <Shreyas.Karmahe@...>

This document helps to build cip security image and verify the IEC layer using cip-security-tests[1].

[1] https://gitlab.com/cip-project/cip-testing/cip-security-tests

Signed-off-by: Shreyas Karmahe <Shreyas.Karmahe@...>
---
doc/README.security-testing.md | 80 ++++++++++++++++++++++++++++++++++
1 file changed, 80 insertions(+)
create mode 100644 doc/README.security-testing.md

diff --git a/doc/README.security-testing.md b/doc/README.security-testing.md new file mode 100644 index 0000000..b29531c
--- /dev/null
+++ b/doc/README.security-testing.md
@@ -0,0 +1,80 @@
+# CIP security testing
+This document explains how to verify basic implementations of [CIP security requirements](https://gitlab.com/cip-project/cip-documents/-/blob/master/security/security_requirements.md) in the isar-cip-core security image using [cip-security-tests](https://gitlab.com/cip-project/cip-testing/cip-security-tests).
+
+# Pre-requisite
+- Necessary debian packages to implement CIP security requirements,
+include them in the recipe
+[cip-core-image-security.bb](recipes-core/images/cip-core-image-securit
+y.bb)
+
+- Pre configurations in the image, should be added in the `postinst`
+script of security-customizations
+[security-customizations/files/postinst](recipes-core/security-customiz
+ations/files/postinst)
+
+- To run `cip-security-tests` the image should need additional package `sshpass` and rootfs size should need atleast 5GB, add the below configuration in kas/opt/security.yml file
+ ```
+ local_conf_header:
+ security_testing: |
+ IMAGE_PREINSTALL_append=" sshpass"
+ ROOTFS_EXTRA="5120"
+ ```
+
+
+# Build CIP security Linux image
+Clone isar-cip-core repository
+```
+host$ git clone
+https://gitlab.com/cip-project/cip-core/isar-cip-core.git
+host$ cd isar-cip-core
+```
+Build Security Linux image by selecting necessary options ``` host$
+./kas-container menu
+ Select QEMU AMD64 (x86-64) as Target Board
+ Select Kernel 5.10.x-cip as Kernel Options
+ Select bullseye (11) as Debian Release
+ Select Flashable image as Image formats
+ Select Security extensions Options
+Save & Build
+```
+# Boot the Linux image
+```
+host$ ./start-qemu.sh x86
+```
+
+# Copy security tests in to the Linux image
+- Clone the cip-security-tests from following URL ``` host$ git clone
+https://gitlab.com/cip-project/cip-testing/cip-security-tests
+```
+- Add test user in Linux image to use while scp the
+`cip-security-tests` ``` image$ adduser test ```
+- Copy `cip-security-tests` to Linux image using scp command ``` host$
+scp -r -P 22222 TCs/ test@....0.1:/home/test/ ```
+
+# Run the test in Linux image
+- Go to following directory and execute IEC Layer test ``` image$ cd
+/home/test/TCs/cip-security-tests/iec-security-tests/singlenode-testcas
+es/
+image$ ./run_all.sh
+```
+`run_all.sh` generates the test result in file `result_file.txt`, and output look like below.
+```
+TC_CR1.1-RE1_1+pass+11
+TC_CR1.11_1+pass+22
+TC_CR1.11_2+pass+30
+TC_CR1.1_1+pass+5
+TC_CR1.1_2+pass+6
+TC_CR1.3_1+pass+7
+TC_CR1.3_2+pass+4
+TC_CR1.3_3+pass+5
+TC_CR1.4_1+pass+7
+TC_CR1.5_2+pass+13
+TC_CR1.5_3+pass+10
+TC_CR1.7-RE1_1+pass+5
+ :
+ .
+[Truncated]
+```
+Each line of the output will have this \<requirement
+number\>+<requirement pass/fail>+\<time took to execute this test
+case\>
+- pass - The security image is meeting this requirement.
+- fail - The security image is failed to met this requirement.
+- skip - The test case not supported by IEC layer.
--
2.30.2


Re: [5.10.y-cip] Build error with defconfig

Biju Das <biju.das.jz@...>
 

Hi Nobuhoro-San,

Sorry for the noise. It is random issue.
I cannot reproduce the issue now.
The build is ok now.

Cheers,
Biju

-----Original Message-----
From: nobuhiro1.iwamatsu@... <nobuhiro1.iwamatsu@...>
Sent: 14 July 2022 09:04
To: Biju Das <biju.das.jz@...>; cip-dev@...;
pavel@...
Subject: RE: [5.10.y-cip] Build error with defconfig

Hi Biju,

I built v5.10.129-cip12 with defconfig, but I didn't have the same
problem.

```
$ gcc -v
Using built-in specs.
COLLECT_GCC=gcc
COLLECT_LTO_WRAPPER=/usr/lib/gcc/x86_64-linux-gnu/11/lto-wrapper
OFFLOAD_TARGET_NAMES=nvptx-none:amdgcn-amdhsa
OFFLOAD_TARGET_DEFAULT=1
Target: x86_64-linux-gnu
Configured with: ../src/configure -v --with-pkgversion='Debian 11.2.0-18'
--with-bugurl=file:///usr/share/doc/gcc-11/README.Bugs --enable-
languages=c,ada,c++,go,brig,d,fortran,objc,obj-c++,m2 --prefix=/usr --
with-gcc-major-version-only --program-suffix=-11 --program-prefix=x86_64-
linux-gnu- --enable-shared --enable-linker-build-id --libexecdir=/usr/lib
--without-included-gettext --enable-threads=posix --libdir=/usr/lib --
enable-nls --enable-bootstrap --enable-clocale=gnu --enable-libstdcxx-
debug --enable-libstdcxx-time=yes --with-default-libstdcxx-abi=new --
enable-gnu-unique-object --disable-vtable-verify --enable-plugin --
enable-default-pie --with-system-zlib --enable-libphobos-checking=release
--with-target-system-zlib=auto --enable-objc-gc=auto --enable-multiarch -
-disable-werror --enable-cet --with-arch-32=i686 --with-abi=m64 --with-
multilib-list=m32,m64,mx32 --enable-multilib --with-tune=generic --
enable-offload-targets=nvptx-none=/build/gcc-11-RK3FrC/gcc-11-
11.2.0/debian/tmp-nvptx/usr,amdgcn-amdhsa=/build/gcc-11-RK3FrC/gcc-11-
11.2.0/debian/tmp-gcn/usr --without-cuda-driver --enable-checking=release
--build=x86_64-linux-gnu --host=x86_64-linux-gnu --target=x86_64-linux-
gnu --with-build-config=bootstrap-lto-lean --enable-link-serialization=2
Thread model: posix Supported LTO compression algorithms: zlib zstd gcc
version 11.2.0 (Debian 11.2.0-18) $ aarch64-linux-gnu-gcc -v Using built-
in specs.
COLLECT_GCC=aarch64-linux-gnu-gcc
COLLECT_LTO_WRAPPER=/usr/lib/gcc-cross/aarch64-linux-gnu/10/lto-wrapper
Target: aarch64-linux-gnu
Configured with: ../src/configure -v --with-pkgversion='Debian 10.3.0-8'
--with-bugurl=file:///usr/share/doc/gcc-10/README.Bugs --enable-
languages=c,ada,c++,go,d,fortran,objc,obj-c++,m2 --prefix=/usr --with-
gcc-major-version-only --program-suffix=-10 --enable-shared --enable-
linker-build-id --libexecdir=/usr/lib --without-included-gettext --
enable-threads=posix --libdir=/usr/lib --enable-nls --with-sysroot=/ --
enable-clocale=gnu --enable-libstdcxx-debug --enable-libstdcxx-time=yes -
-with-default-libstdcxx-abi=new --enable-gnu-unique-object --disable-
libquadmath --disable-libquadmath-support --enable-plugin --enable-
default-pie --with-system-zlib --enable-libphobos-checking=release --
without-target-system-zlib --enable-multiarch --enable-fix-cortex-a53-
843419 --disable-werror --enable-checking=release --build=x86_64-linux-
gnu --host=x86_64-linux-gnu --target=aarch64-linux-gnu --program-
prefix=aarch64-linux-gnu- --includedir=/usr/aarch64-linux-gnu/include --
with-build-config=bootstrap-lto-lean --enable-link-mutex Thread model:
posix Supported LTO compression algorithms: zlib zstd
gcc version 10.3.0 (Debian 10.3.0-8)
g$ it log --oneline -1
19dd4538e81e (HEAD -> linux-5.10.y-cip, tag: v5.10.129-cip12, cip/linux-
5.10.y-cip) CIP: Bump version suffix to -cip12 after merge from stable
$ make ARCH=arm64 mrproper
$ make ARCH=arm64 defconfig
$ make ARCH=arm64 CROSS_COMPILE=aarch64-linux-gnu- -j32
[....]
No error.
```

Best regards,
Nobuhiro

-----Original Message-----
From: Biju Das <biju.das.jz@...>
Sent: Thursday, July 14, 2022 4:41 PM
To: cip-dev@...; iwamatsu nobuhiro(岩松 信洋 □SWC◯A
CT) <nobuhiro1.iwamatsu@...>; Pavel Machek <pavel@...>
Subject: [5.10.y-cip] Build error with defconfig

Hi Pavel and Nobuhiro,

I get build error[2] with defconfig with this commit id[1].

Q1) have you seen this issue?

[1]
commit 19dd4538e81e4019bc96ac6521af3a4ec93e110c (HEAD -> test, tag:
v5.10.129-cip12, rzg2l-linux/linux-5.10.y-cip,
origin/linux-5.10.y-cip,
linux-5.10.y-cip)
Author: Nobuhiro Iwamatsu <nobuhiro1.iwamatsu@...>
Date: Fri Jul 8 14:30:34 2022 +0900

CIP: Bump version suffix to -cip12 after merge from stable

[2]
Build logs:
biju@biju-VirtualBox:~/linux-cip$ ~/compile_copy_rzg2l.sh
*** Default configuration is based on 'defconfig'
#
# No change to .config
#
CALL scripts/atomic/check-atomics.sh
CALL scripts/checksyscalls.sh
CHK include/generated/compile.h
CC arch/arm64/mm/dma-mapping.o
CC arch/arm64/xen/../../arm/xen/mm.o
CC arch/arm64/mm/init.o
CC kernel/dma/mapping.o
CC kernel/dma/direct.o
CC kernel/dma/ops_helpers.o
CC kernel/dma/dummy.o
CC kernel/dma/contiguous.o
CC kernel/dma/coherent.o
CC kernel/dma/swiotlb.o
CC kernel/dma/pool.o
CC [M] fs/btrfs/disk-io.o
CC [M] fs/btrfs/inode.o
CC [M] fs/btrfs/file.o
In file included from ./include/linux/dma-map-ops.h:75,
from ./include/linux/dma-direct.h:10,
from arch/arm64/xen/../../arm/xen/mm.c:3:
./arch/arm64/include/asm/dma-mapping.h: In function
'__generic_dma_ops':
./arch/arm64/include/asm/dma-mapping.h:32:26: error: 'struct
dev_archdata'
has no member named 'dma_ops'
32 | if (dev && dev->archdata.dma_ops)
| ^
./arch/arm64/include/asm/dma-mapping.h:33:23: error: 'struct
dev_archdata'
has no member named 'dma_ops'
33 | return dev->archdata.dma_ops;
| ^
./arch/arm64/include/asm/dma-mapping.h: In function 'get_dma_ops':
./arch/arm64/include/asm/dma-mapping.h:45:10: error: 'xen_dma_ops'
undeclared (first use in this function); did you mean 'get_dma_ops'?
45 | return xen_dma_ops;
| ^~~~~~~~~~~
| get_dma_ops
./arch/arm64/include/asm/dma-mapping.h:45:10: note: each undeclared
identifier is reported only once for each function it appears in
./arch/arm64/include/asm/dma-mapping.h: In function
'is_device_dma_coherent':
./arch/arm64/include/asm/dma-mapping.h:64:22: error: 'struct
dev_archdata'
has no member named 'dma_coherent'
64 | return dev->archdata.dma_coherent;
| ^
./arch/arm64/include/asm/dma-mapping.h: At top level:
./arch/arm64/include/asm/dma-mapping.h:67:10: fatal error:
asm-generic/dma-mapping-common.h: No such file or directory
67 | #include <asm-generic/dma-mapping-common.h>
| ^~~~~~~~~~~~~~~~~~~~~~~~~~~~~~~~~~

Cheers,
Biju


[5.10.y-cip] Build error with defconfig

Biju Das <biju.das.jz@...>
 

Hi Pavel and Nobuhiro,

I get build error[2] with defconfig with this commit id[1].

Q1) have you seen this issue?

[1]
commit 19dd4538e81e4019bc96ac6521af3a4ec93e110c (HEAD -> test, tag: v5.10.129-cip12, rzg2l-linux/linux-5.10.y-cip, origin/linux-5.10.y-cip, linux-5.10.y-cip)
Author: Nobuhiro Iwamatsu <nobuhiro1.iwamatsu@...>
Date: Fri Jul 8 14:30:34 2022 +0900

CIP: Bump version suffix to -cip12 after merge from stable

[2]
Build logs:
biju@biju-VirtualBox:~/linux-cip$ ~/compile_copy_rzg2l.sh
*** Default configuration is based on 'defconfig'
#
# No change to .config
#
CALL scripts/atomic/check-atomics.sh
CALL scripts/checksyscalls.sh
CHK include/generated/compile.h
CC arch/arm64/mm/dma-mapping.o
CC arch/arm64/xen/../../arm/xen/mm.o
CC arch/arm64/mm/init.o
CC kernel/dma/mapping.o
CC kernel/dma/direct.o
CC kernel/dma/ops_helpers.o
CC kernel/dma/dummy.o
CC kernel/dma/contiguous.o
CC kernel/dma/coherent.o
CC kernel/dma/swiotlb.o
CC kernel/dma/pool.o
CC [M] fs/btrfs/disk-io.o
CC [M] fs/btrfs/inode.o
CC [M] fs/btrfs/file.o
In file included from ./include/linux/dma-map-ops.h:75,
from ./include/linux/dma-direct.h:10,
from arch/arm64/xen/../../arm/xen/mm.c:3:
./arch/arm64/include/asm/dma-mapping.h: In function '__generic_dma_ops':
./arch/arm64/include/asm/dma-mapping.h:32:26: error: 'struct dev_archdata' has no member named 'dma_ops'
32 | if (dev && dev->archdata.dma_ops)
| ^
./arch/arm64/include/asm/dma-mapping.h:33:23: error: 'struct dev_archdata' has no member named 'dma_ops'
33 | return dev->archdata.dma_ops;
| ^
./arch/arm64/include/asm/dma-mapping.h: In function 'get_dma_ops':
./arch/arm64/include/asm/dma-mapping.h:45:10: error: 'xen_dma_ops' undeclared (first use in this function); did you mean 'get_dma_ops'?
45 | return xen_dma_ops;
| ^~~~~~~~~~~
| get_dma_ops
./arch/arm64/include/asm/dma-mapping.h:45:10: note: each undeclared identifier is reported only once for each function it appears in
./arch/arm64/include/asm/dma-mapping.h: In function 'is_device_dma_coherent':
./arch/arm64/include/asm/dma-mapping.h:64:22: error: 'struct dev_archdata' has no member named 'dma_coherent'
64 | return dev->archdata.dma_coherent;
| ^
./arch/arm64/include/asm/dma-mapping.h: At top level:
./arch/arm64/include/asm/dma-mapping.h:67:10: fatal error: asm-generic/dma-mapping-common.h: No such file or directory
67 | #include <asm-generic/dma-mapping-common.h>
| ^~~~~~~~~~~~~~~~~~~~~~~~~~~~~~~~~~

Cheers,
Biju


cip-gitlab/ci/iwamatsu/linux-5.10.y-cip-rc kselftest-futex: 3 runs, 2 regressions (v5.10.129-cip12-59-ge5b19636ca9c4) #kernelci

kernelci.org bot <bot@...>
 

cip-gitlab/ci/iwamatsu/linux-5.10.y-cip-rc kselftest-futex: 3 runs, 2 regressions (v5.10.129-cip12-59-ge5b19636ca9c4)

Regressions Summary
-------------------

platform | arch | lab | compiler | defconfig | regressions
-----------------------------+-------+--------------+----------+-----------+------------
meson-gxl-s905x-libretech-cc | arm64 | lab-baylibre | gcc-10 | defconfig | 1
r8a774a1-hihope-rzg2m-ex | arm64 | lab-cip | gcc-10 | defconfig | 1

Details: https://kernelci.org/test/job/cip-gitlab/branch/ci%2Fiwamatsu%2Flinux-5.10.y-cip-rc/kernel/v5.10.129-cip12-59-ge5b19636ca9c4/plan/kselftest-futex/

Test: kselftest-futex
Tree: cip-gitlab
Branch: ci/iwamatsu/linux-5.10.y-cip-rc
Describe: v5.10.129-cip12-59-ge5b19636ca9c4
URL: https://gitlab.com/cip-project/cip-kernel/linux-cip.git
SHA: e5b19636ca9c43e262a365d756d491479adb3884


Test Regressions
----------------


platform | arch | lab | compiler | defconfig | regressions
-----------------------------+-------+--------------+----------+-----------+------------
meson-gxl-s905x-libretech-cc | arm64 | lab-baylibre | gcc-10 | defconfig | 1

Details: https://kernelci.org/test/plan/id/62d1523f325257abcea39bf0

Results: 0 PASS, 1 FAIL, 0 SKIP
Full config: defconfig
Compiler: gcc-10 (aarch64-linux-gnu-gcc (Debian 10.2.1-6) 10.2.1 20210110)
Plain log: https://storage.kernelci.org//cip-gitlab/ci-iwamatsu-linux-5.10.y-cip-rc/v5.10.129-cip12-59-ge5b19636ca9c4/arm64/defconfig/gcc-10/lab-baylibre/kselftest-futex-meson-gxl-s905x-libretech-cc.txt
HTML log: https://storage.kernelci.org//cip-gitlab/ci-iwamatsu-linux-5.10.y-cip-rc/v5.10.129-cip12-59-ge5b19636ca9c4/arm64/defconfig/gcc-10/lab-baylibre/kselftest-futex-meson-gxl-s905x-libretech-cc.html
Rootfs: http://storage.kernelci.org/images/rootfs/debian/bullseye-kselftest/20220708.0/arm64/initrd.cpio.gz


* kselftest-futex.login: https://kernelci.org/test/case/id/62d1523f325257abcea39bf1
failing since 12 days (last pass: v5.10.121-cip9-287-ge9094c8446fc, first fail: v5.10.125-cip10-118-gb03e159be974)



platform | arch | lab | compiler | defconfig | regressions
-----------------------------+-------+--------------+----------+-----------+------------
r8a774a1-hihope-rzg2m-ex | arm64 | lab-cip | gcc-10 | defconfig | 1

Details: https://kernelci.org/test/plan/id/62d154b6254cdb8373a39bd6

Results: 0 PASS, 1 FAIL, 0 SKIP
Full config: defconfig
Compiler: gcc-10 (aarch64-linux-gnu-gcc (Debian 10.2.1-6) 10.2.1 20210110)
Plain log: https://storage.kernelci.org//cip-gitlab/ci-iwamatsu-linux-5.10.y-cip-rc/v5.10.129-cip12-59-ge5b19636ca9c4/arm64/defconfig/gcc-10/lab-cip/kselftest-futex-r8a774a1-hihope-rzg2m-ex.txt
HTML log: https://storage.kernelci.org//cip-gitlab/ci-iwamatsu-linux-5.10.y-cip-rc/v5.10.129-cip12-59-ge5b19636ca9c4/arm64/defconfig/gcc-10/lab-cip/kselftest-futex-r8a774a1-hihope-rzg2m-ex.html
Rootfs: http://storage.kernelci.org/images/rootfs/debian/bullseye-kselftest/20220708.0/arm64/initrd.cpio.gz


* kselftest-futex.login: https://kernelci.org/test/case/id/62d154b6254cdb8373a39bd7
new failure (last pass: v5.10.126-cip11-116-gef362fbbff528)


cip-gitlab/ci/iwamatsu/linux-5.10.y-cip-rc baseline: 121 runs, 10 regressions (v5.10.129-cip12-59-ge5b19636ca9c4) #kernelci

kernelci.org bot <bot@...>
 

cip-gitlab/ci/iwamatsu/linux-5.10.y-cip-rc baseline: 121 runs, 10 regressions (v5.10.129-cip12-59-ge5b19636ca9c4)

Regressions Summary
-------------------

platform | arch | lab | compiler | defconfig | regressions
---------------------------+-------+--------------+----------+--------------------+------------
jetson-tk1 | arm | lab-baylibre | gcc-10 | multi_v7_defconfig | 1
jetson-tk1 | arm | lab-baylibre | gcc-10 | tegra_defconfig | 1
qemu_arm64-virt-gicv2 | arm64 | lab-baylibre | gcc-10 | defconfig | 1
qemu_arm64-virt-gicv2 | arm64 | lab-broonie | gcc-10 | defconfig | 1
qemu_arm64-virt-gicv2-uefi | arm64 | lab-baylibre | gcc-10 | defconfig | 1
qemu_arm64-virt-gicv2-uefi | arm64 | lab-broonie | gcc-10 | defconfig | 1
qemu_arm64-virt-gicv3 | arm64 | lab-baylibre | gcc-10 | defconfig | 1
qemu_arm64-virt-gicv3 | arm64 | lab-broonie | gcc-10 | defconfig | 1
qemu_arm64-virt-gicv3-uefi | arm64 | lab-baylibre | gcc-10 | defconfig | 1
qemu_arm64-virt-gicv3-uefi | arm64 | lab-broonie | gcc-10 | defconfig | 1

Details: https://kernelci.org/test/job/cip-gitlab/branch/ci%2Fiwamatsu%2Flinux-5.10.y-cip-rc/kernel/v5.10.129-cip12-59-ge5b19636ca9c4/plan/baseline/

Test: baseline
Tree: cip-gitlab
Branch: ci/iwamatsu/linux-5.10.y-cip-rc
Describe: v5.10.129-cip12-59-ge5b19636ca9c4
URL: https://gitlab.com/cip-project/cip-kernel/linux-cip.git
SHA: e5b19636ca9c43e262a365d756d491479adb3884


Test Regressions
----------------


platform | arch | lab | compiler | defconfig | regressions
---------------------------+-------+--------------+----------+--------------------+------------
jetson-tk1 | arm | lab-baylibre | gcc-10 | multi_v7_defconfig | 1

Details: https://kernelci.org/test/plan/id/62d151b55047525569a39bcd

Results: 0 PASS, 1 FAIL, 0 SKIP
Full config: multi_v7_defconfig
Compiler: gcc-10 (arm-linux-gnueabihf-gcc (Debian 10.2.1-6) 10.2.1 20210110)
Plain log: https://storage.kernelci.org//cip-gitlab/ci-iwamatsu-linux-5.10.y-cip-rc/v5.10.129-cip12-59-ge5b19636ca9c4/arm/multi_v7_defconfig/gcc-10/lab-baylibre/baseline-jetson-tk1.txt
HTML log: https://storage.kernelci.org//cip-gitlab/ci-iwamatsu-linux-5.10.y-cip-rc/v5.10.129-cip12-59-ge5b19636ca9c4/arm/multi_v7_defconfig/gcc-10/lab-baylibre/baseline-jetson-tk1.html
Rootfs: http://storage.kernelci.org/images/rootfs/buildroot/buildroot-baseline/20220708.0/armel/rootfs.cpio.gz


* baseline.login: https://kernelci.org/test/case/id/62d151b55047525569a39bce
failing since 45 days (last pass: v5.10.112-cip6-289-g2969e096d186, first fail: v5.10.118-465-g0af29783a3c9)



platform | arch | lab | compiler | defconfig | regressions
---------------------------+-------+--------------+----------+--------------------+------------
jetson-tk1 | arm | lab-baylibre | gcc-10 | tegra_defconfig | 1

Details: https://kernelci.org/test/plan/id/62d14e32c1224bf495a39bde

Results: 0 PASS, 1 FAIL, 0 SKIP
Full config: tegra_defconfig
Compiler: gcc-10 (arm-linux-gnueabihf-gcc (Debian 10.2.1-6) 10.2.1 20210110)
Plain log: https://storage.kernelci.org//cip-gitlab/ci-iwamatsu-linux-5.10.y-cip-rc/v5.10.129-cip12-59-ge5b19636ca9c4/arm/tegra_defconfig/gcc-10/lab-baylibre/baseline-jetson-tk1.txt
HTML log: https://storage.kernelci.org//cip-gitlab/ci-iwamatsu-linux-5.10.y-cip-rc/v5.10.129-cip12-59-ge5b19636ca9c4/arm/tegra_defconfig/gcc-10/lab-baylibre/baseline-jetson-tk1.html
Rootfs: http://storage.kernelci.org/images/rootfs/buildroot/buildroot-baseline/20220708.0/armel/rootfs.cpio.gz


* baseline.login: https://kernelci.org/test/case/id/62d14e32c1224bf495a39bdf
failing since 45 days (last pass: v5.10.112-cip6-289-g2969e096d186, first fail: v5.10.118-465-g0af29783a3c9)



platform | arch | lab | compiler | defconfig | regressions
---------------------------+-------+--------------+----------+--------------------+------------
qemu_arm64-virt-gicv2 | arm64 | lab-baylibre | gcc-10 | defconfig | 1

Details: https://kernelci.org/test/plan/id/62d152558b61ab73a0a39bcd

Results: 0 PASS, 1 FAIL, 0 SKIP
Full config: defconfig
Compiler: gcc-10 (aarch64-linux-gnu-gcc (Debian 10.2.1-6) 10.2.1 20210110)
Plain log: https://storage.kernelci.org//cip-gitlab/ci-iwamatsu-linux-5.10.y-cip-rc/v5.10.129-cip12-59-ge5b19636ca9c4/arm64/defconfig/gcc-10/lab-baylibre/baseline-qemu_arm64-virt-gicv2.txt
HTML log: https://storage.kernelci.org//cip-gitlab/ci-iwamatsu-linux-5.10.y-cip-rc/v5.10.129-cip12-59-ge5b19636ca9c4/arm64/defconfig/gcc-10/lab-baylibre/baseline-qemu_arm64-virt-gicv2.html
Rootfs: http://storage.kernelci.org/images/rootfs/buildroot/buildroot-baseline/20220708.0/arm64/rootfs.cpio.gz


* baseline.login: https://kernelci.org/test/case/id/62d152558b61ab73a0a39bce
failing since 66 days (last pass: v5.10.112-cip6-88-gf3397cadb2dd6, first fail: v5.10.112-cip6-218-g8253434cd56a)



platform | arch | lab | compiler | defconfig | regressions
---------------------------+-------+--------------+----------+--------------------+------------
qemu_arm64-virt-gicv2 | arm64 | lab-broonie | gcc-10 | defconfig | 1

Details: https://kernelci.org/test/plan/id/62d154c76288de7dd5a39bcd

Results: 0 PASS, 1 FAIL, 0 SKIP
Full config: defconfig
Compiler: gcc-10 (aarch64-linux-gnu-gcc (Debian 10.2.1-6) 10.2.1 20210110)
Plain log: https://storage.kernelci.org//cip-gitlab/ci-iwamatsu-linux-5.10.y-cip-rc/v5.10.129-cip12-59-ge5b19636ca9c4/arm64/defconfig/gcc-10/lab-broonie/baseline-qemu_arm64-virt-gicv2.txt
HTML log: https://storage.kernelci.org//cip-gitlab/ci-iwamatsu-linux-5.10.y-cip-rc/v5.10.129-cip12-59-ge5b19636ca9c4/arm64/defconfig/gcc-10/lab-broonie/baseline-qemu_arm64-virt-gicv2.html
Rootfs: http://storage.kernelci.org/images/rootfs/buildroot/buildroot-baseline/20220708.0/arm64/rootfs.cpio.gz


* baseline.login: https://kernelci.org/test/case/id/62d154c76288de7dd5a39bce
failing since 66 days (last pass: v5.10.112-cip6-88-gf3397cadb2dd6, first fail: v5.10.112-cip6-218-g8253434cd56a)



platform | arch | lab | compiler | defconfig | regressions
---------------------------+-------+--------------+----------+--------------------+------------
qemu_arm64-virt-gicv2-uefi | arm64 | lab-baylibre | gcc-10 | defconfig | 1

Details: https://kernelci.org/test/plan/id/62d15254b23aec9ce4a39bfb

Results: 0 PASS, 1 FAIL, 0 SKIP
Full config: defconfig
Compiler: gcc-10 (aarch64-linux-gnu-gcc (Debian 10.2.1-6) 10.2.1 20210110)
Plain log: https://storage.kernelci.org//cip-gitlab/ci-iwamatsu-linux-5.10.y-cip-rc/v5.10.129-cip12-59-ge5b19636ca9c4/arm64/defconfig/gcc-10/lab-baylibre/baseline-qemu_arm64-virt-gicv2-uefi.txt
HTML log: https://storage.kernelci.org//cip-gitlab/ci-iwamatsu-linux-5.10.y-cip-rc/v5.10.129-cip12-59-ge5b19636ca9c4/arm64/defconfig/gcc-10/lab-baylibre/baseline-qemu_arm64-virt-gicv2-uefi.html
Rootfs: http://storage.kernelci.org/images/rootfs/buildroot/buildroot-baseline/20220708.0/arm64/rootfs.cpio.gz


* baseline.login: https://kernelci.org/test/case/id/62d15254b23aec9ce4a39bfc
failing since 66 days (last pass: v5.10.112-cip6-88-gf3397cadb2dd6, first fail: v5.10.112-cip6-218-g8253434cd56a)



platform | arch | lab | compiler | defconfig | regressions
---------------------------+-------+--------------+----------+--------------------+------------
qemu_arm64-virt-gicv2-uefi | arm64 | lab-broonie | gcc-10 | defconfig | 1

Details: https://kernelci.org/test/plan/id/62d15387e16573e733a39bda

Results: 0 PASS, 1 FAIL, 0 SKIP
Full config: defconfig
Compiler: gcc-10 (aarch64-linux-gnu-gcc (Debian 10.2.1-6) 10.2.1 20210110)
Plain log: https://storage.kernelci.org//cip-gitlab/ci-iwamatsu-linux-5.10.y-cip-rc/v5.10.129-cip12-59-ge5b19636ca9c4/arm64/defconfig/gcc-10/lab-broonie/baseline-qemu_arm64-virt-gicv2-uefi.txt
HTML log: https://storage.kernelci.org//cip-gitlab/ci-iwamatsu-linux-5.10.y-cip-rc/v5.10.129-cip12-59-ge5b19636ca9c4/arm64/defconfig/gcc-10/lab-broonie/baseline-qemu_arm64-virt-gicv2-uefi.html
Rootfs: http://storage.kernelci.org/images/rootfs/buildroot/buildroot-baseline/20220708.0/arm64/rootfs.cpio.gz


* baseline.login: https://kernelci.org/test/case/id/62d15387e16573e733a39bdb
failing since 66 days (last pass: v5.10.112-cip6-88-gf3397cadb2dd6, first fail: v5.10.112-cip6-218-g8253434cd56a)



platform | arch | lab | compiler | defconfig | regressions
---------------------------+-------+--------------+----------+--------------------+------------
qemu_arm64-virt-gicv3 | arm64 | lab-baylibre | gcc-10 | defconfig | 1

Details: https://kernelci.org/test/plan/id/62d15252b23aec9ce4a39bf5

Results: 0 PASS, 1 FAIL, 0 SKIP
Full config: defconfig
Compiler: gcc-10 (aarch64-linux-gnu-gcc (Debian 10.2.1-6) 10.2.1 20210110)
Plain log: https://storage.kernelci.org//cip-gitlab/ci-iwamatsu-linux-5.10.y-cip-rc/v5.10.129-cip12-59-ge5b19636ca9c4/arm64/defconfig/gcc-10/lab-baylibre/baseline-qemu_arm64-virt-gicv3.txt
HTML log: https://storage.kernelci.org//cip-gitlab/ci-iwamatsu-linux-5.10.y-cip-rc/v5.10.129-cip12-59-ge5b19636ca9c4/arm64/defconfig/gcc-10/lab-baylibre/baseline-qemu_arm64-virt-gicv3.html
Rootfs: http://storage.kernelci.org/images/rootfs/buildroot/buildroot-baseline/20220708.0/arm64/rootfs.cpio.gz


* baseline.login: https://kernelci.org/test/case/id/62d15252b23aec9ce4a39bf6
failing since 66 days (last pass: v5.10.112-cip6-88-gf3397cadb2dd6, first fail: v5.10.112-cip6-218-g8253434cd56a)



platform | arch | lab | compiler | defconfig | regressions
---------------------------+-------+--------------+----------+--------------------+------------
qemu_arm64-virt-gicv3 | arm64 | lab-broonie | gcc-10 | defconfig | 1

Details: https://kernelci.org/test/plan/id/62d1535e90be4e16aba39bfb

Results: 0 PASS, 1 FAIL, 0 SKIP
Full config: defconfig
Compiler: gcc-10 (aarch64-linux-gnu-gcc (Debian 10.2.1-6) 10.2.1 20210110)
Plain log: https://storage.kernelci.org//cip-gitlab/ci-iwamatsu-linux-5.10.y-cip-rc/v5.10.129-cip12-59-ge5b19636ca9c4/arm64/defconfig/gcc-10/lab-broonie/baseline-qemu_arm64-virt-gicv3.txt
HTML log: https://storage.kernelci.org//cip-gitlab/ci-iwamatsu-linux-5.10.y-cip-rc/v5.10.129-cip12-59-ge5b19636ca9c4/arm64/defconfig/gcc-10/lab-broonie/baseline-qemu_arm64-virt-gicv3.html
Rootfs: http://storage.kernelci.org/images/rootfs/buildroot/buildroot-baseline/20220708.0/arm64/rootfs.cpio.gz


* baseline.login: https://kernelci.org/test/case/id/62d1535e90be4e16aba39bfc
failing since 66 days (last pass: v5.10.112-cip6-88-gf3397cadb2dd6, first fail: v5.10.112-cip6-218-g8253434cd56a)



platform | arch | lab | compiler | defconfig | regressions
---------------------------+-------+--------------+----------+--------------------+------------
qemu_arm64-virt-gicv3-uefi | arm64 | lab-baylibre | gcc-10 | defconfig | 1

Details: https://kernelci.org/test/plan/id/62d15253fb50851ca0a39bd6

Results: 0 PASS, 1 FAIL, 0 SKIP
Full config: defconfig
Compiler: gcc-10 (aarch64-linux-gnu-gcc (Debian 10.2.1-6) 10.2.1 20210110)
Plain log: https://storage.kernelci.org//cip-gitlab/ci-iwamatsu-linux-5.10.y-cip-rc/v5.10.129-cip12-59-ge5b19636ca9c4/arm64/defconfig/gcc-10/lab-baylibre/baseline-qemu_arm64-virt-gicv3-uefi.txt
HTML log: https://storage.kernelci.org//cip-gitlab/ci-iwamatsu-linux-5.10.y-cip-rc/v5.10.129-cip12-59-ge5b19636ca9c4/arm64/defconfig/gcc-10/lab-baylibre/baseline-qemu_arm64-virt-gicv3-uefi.html
Rootfs: http://storage.kernelci.org/images/rootfs/buildroot/buildroot-baseline/20220708.0/arm64/rootfs.cpio.gz


* baseline.login: https://kernelci.org/test/case/id/62d15253fb50851ca0a39bd7
failing since 66 days (last pass: v5.10.112-cip6-88-gf3397cadb2dd6, first fail: v5.10.112-cip6-218-g8253434cd56a)



platform | arch | lab | compiler | defconfig | regressions
---------------------------+-------+--------------+----------+--------------------+------------
qemu_arm64-virt-gicv3-uefi | arm64 | lab-broonie | gcc-10 | defconfig | 1

Details: https://kernelci.org/test/plan/id/62d15373664d535ecea39bf4

Results: 0 PASS, 1 FAIL, 0 SKIP
Full config: defconfig
Compiler: gcc-10 (aarch64-linux-gnu-gcc (Debian 10.2.1-6) 10.2.1 20210110)
Plain log: https://storage.kernelci.org//cip-gitlab/ci-iwamatsu-linux-5.10.y-cip-rc/v5.10.129-cip12-59-ge5b19636ca9c4/arm64/defconfig/gcc-10/lab-broonie/baseline-qemu_arm64-virt-gicv3-uefi.txt
HTML log: https://storage.kernelci.org//cip-gitlab/ci-iwamatsu-linux-5.10.y-cip-rc/v5.10.129-cip12-59-ge5b19636ca9c4/arm64/defconfig/gcc-10/lab-broonie/baseline-qemu_arm64-virt-gicv3-uefi.html
Rootfs: http://storage.kernelci.org/images/rootfs/buildroot/buildroot-baseline/20220708.0/arm64/rootfs.cpio.gz


* baseline.login: https://kernelci.org/test/case/id/62d15373664d535ecea39bf5
failing since 66 days (last pass: v5.10.112-cip6-88-gf3397cadb2dd6, first fail: v5.10.112-cip6-218-g8253434cd56a)


cip-gitlab/ci/iwamatsu/linux-5.10.y-cip-rc baseline-nfs: 29 runs, 4 regressions (v5.10.129-cip12-59-ge5b19636ca9c4) #kernelci

kernelci.org bot <bot@...>
 

cip-gitlab/ci/iwamatsu/linux-5.10.y-cip-rc baseline-nfs: 29 runs, 4 regressions (v5.10.129-cip12-59-ge5b19636ca9c4)

Regressions Summary
-------------------

platform | arch | lab | compiler | defconfig | regressions
-----------------------------+-------+--------------+----------+--------------------+------------
jetson-tk1 | arm | lab-baylibre | gcc-10 | multi_v7_defconfig | 1
jetson-tk1 | arm | lab-baylibre | gcc-10 | tegra_defconfig | 1
meson-gxl-s905x-libretech-cc | arm64 | lab-baylibre | gcc-10 | defconfig | 1
meson-gxl-s905x-libretech-cc | arm64 | lab-broonie | gcc-10 | defconfig | 1

Details: https://kernelci.org/test/job/cip-gitlab/branch/ci%2Fiwamatsu%2Flinux-5.10.y-cip-rc/kernel/v5.10.129-cip12-59-ge5b19636ca9c4/plan/baseline-nfs/

Test: baseline-nfs
Tree: cip-gitlab
Branch: ci/iwamatsu/linux-5.10.y-cip-rc
Describe: v5.10.129-cip12-59-ge5b19636ca9c4
URL: https://gitlab.com/cip-project/cip-kernel/linux-cip.git
SHA: e5b19636ca9c43e262a365d756d491479adb3884


Test Regressions
----------------


platform | arch | lab | compiler | defconfig | regressions
-----------------------------+-------+--------------+----------+--------------------+------------
jetson-tk1 | arm | lab-baylibre | gcc-10 | multi_v7_defconfig | 1

Details: https://kernelci.org/test/plan/id/62d150f28576ff3528a39c17

Results: 0 PASS, 1 FAIL, 0 SKIP
Full config: multi_v7_defconfig
Compiler: gcc-10 (arm-linux-gnueabihf-gcc (Debian 10.2.1-6) 10.2.1 20210110)
Plain log: https://storage.kernelci.org//cip-gitlab/ci-iwamatsu-linux-5.10.y-cip-rc/v5.10.129-cip12-59-ge5b19636ca9c4/arm/multi_v7_defconfig/gcc-10/lab-baylibre/baseline-nfs-jetson-tk1.txt
HTML log: https://storage.kernelci.org//cip-gitlab/ci-iwamatsu-linux-5.10.y-cip-rc/v5.10.129-cip12-59-ge5b19636ca9c4/arm/multi_v7_defconfig/gcc-10/lab-baylibre/baseline-nfs-jetson-tk1.html
Rootfs: http://storage.kernelci.org/images/rootfs/debian/bullseye/20220708.0/armhf/initrd.cpio.gz


* baseline-nfs.login: https://kernelci.org/test/case/id/62d150f28576ff3528a39c18
failing since 45 days (last pass: v5.10.112-cip6-289-g2969e096d186, first fail: v5.10.118-465-g0af29783a3c9)



platform | arch | lab | compiler | defconfig | regressions
-----------------------------+-------+--------------+----------+--------------------+------------
jetson-tk1 | arm | lab-baylibre | gcc-10 | tegra_defconfig | 1

Details: https://kernelci.org/test/plan/id/62d14f8a840fa33995a39bcd

Results: 0 PASS, 1 FAIL, 0 SKIP
Full config: tegra_defconfig
Compiler: gcc-10 (arm-linux-gnueabihf-gcc (Debian 10.2.1-6) 10.2.1 20210110)
Plain log: https://storage.kernelci.org//cip-gitlab/ci-iwamatsu-linux-5.10.y-cip-rc/v5.10.129-cip12-59-ge5b19636ca9c4/arm/tegra_defconfig/gcc-10/lab-baylibre/baseline-nfs-jetson-tk1.txt
HTML log: https://storage.kernelci.org//cip-gitlab/ci-iwamatsu-linux-5.10.y-cip-rc/v5.10.129-cip12-59-ge5b19636ca9c4/arm/tegra_defconfig/gcc-10/lab-baylibre/baseline-nfs-jetson-tk1.html
Rootfs: http://storage.kernelci.org/images/rootfs/debian/bullseye/20220708.0/armhf/initrd.cpio.gz


* baseline-nfs.login: https://kernelci.org/test/case/id/62d14f8a840fa33995a39bce
failing since 45 days (last pass: v5.10.112-cip6-289-g2969e096d186, first fail: v5.10.118-465-g0af29783a3c9)



platform | arch | lab | compiler | defconfig | regressions
-----------------------------+-------+--------------+----------+--------------------+------------
meson-gxl-s905x-libretech-cc | arm64 | lab-baylibre | gcc-10 | defconfig | 1

Details: https://kernelci.org/test/plan/id/62d154080e15c7f588a39bdd

Results: 0 PASS, 1 FAIL, 0 SKIP
Full config: defconfig
Compiler: gcc-10 (aarch64-linux-gnu-gcc (Debian 10.2.1-6) 10.2.1 20210110)
Plain log: https://storage.kernelci.org//cip-gitlab/ci-iwamatsu-linux-5.10.y-cip-rc/v5.10.129-cip12-59-ge5b19636ca9c4/arm64/defconfig/gcc-10/lab-baylibre/baseline-nfs-meson-gxl-s905x-libretech-cc.txt
HTML log: https://storage.kernelci.org//cip-gitlab/ci-iwamatsu-linux-5.10.y-cip-rc/v5.10.129-cip12-59-ge5b19636ca9c4/arm64/defconfig/gcc-10/lab-baylibre/baseline-nfs-meson-gxl-s905x-libretech-cc.html
Rootfs: http://storage.kernelci.org/images/rootfs/debian/bullseye/20220708.0/arm64/initrd.cpio.gz


* baseline-nfs.login: https://kernelci.org/test/case/id/62d154080e15c7f588a39bde
new failure (last pass: v5.10.126-cip11-116-gef362fbbff528)



platform | arch | lab | compiler | defconfig | regressions
-----------------------------+-------+--------------+----------+--------------------+------------
meson-gxl-s905x-libretech-cc | arm64 | lab-broonie | gcc-10 | defconfig | 1

Details: https://kernelci.org/test/plan/id/62d1529a5ab888b902a39bf8

Results: 0 PASS, 1 FAIL, 0 SKIP
Full config: defconfig
Compiler: gcc-10 (aarch64-linux-gnu-gcc (Debian 10.2.1-6) 10.2.1 20210110)
Plain log: https://storage.kernelci.org//cip-gitlab/ci-iwamatsu-linux-5.10.y-cip-rc/v5.10.129-cip12-59-ge5b19636ca9c4/arm64/defconfig/gcc-10/lab-broonie/baseline-nfs-meson-gxl-s905x-libretech-cc.txt
HTML log: https://storage.kernelci.org//cip-gitlab/ci-iwamatsu-linux-5.10.y-cip-rc/v5.10.129-cip12-59-ge5b19636ca9c4/arm64/defconfig/gcc-10/lab-broonie/baseline-nfs-meson-gxl-s905x-libretech-cc.html
Rootfs: http://storage.kernelci.org/images/rootfs/debian/bullseye/20220708.0/arm64/initrd.cpio.gz


* baseline-nfs.login: https://kernelci.org/test/case/id/62d1529a5ab888b902a39bf9
new failure (last pass: v5.10.126-cip11-116-gef362fbbff528)


cip-gitlab/ci/iwamatsu/linux-5.10.y-cip-rc baseline-cip-nfs: 4 runs, 1 regressions (v5.10.129-cip12-59-ge5b19636ca9c4) #kernelci

kernelci.org bot <bot@...>
 

cip-gitlab/ci/iwamatsu/linux-5.10.y-cip-rc baseline-cip-nfs: 4 runs, 1 regressions (v5.10.129-cip12-59-ge5b19636ca9c4)

Regressions Summary
-------------------

platform | arch | lab | compiler | defconfig | regressions
-----------------+------+-------------+----------+--------------------+------------
beaglebone-black | arm | lab-broonie | gcc-10 | multi_v7_defconfig | 1

Details: https://kernelci.org/test/job/cip-gitlab/branch/ci%2Fiwamatsu%2Flinux-5.10.y-cip-rc/kernel/v5.10.129-cip12-59-ge5b19636ca9c4/plan/baseline-cip-nfs/

Test: baseline-cip-nfs
Tree: cip-gitlab
Branch: ci/iwamatsu/linux-5.10.y-cip-rc
Describe: v5.10.129-cip12-59-ge5b19636ca9c4
URL: https://gitlab.com/cip-project/cip-kernel/linux-cip.git
SHA: e5b19636ca9c43e262a365d756d491479adb3884


Test Regressions
----------------


platform | arch | lab | compiler | defconfig | regressions
-----------------+------+-------------+----------+--------------------+------------
beaglebone-black | arm | lab-broonie | gcc-10 | multi_v7_defconfig | 1

Details: https://kernelci.org/test/plan/id/62d14f3df838014977a39bde

Results: 0 PASS, 1 FAIL, 0 SKIP
Full config: multi_v7_defconfig
Compiler: gcc-10 (arm-linux-gnueabihf-gcc (Debian 10.2.1-6) 10.2.1 20210110)
Plain log: https://storage.kernelci.org//cip-gitlab/ci-iwamatsu-linux-5.10.y-cip-rc/v5.10.129-cip12-59-ge5b19636ca9c4/arm/multi_v7_defconfig/gcc-10/lab-broonie/baseline-cip-nfs-beaglebone-black.txt
HTML log: https://storage.kernelci.org//cip-gitlab/ci-iwamatsu-linux-5.10.y-cip-rc/v5.10.129-cip12-59-ge5b19636ca9c4/arm/multi_v7_defconfig/gcc-10/lab-broonie/baseline-cip-nfs-beaglebone-black.html
Rootfs: https://storage.kernelci.org/images/rootfs/cip/20211105/qemu-arm/cip-core-image-kernelci-cip-core-buster-qemu-arm-initrd.img.gz


* baseline-cip-nfs.login: https://kernelci.org/test/case/id/62d14f3df838014977a39bdf
new failure (last pass: v5.10.126-cip11-116-gef362fbbff528)


cip-gitlab/ci/iwamatsu/linux-5.10.y-cip-rc build: 190 builds: 3 failed, 187 passed, 4 errors, 10 warnings (v5.10.129-cip12-59-ge5b19636ca9c4) #kernelci

kernelci.org bot <bot@...>
 

cip-gitlab/ci/iwamatsu/linux-5.10.y-cip-rc build: 190 builds: 3 failed, 187 passed, 4 errors, 10 warnings (v5.10.129-cip12-59-ge5b19636ca9c4)

Full Build Summary: https://kernelci.org/build/cip-gitlab/branch/ci%2Fiwamatsu%2Flinux-5.10.y-cip-rc/kernel/v5.10.129-cip12-59-ge5b19636ca9c4/

Tree: cip-gitlab
Branch: ci/iwamatsu/linux-5.10.y-cip-rc
Git Describe: v5.10.129-cip12-59-ge5b19636ca9c4
Git Commit: e5b19636ca9c43e262a365d756d491479adb3884
Git URL: https://gitlab.com/cip-project/cip-kernel/linux-cip.git
Built: 7 unique architectures

Build Failures Detected:

arm:
rpc_defconfig: (gcc-10) FAIL

mips:
ip27_defconfig: (gcc-10) FAIL
ip28_defconfig: (gcc-10) FAIL

Errors and Warnings Detected:

arc:

arm64:

arm:
rpc_defconfig (gcc-10): 4 errors

i386:

mips:
32r2el_defconfig (gcc-10): 1 warning
decstation_64_defconfig (gcc-10): 1 warning
decstation_defconfig (gcc-10): 1 warning
decstation_r4k_defconfig (gcc-10): 1 warning
lemote2f_defconfig (gcc-10): 1 warning
rm200_defconfig (gcc-10): 1 warning

riscv:
rv32_defconfig (gcc-10): 4 warnings

x86_64:

Errors summary:

2 arm-linux-gnueabihf-gcc: error: unrecognized -march target: armv3m
2 arm-linux-gnueabihf-gcc: error: missing argument to ‘-march=’

Warnings summary:

3 kernel/rcu/tasks.h:710:13: warning: ‘show_rcu_tasks_rude_gp_kthread’ defined but not used [-Wunused-function]
2 <stdin>:830:2: warning: #warning syscall fstat64 not implemented [-Wcpp]
2 <stdin>:1127:2: warning: #warning syscall fstatat64 not implemented [-Wcpp]
1 net/mac80211/mlme.c:4349:1: warning: the frame size of 1040 bytes is larger than 1024 bytes [-Wframe-larger-than=]
1 drivers/block/paride/bpck.c:32: warning: "PC" redefined
1 WARNING: modpost: Symbol info of vmlinux is missing. Unresolved symbol check will be entirely skipped.

Section mismatches summary:

1 WARNING: modpost: vmlinux.o(___ksymtab_gpl+ixp4xx_irq_init+0x0): Section mismatch in reference from the variable __ksymtab_ixp4xx_irq_init to the function .init.text:ixp4xx_irq_init()
1 WARNING: modpost: vmlinux.o(___ksymtab+prom_init_numa_memory+0x0): Section mismatch in reference from the variable __ksymtab_prom_init_numa_memory to the function .init.text:prom_init_numa_memory()

================================================================================

Detailed per-defconfig build reports:

--------------------------------------------------------------------------------
32r2el_defconfig (mips, gcc-10) — PASS, 0 errors, 1 warning, 0 section mismatches

Warnings:
WARNING: modpost: Symbol info of vmlinux is missing. Unresolved symbol check will be entirely skipped.

--------------------------------------------------------------------------------
allnoconfig (arc, gcc-10) — PASS, 0 errors, 0 warnings, 0 section mismatches

--------------------------------------------------------------------------------
allnoconfig (x86_64, gcc-10) — PASS, 0 errors, 0 warnings, 0 section mismatches

--------------------------------------------------------------------------------
allnoconfig (i386, gcc-10) — PASS, 0 errors, 0 warnings, 0 section mismatches

--------------------------------------------------------------------------------
am200epdkit_defconfig (arm, gcc-10) — PASS, 0 errors, 0 warnings, 0 section mismatches

--------------------------------------------------------------------------------
ar7_defconfig (mips, gcc-10) — PASS, 0 errors, 0 warnings, 0 section mismatches

--------------------------------------------------------------------------------
aspeed_g4_defconfig (arm, gcc-10) — PASS, 0 errors, 0 warnings, 0 section mismatches

--------------------------------------------------------------------------------
aspeed_g5_defconfig (arm, gcc-10) — PASS, 0 errors, 0 warnings, 0 section mismatches

--------------------------------------------------------------------------------
assabet_defconfig (arm, gcc-10) — PASS, 0 errors, 0 warnings, 0 section mismatches

--------------------------------------------------------------------------------
at91_dt_defconfig (arm, gcc-10) — PASS, 0 errors, 0 warnings, 0 section mismatches

--------------------------------------------------------------------------------
ath25_defconfig (mips, gcc-10) — PASS, 0 errors, 0 warnings, 0 section mismatches

--------------------------------------------------------------------------------
ath79_defconfig (mips, gcc-10) — PASS, 0 errors, 0 warnings, 0 section mismatches

--------------------------------------------------------------------------------
axm55xx_defconfig (arm, gcc-10) — PASS, 0 errors, 0 warnings, 0 section mismatches

--------------------------------------------------------------------------------
axs103_defconfig (arc, gcc-10) — PASS, 0 errors, 0 warnings, 0 section mismatches

--------------------------------------------------------------------------------
axs103_smp_defconfig (arc, gcc-10) — PASS, 0 errors, 0 warnings, 0 section mismatches

--------------------------------------------------------------------------------
badge4_defconfig (arm, gcc-10) — PASS, 0 errors, 0 warnings, 0 section mismatches

--------------------------------------------------------------------------------
bcm2835_defconfig (arm, gcc-10) — PASS, 0 errors, 0 warnings, 0 section mismatches

--------------------------------------------------------------------------------
bcm47xx_defconfig (mips, gcc-10) — PASS, 0 errors, 0 warnings, 0 section mismatches

--------------------------------------------------------------------------------
bcm63xx_defconfig (mips, gcc-10) — PASS, 0 errors, 0 warnings, 0 section mismatches

--------------------------------------------------------------------------------
bigsur_defconfig (mips, gcc-10) — PASS, 0 errors, 0 warnings, 0 section mismatches

--------------------------------------------------------------------------------
bmips_be_defconfig (mips, gcc-10) — PASS, 0 errors, 0 warnings, 0 section mismatches

--------------------------------------------------------------------------------
bmips_stb_defconfig (mips, gcc-10) — PASS, 0 errors, 0 warnings, 0 section mismatches

--------------------------------------------------------------------------------
capcella_defconfig (mips, gcc-10) — PASS, 0 errors, 0 warnings, 0 section mismatches

--------------------------------------------------------------------------------
cavium_octeon_defconfig (mips, gcc-10) — PASS, 0 errors, 0 warnings, 0 section mismatches

--------------------------------------------------------------------------------
cerfcube_defconfig (arm, gcc-10) — PASS, 0 errors, 0 warnings, 0 section mismatches

--------------------------------------------------------------------------------
ci20_defconfig (mips, gcc-10) — PASS, 0 errors, 0 warnings, 0 section mismatches

--------------------------------------------------------------------------------
cm_x300_defconfig (arm, gcc-10) — PASS, 0 errors, 0 warnings, 0 section mismatches

--------------------------------------------------------------------------------
cobalt_defconfig (mips, gcc-10) — PASS, 0 errors, 0 warnings, 0 section mismatches

--------------------------------------------------------------------------------
colibri_pxa270_defconfig (arm, gcc-10) — PASS, 0 errors, 0 warnings, 0 section mismatches

--------------------------------------------------------------------------------
colibri_pxa300_defconfig (arm, gcc-10) — PASS, 0 errors, 0 warnings, 0 section mismatches

--------------------------------------------------------------------------------
collie_defconfig (arm, gcc-10) — PASS, 0 errors, 0 warnings, 0 section mismatches

--------------------------------------------------------------------------------
corgi_defconfig (arm, gcc-10) — PASS, 0 errors, 0 warnings, 0 section mismatches

--------------------------------------------------------------------------------
cu1000-neo_defconfig (mips, gcc-10) — PASS, 0 errors, 0 warnings, 0 section mismatches

--------------------------------------------------------------------------------
cu1830-neo_defconfig (mips, gcc-10) — PASS, 0 errors, 0 warnings, 0 section mismatches

--------------------------------------------------------------------------------
davinci_all_defconfig (arm, gcc-10) — PASS, 0 errors, 0 warnings, 0 section mismatches

--------------------------------------------------------------------------------
db1xxx_defconfig (mips, gcc-10) — PASS, 0 errors, 0 warnings, 0 section mismatches

--------------------------------------------------------------------------------
decstation_64_defconfig (mips, gcc-10) — PASS, 0 errors, 1 warning, 0 section mismatches

Warnings:
kernel/rcu/tasks.h:710:13: warning: ‘show_rcu_tasks_rude_gp_kthread’ defined but not used [-Wunused-function]

--------------------------------------------------------------------------------
decstation_defconfig (mips, gcc-10) — PASS, 0 errors, 1 warning, 0 section mismatches

Warnings:
kernel/rcu/tasks.h:710:13: warning: ‘show_rcu_tasks_rude_gp_kthread’ defined but not used [-Wunused-function]

--------------------------------------------------------------------------------
decstation_r4k_defconfig (mips, gcc-10) — PASS, 0 errors, 1 warning, 0 section mismatches

Warnings:
kernel/rcu/tasks.h:710:13: warning: ‘show_rcu_tasks_rude_gp_kthread’ defined but not used [-Wunused-function]

--------------------------------------------------------------------------------
defconfig (riscv, gcc-10) — PASS, 0 errors, 0 warnings, 0 section mismatches

--------------------------------------------------------------------------------
defconfig (arm64, gcc-10) — PASS, 0 errors, 0 warnings, 0 section mismatches

--------------------------------------------------------------------------------
defconfig+arm64-chromebook (arm64, gcc-10) — PASS, 0 errors, 0 warnings, 0 section mismatches

--------------------------------------------------------------------------------
defconfig+arm64-chromebook+kselftest (arm64, gcc-10) — PASS, 0 errors, 0 warnings, 0 section mismatches

--------------------------------------------------------------------------------
defconfig+kselftest (arm64, gcc-10) — PASS, 0 errors, 0 warnings, 0 section mismatches

--------------------------------------------------------------------------------
dove_defconfig (arm, gcc-10) — PASS, 0 errors, 0 warnings, 0 section mismatches

--------------------------------------------------------------------------------
e55_defconfig (mips, gcc-10) — PASS, 0 errors, 0 warnings, 0 section mismatches

--------------------------------------------------------------------------------
ebsa110_defconfig (arm, gcc-10) — PASS, 0 errors, 0 warnings, 0 section mismatches

--------------------------------------------------------------------------------
efm32_defconfig (arm, gcc-10) — PASS, 0 errors, 0 warnings, 0 section mismatches

--------------------------------------------------------------------------------
ep93xx_defconfig (arm, gcc-10) — PASS, 0 errors, 0 warnings, 0 section mismatches

--------------------------------------------------------------------------------
eseries_pxa_defconfig (arm, gcc-10) — PASS, 0 errors, 0 warnings, 0 section mismatches

--------------------------------------------------------------------------------
exynos_defconfig (arm, gcc-10) — PASS, 0 errors, 0 warnings, 0 section mismatches

--------------------------------------------------------------------------------
ezx_defconfig (arm, gcc-10) — PASS, 0 errors, 0 warnings, 0 section mismatches

--------------------------------------------------------------------------------
footbridge_defconfig (arm, gcc-10) — PASS, 0 errors, 0 warnings, 0 section mismatches

--------------------------------------------------------------------------------
fuloong2e_defconfig (mips, gcc-10) — PASS, 0 errors, 0 warnings, 0 section mismatches

--------------------------------------------------------------------------------
gcw0_defconfig (mips, gcc-10) — PASS, 0 errors, 0 warnings, 0 section mismatches

--------------------------------------------------------------------------------
gemini_defconfig (arm, gcc-10) — PASS, 0 errors, 0 warnings, 0 section mismatches

--------------------------------------------------------------------------------
gpr_defconfig (mips, gcc-10) — PASS, 0 errors, 0 warnings, 0 section mismatches

--------------------------------------------------------------------------------
h3600_defconfig (arm, gcc-10) — PASS, 0 errors, 0 warnings, 0 section mismatches

--------------------------------------------------------------------------------
h5000_defconfig (arm, gcc-10) — PASS, 0 errors, 0 warnings, 0 section mismatches

--------------------------------------------------------------------------------
hackkit_defconfig (arm, gcc-10) — PASS, 0 errors, 0 warnings, 0 section mismatches

--------------------------------------------------------------------------------
haps_hs_defconfig (arc, gcc-10) — PASS, 0 errors, 0 warnings, 0 section mismatches

--------------------------------------------------------------------------------
haps_hs_smp_defconfig (arc, gcc-10) — PASS, 0 errors, 0 warnings, 0 section mismatches

--------------------------------------------------------------------------------
hisi_defconfig (arm, gcc-10) — PASS, 0 errors, 0 warnings, 0 section mismatches

--------------------------------------------------------------------------------
hsdk_defconfig (arc, gcc-10) — PASS, 0 errors, 0 warnings, 0 section mismatches

--------------------------------------------------------------------------------
i386_defconfig (i386, gcc-10) — PASS, 0 errors, 0 warnings, 0 section mismatches

--------------------------------------------------------------------------------
imote2_defconfig (arm, gcc-10) — PASS, 0 errors, 0 warnings, 0 section mismatches

--------------------------------------------------------------------------------
imx_v4_v5_defconfig (arm, gcc-10) — PASS, 0 errors, 0 warnings, 0 section mismatches

--------------------------------------------------------------------------------
imx_v6_v7_defconfig (arm, gcc-10) — PASS, 0 errors, 0 warnings, 0 section mismatches

--------------------------------------------------------------------------------
integrator_defconfig (arm, gcc-10) — PASS, 0 errors, 0 warnings, 0 section mismatches

--------------------------------------------------------------------------------
iop32x_defconfig (arm, gcc-10) — PASS, 0 errors, 0 warnings, 0 section mismatches

--------------------------------------------------------------------------------
ip22_defconfig (mips, gcc-10) — PASS, 0 errors, 0 warnings, 0 section mismatches

--------------------------------------------------------------------------------
ip27_defconfig (mips, gcc-10) — FAIL, 0 errors, 0 warnings, 0 section mismatches

--------------------------------------------------------------------------------
ip28_defconfig (mips, gcc-10) — FAIL, 0 errors, 0 warnings, 0 section mismatches

--------------------------------------------------------------------------------
ip32_defconfig (mips, gcc-10) — PASS, 0 errors, 0 warnings, 0 section mismatches

--------------------------------------------------------------------------------
ixp4xx_defconfig (arm, gcc-10) — PASS, 0 errors, 0 warnings, 0 section mismatches

Section mismatches:
WARNING: modpost: vmlinux.o(___ksymtab_gpl+ixp4xx_irq_init+0x0): Section mismatch in reference from the variable __ksymtab_ixp4xx_irq_init to the function .init.text:ixp4xx_irq_init()

--------------------------------------------------------------------------------
jazz_defconfig (mips, gcc-10) — PASS, 0 errors, 0 warnings, 0 section mismatches

--------------------------------------------------------------------------------
jmr3927_defconfig (mips, gcc-10) — PASS, 0 errors, 0 warnings, 0 section mismatches

--------------------------------------------------------------------------------
jornada720_defconfig (arm, gcc-10) — PASS, 0 errors, 0 warnings, 0 section mismatches

--------------------------------------------------------------------------------
keystone_defconfig (arm, gcc-10) — PASS, 0 errors, 0 warnings, 0 section mismatches

--------------------------------------------------------------------------------
lart_defconfig (arm, gcc-10) — PASS, 0 errors, 0 warnings, 0 section mismatches

--------------------------------------------------------------------------------
lemote2f_defconfig (mips, gcc-10) — PASS, 0 errors, 1 warning, 0 section mismatches

Warnings:
net/mac80211/mlme.c:4349:1: warning: the frame size of 1040 bytes is larger than 1024 bytes [-Wframe-larger-than=]

--------------------------------------------------------------------------------
loongson1b_defconfig (mips, gcc-10) — PASS, 0 errors, 0 warnings, 0 section mismatches

--------------------------------------------------------------------------------
loongson1c_defconfig (mips, gcc-10) — PASS, 0 errors, 0 warnings, 0 section mismatches

--------------------------------------------------------------------------------
loongson3_defconfig (mips, gcc-10) — PASS, 0 errors, 0 warnings, 0 section mismatches

Section mismatches:
WARNING: modpost: vmlinux.o(___ksymtab+prom_init_numa_memory+0x0): Section mismatch in reference from the variable __ksymtab_prom_init_numa_memory to the function .init.text:prom_init_numa_memory()

--------------------------------------------------------------------------------
lpc18xx_defconfig (arm, gcc-10) — PASS, 0 errors, 0 warnings, 0 section mismatches

--------------------------------------------------------------------------------
lpc32xx_defconfig (arm, gcc-10) — PASS, 0 errors, 0 warnings, 0 section mismatches

--------------------------------------------------------------------------------
lpd270_defconfig (arm, gcc-10) — PASS, 0 errors, 0 warnings, 0 section mismatches

--------------------------------------------------------------------------------
lubbock_defconfig (arm, gcc-10) — PASS, 0 errors, 0 warnings, 0 section mismatches

--------------------------------------------------------------------------------
magician_defconfig (arm, gcc-10) — PASS, 0 errors, 0 warnings, 0 section mismatches

--------------------------------------------------------------------------------
mainstone_defconfig (arm, gcc-10) — PASS, 0 errors, 0 warnings, 0 section mismatches

--------------------------------------------------------------------------------
malta_defconfig (mips, gcc-10) — PASS, 0 errors, 0 warnings, 0 section mismatches

--------------------------------------------------------------------------------
malta_kvm_defconfig (mips, gcc-10) — PASS, 0 errors, 0 warnings, 0 section mismatches

--------------------------------------------------------------------------------
malta_kvm_guest_defconfig (mips, gcc-10) — PASS, 0 errors, 0 warnings, 0 section mismatches

--------------------------------------------------------------------------------
malta_qemu_32r6_defconfig (mips, gcc-10) — PASS, 0 errors, 0 warnings, 0 section mismatches

--------------------------------------------------------------------------------
maltaaprp_defconfig (mips, gcc-10) — PASS, 0 errors, 0 warnings, 0 section mismatches

--------------------------------------------------------------------------------
maltasmvp_defconfig (mips, gcc-10) — PASS, 0 errors, 0 warnings, 0 section mismatches

--------------------------------------------------------------------------------
maltasmvp_eva_defconfig (mips, gcc-10) — PASS, 0 errors, 0 warnings, 0 section mismatches

--------------------------------------------------------------------------------
maltaup_defconfig (mips, gcc-10) — PASS, 0 errors, 0 warnings, 0 section mismatches

--------------------------------------------------------------------------------
maltaup_xpa_defconfig (mips, gcc-10) — PASS, 0 errors, 0 warnings, 0 section mismatches

--------------------------------------------------------------------------------
milbeaut_m10v_defconfig (arm, gcc-10) — PASS, 0 errors, 0 warnings, 0 section mismatches

--------------------------------------------------------------------------------
mini2440_defconfig (arm, gcc-10) — PASS, 0 errors, 0 warnings, 0 section mismatches

--------------------------------------------------------------------------------
mmp2_defconfig (arm, gcc-10) — PASS, 0 errors, 0 warnings, 0 section mismatches

--------------------------------------------------------------------------------
moxart_defconfig (arm, gcc-10) — PASS, 0 errors, 0 warnings, 0 section mismatches

--------------------------------------------------------------------------------
mpc30x_defconfig (mips, gcc-10) — PASS, 0 errors, 0 warnings, 0 section mismatches

--------------------------------------------------------------------------------
mps2_defconfig (arm, gcc-10) — PASS, 0 errors, 0 warnings, 0 section mismatches

--------------------------------------------------------------------------------
mtx1_defconfig (mips, gcc-10) — PASS, 0 errors, 0 warnings, 0 section mismatches

--------------------------------------------------------------------------------
multi_v4t_defconfig (arm, gcc-10) — PASS, 0 errors, 0 warnings, 0 section mismatches

--------------------------------------------------------------------------------
multi_v5_defconfig (arm, gcc-10) — PASS, 0 errors, 0 warnings, 0 section mismatches

--------------------------------------------------------------------------------
multi_v7_defconfig (arm, gcc-10) — PASS, 0 errors, 0 warnings, 0 section mismatches

--------------------------------------------------------------------------------
multi_v7_defconfig+kselftest (arm, gcc-10) — PASS, 0 errors, 0 warnings, 0 section mismatches

--------------------------------------------------------------------------------
mvebu_v5_defconfig (arm, gcc-10) — PASS, 0 errors, 0 warnings, 0 section mismatches

--------------------------------------------------------------------------------
mvebu_v7_defconfig (arm, gcc-10) — PASS, 0 errors, 0 warnings, 0 section mismatches

--------------------------------------------------------------------------------
mxs_defconfig (arm, gcc-10) — PASS, 0 errors, 0 warnings, 0 section mismatches

--------------------------------------------------------------------------------
neponset_defconfig (arm, gcc-10) — PASS, 0 errors, 0 warnings, 0 section mismatches

--------------------------------------------------------------------------------
netwinder_defconfig (arm, gcc-10) — PASS, 0 errors, 0 warnings, 0 section mismatches

--------------------------------------------------------------------------------
nhk8815_defconfig (arm, gcc-10) — PASS, 0 errors, 0 warnings, 0 section mismatches

--------------------------------------------------------------------------------
nlm_xlp_defconfig (mips, gcc-10) — PASS, 0 errors, 0 warnings, 0 section mismatches

--------------------------------------------------------------------------------
nlm_xlr_defconfig (mips, gcc-10) — PASS, 0 errors, 0 warnings, 0 section mismatches

--------------------------------------------------------------------------------
nommu_k210_defconfig (riscv, gcc-10) — PASS, 0 errors, 0 warnings, 0 section mismatches

--------------------------------------------------------------------------------
nsimosci_hs_defconfig (arc, gcc-10) — PASS, 0 errors, 0 warnings, 0 section mismatches

--------------------------------------------------------------------------------
nsimosci_hs_smp_defconfig (arc, gcc-10) — PASS, 0 errors, 0 warnings, 0 section mismatches

--------------------------------------------------------------------------------
omap1_defconfig (arm, gcc-10) — PASS, 0 errors, 0 warnings, 0 section mismatches

--------------------------------------------------------------------------------
omap2plus_defconfig (arm, gcc-10) — PASS, 0 errors, 0 warnings, 0 section mismatches

--------------------------------------------------------------------------------
omega2p_defconfig (mips, gcc-10) — PASS, 0 errors, 0 warnings, 0 section mismatches

--------------------------------------------------------------------------------
orion5x_defconfig (arm, gcc-10) — PASS, 0 errors, 0 warnings, 0 section mismatches

--------------------------------------------------------------------------------
oxnas_v6_defconfig (arm, gcc-10) — PASS, 0 errors, 0 warnings, 0 section mismatches

--------------------------------------------------------------------------------
palmz72_defconfig (arm, gcc-10) — PASS, 0 errors, 0 warnings, 0 section mismatches

--------------------------------------------------------------------------------
pcm027_defconfig (arm, gcc-10) — PASS, 0 errors, 0 warnings, 0 section mismatches

--------------------------------------------------------------------------------
pic32mzda_defconfig (mips, gcc-10) — PASS, 0 errors, 0 warnings, 0 section mismatches

--------------------------------------------------------------------------------
pistachio_defconfig (mips, gcc-10) — PASS, 0 errors, 0 warnings, 0 section mismatches

--------------------------------------------------------------------------------
pleb_defconfig (arm, gcc-10) — PASS, 0 errors, 0 warnings, 0 section mismatches

--------------------------------------------------------------------------------
prima2_defconfig (arm, gcc-10) — PASS, 0 errors, 0 warnings, 0 section mismatches

--------------------------------------------------------------------------------
pxa168_defconfig (arm, gcc-10) — PASS, 0 errors, 0 warnings, 0 section mismatches

--------------------------------------------------------------------------------
pxa255-idp_defconfig (arm, gcc-10) — PASS, 0 errors, 0 warnings, 0 section mismatches

--------------------------------------------------------------------------------
pxa3xx_defconfig (arm, gcc-10) — PASS, 0 errors, 0 warnings, 0 section mismatches

--------------------------------------------------------------------------------
pxa910_defconfig (arm, gcc-10) — PASS, 0 errors, 0 warnings, 0 section mismatches

--------------------------------------------------------------------------------
pxa_defconfig (arm, gcc-10) — PASS, 0 errors, 0 warnings, 0 section mismatches

--------------------------------------------------------------------------------
qcom_defconfig (arm, gcc-10) — PASS, 0 errors, 0 warnings, 0 section mismatches

--------------------------------------------------------------------------------
qi_lb60_defconfig (mips, gcc-10) — PASS, 0 errors, 0 warnings, 0 section mismatches

--------------------------------------------------------------------------------
rb532_defconfig (mips, gcc-10) — PASS, 0 errors, 0 warnings, 0 section mismatches

--------------------------------------------------------------------------------
rbtx49xx_defconfig (mips, gcc-10) — PASS, 0 errors, 0 warnings, 0 section mismatches

--------------------------------------------------------------------------------
realview_defconfig (arm, gcc-10) — PASS, 0 errors, 0 warnings, 0 section mismatches

--------------------------------------------------------------------------------
rm200_defconfig (mips, gcc-10) — PASS, 0 errors, 1 warning, 0 section mismatches

Warnings:
drivers/block/paride/bpck.c:32: warning: "PC" redefined

--------------------------------------------------------------------------------
rpc_defconfig (arm, gcc-10) — FAIL, 4 errors, 0 warnings, 0 section mismatches

Errors:
arm-linux-gnueabihf-gcc: error: unrecognized -march target: armv3m
arm-linux-gnueabihf-gcc: error: missing argument to ‘-march=’
arm-linux-gnueabihf-gcc: error: unrecognized -march target: armv3m
arm-linux-gnueabihf-gcc: error: missing argument to ‘-march=’

--------------------------------------------------------------------------------
rs90_defconfig (mips, gcc-10) — PASS, 0 errors, 0 warnings, 0 section mismatches

--------------------------------------------------------------------------------
rt305x_defconfig (mips, gcc-10) — PASS, 0 errors, 0 warnings, 0 section mismatches

--------------------------------------------------------------------------------
rv32_defconfig (riscv, gcc-10) — PASS, 0 errors, 4 warnings, 0 section mismatches

Warnings:
<stdin>:830:2: warning: #warning syscall fstat64 not implemented [-Wcpp]
<stdin>:1127:2: warning: #warning syscall fstatat64 not implemented [-Wcpp]
<stdin>:830:2: warning: #warning syscall fstat64 not implemented [-Wcpp]
<stdin>:1127:2: warning: #warning syscall fstatat64 not implemented [-Wcpp]

--------------------------------------------------------------------------------
s3c2410_defconfig (arm, gcc-10) — PASS, 0 errors, 0 warnings, 0 section mismatches

--------------------------------------------------------------------------------
s3c6400_defconfig (arm, gcc-10) — PASS, 0 errors, 0 warnings, 0 section mismatches

--------------------------------------------------------------------------------
s5pv210_defconfig (arm, gcc-10) — PASS, 0 errors, 0 warnings, 0 section mismatches

--------------------------------------------------------------------------------
sama5_defconfig (arm, gcc-10) — PASS, 0 errors, 0 warnings, 0 section mismatches

--------------------------------------------------------------------------------
sb1250_swarm_defconfig (mips, gcc-10) — PASS, 0 errors, 0 warnings, 0 section mismatches

--------------------------------------------------------------------------------
shannon_defconfig (arm, gcc-10) — PASS, 0 errors, 0 warnings, 0 section mismatches

--------------------------------------------------------------------------------
shmobile_defconfig (arm, gcc-10) — PASS, 0 errors, 0 warnings, 0 section mismatches

--------------------------------------------------------------------------------
simpad_defconfig (arm, gcc-10) — PASS, 0 errors, 0 warnings, 0 section mismatches

--------------------------------------------------------------------------------
socfpga_defconfig (arm, gcc-10) — PASS, 0 errors, 0 warnings, 0 section mismatches

--------------------------------------------------------------------------------
spear13xx_defconfig (arm, gcc-10) — PASS, 0 errors, 0 warnings, 0 section mismatches

--------------------------------------------------------------------------------
spear3xx_defconfig (arm, gcc-10) — PASS, 0 errors, 0 warnings, 0 section mismatches

--------------------------------------------------------------------------------
spear6xx_defconfig (arm, gcc-10) — PASS, 0 errors, 0 warnings, 0 section mismatches

--------------------------------------------------------------------------------
spitz_defconfig (arm, gcc-10) — PASS, 0 errors, 0 warnings, 0 section mismatches

--------------------------------------------------------------------------------
stm32_defconfig (arm, gcc-10) — PASS, 0 errors, 0 warnings, 0 section mismatches

--------------------------------------------------------------------------------
sunxi_defconfig (arm, gcc-10) — PASS, 0 errors, 0 warnings, 0 section mismatches

--------------------------------------------------------------------------------
tango4_defconfig (arm, gcc-10) — PASS, 0 errors, 0 warnings, 0 section mismatches

--------------------------------------------------------------------------------
tb0219_defconfig (mips, gcc-10) — PASS, 0 errors, 0 warnings, 0 section mismatches

--------------------------------------------------------------------------------
tb0226_defconfig (mips, gcc-10) — PASS, 0 errors, 0 warnings, 0 section mismatches

--------------------------------------------------------------------------------
tb0287_defconfig (mips, gcc-10) — PASS, 0 errors, 0 warnings, 0 section mismatches

--------------------------------------------------------------------------------
tct_hammer_defconfig (arm, gcc-10) — PASS, 0 errors, 0 warnings, 0 section mismatches

--------------------------------------------------------------------------------
tegra_defconfig (arm, gcc-10) — PASS, 0 errors, 0 warnings, 0 section mismatches

--------------------------------------------------------------------------------
tinyconfig (x86_64, gcc-10) — PASS, 0 errors, 0 warnings, 0 section mismatches

--------------------------------------------------------------------------------
tinyconfig (i386, gcc-10) — PASS, 0 errors, 0 warnings, 0 section mismatches

--------------------------------------------------------------------------------
tinyconfig (arc, gcc-10) — PASS, 0 errors, 0 warnings, 0 section mismatches

--------------------------------------------------------------------------------
trizeps4_defconfig (arm, gcc-10) — PASS, 0 errors, 0 warnings, 0 section mismatches

--------------------------------------------------------------------------------
u300_defconfig (arm, gcc-10) — PASS, 0 errors, 0 warnings, 0 section mismatches

--------------------------------------------------------------------------------
u8500_defconfig (arm, gcc-10) — PASS, 0 errors, 0 warnings, 0 section mismatches

--------------------------------------------------------------------------------
vdk_hs38_defconfig (arc, gcc-10) — PASS, 0 errors, 0 warnings, 0 section mismatches

--------------------------------------------------------------------------------
vdk_hs38_smp_defconfig (arc, gcc-10) — PASS, 0 errors, 0 warnings, 0 section mismatches

--------------------------------------------------------------------------------
versatile_defconfig (arm, gcc-10) — PASS, 0 errors, 0 warnings, 0 section mismatches

--------------------------------------------------------------------------------
vexpress_defconfig (arm, gcc-10) — PASS, 0 errors, 0 warnings, 0 section mismatches

--------------------------------------------------------------------------------
vf610m4_defconfig (arm, gcc-10) — PASS, 0 errors, 0 warnings, 0 section mismatches

--------------------------------------------------------------------------------
viper_defconfig (arm, gcc-10) — PASS, 0 errors, 0 warnings, 0 section mismatches

--------------------------------------------------------------------------------
vocore2_defconfig (mips, gcc-10) — PASS, 0 errors, 0 warnings, 0 section mismatches

--------------------------------------------------------------------------------
vt8500_v6_v7_defconfig (arm, gcc-10) — PASS, 0 errors, 0 warnings, 0 section mismatches

--------------------------------------------------------------------------------
workpad_defconfig (mips, gcc-10) — PASS, 0 errors, 0 warnings, 0 section mismatches

--------------------------------------------------------------------------------
x86_64_defconfig (x86_64, gcc-10) — PASS, 0 errors, 0 warnings, 0 section mismatches

--------------------------------------------------------------------------------
x86_64_defconfig+kselftest (x86_64, gcc-10) — PASS, 0 errors, 0 warnings, 0 section mismatches

--------------------------------------------------------------------------------
x86_64_defconfig+x86-chromebook (x86_64, gcc-10) — PASS, 0 errors, 0 warnings, 0 section mismatches

--------------------------------------------------------------------------------
x86_64_defconfig+x86-chromebook+kselftest (x86_64, gcc-10) — PASS, 0 errors, 0 warnings, 0 section mismatches

--------------------------------------------------------------------------------
xcep_defconfig (arm, gcc-10) — PASS, 0 errors, 0 warnings, 0 section mismatches

--------------------------------------------------------------------------------
zeus_defconfig (arm, gcc-10) — PASS, 0 errors, 0 warnings, 0 section mismatches

--------------------------------------------------------------------------------
zx_defconfig (arm, gcc-10) — PASS, 0 errors, 0 warnings, 0 section mismatches

---
For more info write to <info@...>


Re: [PATCH RESEND 5.10.y-cip 00/13] Add thermal driver and watchdog driver enhancements

Nobuhiro Iwamatsu
 

Hi,


I can see patch#2 and #3 of the series landed in [1], but it is not showing up in
[2] and [3]. Any thoughts on this issue?
Yes, this problem happens sometime. And I don't know why.
All emails have arrived, so I am getting a patch from MUA and applying it.

Best regards,
Nobuhiro

-----Original Message-----
From: Biju Das <biju.das.jz@...>
Sent: Friday, July 15, 2022 4:46 PM
To: cip-dev@...; iwamatsu nobuhiro(岩松 信洋 □SWC◯A
CT) <nobuhiro1.iwamatsu@...>; Pavel Machek
<pavel@...>
Cc: Chris Paterson <Chris.Paterson2@...>; Prabhakar Mahadev Lad
<prabhakar.mahadev-lad.rj@...>
Subject: RE: [PATCH RESEND 5.10.y-cip 00/13] Add thermal driver and
watchdog driver enhancements

Hi All,

I can see patch#2 and #3 of the series landed in [1], but it is not showing up in
[2] and [3]. Any thoughts on this issue?


[1] https://lists.cip-project.org/g/cip-dev/topics

[2] https://patchwork.kernel.org/project/cip-dev/list/?series=659971

[3]
https://lore.kernel.org/cip-dev/20220715073916.2321319-1-biju.das.jz@bp.re
nesas.com/T/#t

Cheers,
Biju

-----Original Message-----
From: Biju Das <biju.das.jz@...>
Sent: 15 July 2022 08:39
To: cip-dev@...; Nobuhiro Iwamatsu
<nobuhiro1.iwamatsu@...>; Pavel Machek <pavel@...>
Cc: Chris Paterson <Chris.Paterson2@...>; Biju Das
<biju.das.jz@...>; Prabhakar Mahadev Lad
<prabhakar.mahadev- lad.rj@...>
Subject: [PATCH RESEND 5.10.y-cip 00/13] Add thermal driver and
watchdog driver enhancements

This patch series aims to add thermal driver support and watchdog
driver enhancments for RZ/G2L platform.

Resending this patch series as patchwork is not showing
patch#2 and #3 of the earlier series.

Andy Shevchenko (2):
kernel.h: split out mathematical helpers
units: Add SI metric prefix definitions

Biju Das (10):
thermal/drivers: Add TSU driver for RZ/G2L
thermal/drivers/rz2gl: Add error check for reset_control_deassert()
thermal/drivers/rz2gl: Fix OTP Calibration Register values
watchdog: rzg2l_wdt: Fix 32bit overflow issue
watchdog: rzg2l_wdt: Fix Runtime PM usage
watchdog: rzg2l_wdt: Fix 'BUG: Invalid wait context'
watchdog: rzg2l_wdt: Fix reset control imbalance
watchdog: rzg2l_wdt: Add error check for reset_control_deassert
watchdog: rzg2l_wdt: Use force reset for WDT reset
watchdog: rzg2l_wdt: Add set_timeout callback

Geert Uytterhoeven (1):
arm64: defconfig: Enable additional support for Renesas platforms

arch/arm64/configs/defconfig | 4 +
drivers/thermal/Kconfig | 9 ++
drivers/thermal/Makefile | 1 +
drivers/thermal/rzg2l_thermal.c | 248
++++++++++++++++++++++++++++++++
drivers/watchdog/rzg2l_wdt.c | 83 ++++++-----
fs/nfs/callback_proc.c | 5 +
include/linux/bitops.h | 11 +-
include/linux/dcache.h | 1 +
include/linux/iommu-helper.h | 4 +-
include/linux/kernel.h | 173 +---------------------
include/linux/math.h | 177
+++++++++++++++++++++++
include/linux/rcu_node_tree.h | 2 +
include/linux/units.h | 22 ++-
lib/errname.c | 1 +
lib/errseq.c | 1 +
lib/find_bit.c | 3 +-
lib/math/div64.c | 4 +-
lib/math/int_pow.c | 2 +-
lib/math/int_sqrt.c | 3 +-
lib/math/reciprocal_div.c | 9 +-
20 files changed, 544 insertions(+), 219 deletions(-) create mode
100644 drivers/thermal/rzg2l_thermal.c create mode 100644
include/linux/math.h

--
2.25.1

1321 - 1340 of 10163