Date   

cip/linux-5.10.y-cip baseline: 129 runs, 16 regressions (v5.10.131-cip13-24-ga6f4ea41fe167) #kernelci

kernelci.org bot <bot@...>
 

cip/linux-5.10.y-cip baseline: 129 runs, 16 regressions (v5.10.131-cip13-24-ga6f4ea41fe167)

Regressions Summary
-------------------

platform | arch | lab | compiler | defconfig | regressions
---------------------------+-------+---------------+----------+----------------------------+------------
qemu_arm64-virt-gicv2 | arm64 | lab-broonie | gcc-10 | defconfig | 1
qemu_arm64-virt-gicv2 | arm64 | lab-broonie | gcc-10 | defconfig+arm64-chromebook | 1
qemu_arm64-virt-gicv2 | arm64 | lab-collabora | gcc-10 | defconfig | 1
qemu_arm64-virt-gicv2 | arm64 | lab-collabora | gcc-10 | defconfig+arm64-chromebook | 1
qemu_arm64-virt-gicv2-uefi | arm64 | lab-broonie | gcc-10 | defconfig | 1
qemu_arm64-virt-gicv2-uefi | arm64 | lab-broonie | gcc-10 | defconfig+arm64-chromebook | 1
qemu_arm64-virt-gicv2-uefi | arm64 | lab-collabora | gcc-10 | defconfig | 1
qemu_arm64-virt-gicv3 | arm64 | lab-broonie | gcc-10 | defconfig | 1
qemu_arm64-virt-gicv3 | arm64 | lab-broonie | gcc-10 | defconfig+arm64-chromebook | 1
qemu_arm64-virt-gicv3 | arm64 | lab-collabora | gcc-10 | defconfig | 1
qemu_arm64-virt-gicv3 | arm64 | lab-collabora | gcc-10 | defconfig+arm64-chromebook | 1
qemu_arm64-virt-gicv3-uefi | arm64 | lab-broonie | gcc-10 | defconfig | 1
qemu_arm64-virt-gicv3-uefi | arm64 | lab-broonie | gcc-10 | defconfig+arm64-chromebook | 1
qemu_arm64-virt-gicv3-uefi | arm64 | lab-collabora | gcc-10 | defconfig+arm64-chromebook | 1
r8a774a1-hihope-rzg2m-ex | arm64 | lab-cip | gcc-10 | defconfig+arm64-chromebook | 1
rk3399-gru-kevin | arm64 | lab-collabora | gcc-10 | defconfig+arm64-chromebook | 1

Details: https://kernelci.org/test/job/cip/branch/linux-5.10.y-cip/kernel/v5.10.131-cip13-24-ga6f4ea41fe167/plan/baseline/

Test: baseline
Tree: cip
Branch: linux-5.10.y-cip
Describe: v5.10.131-cip13-24-ga6f4ea41fe167
URL: https://git.kernel.org/pub/scm/linux/kernel/git/cip/linux-cip.git
SHA: a6f4ea41fe167f956d4000eaf276a1e383603071


Test Regressions
----------------


platform | arch | lab | compiler | defconfig | regressions
---------------------------+-------+---------------+----------+----------------------------+------------
qemu_arm64-virt-gicv2 | arm64 | lab-broonie | gcc-10 | defconfig | 1

Details: https://kernelci.org/test/plan/id/62eaab34dc58084282daf064

Results: 0 PASS, 1 FAIL, 0 SKIP
Full config: defconfig
Compiler: gcc-10 (aarch64-linux-gnu-gcc (Debian 10.2.1-6) 10.2.1 20210110)
Plain log: https://storage.kernelci.org//cip/linux-5.10.y-cip/v5.10.131-cip13-24-ga6f4ea41fe167/arm64/defconfig/gcc-10/lab-broonie/baseline-qemu_arm64-virt-gicv2.txt
HTML log: https://storage.kernelci.org//cip/linux-5.10.y-cip/v5.10.131-cip13-24-ga6f4ea41fe167/arm64/defconfig/gcc-10/lab-broonie/baseline-qemu_arm64-virt-gicv2.html
Rootfs: http://storage.kernelci.org/images/rootfs/buildroot/buildroot-baseline/20220718.0/arm64/rootfs.cpio.gz


* baseline.login: https://kernelci.org/test/case/id/62eaab34dc58084282daf065
failing since 8 days (last pass: v5.10.83-cip1-178-g2cf1d12aab81, first fail: v5.10.129-cip12-36-g21d9d56f4de5a)



platform | arch | lab | compiler | defconfig | regressions
---------------------------+-------+---------------+----------+----------------------------+------------
qemu_arm64-virt-gicv2 | arm64 | lab-broonie | gcc-10 | defconfig+arm64-chromebook | 1

Details: https://kernelci.org/test/plan/id/62eaac9bf7de322b9adaf066

Results: 0 PASS, 1 FAIL, 0 SKIP
Full config: defconfig+arm64-chromebook
Compiler: gcc-10 (aarch64-linux-gnu-gcc (Debian 10.2.1-6) 10.2.1 20210110)
Plain log: https://storage.kernelci.org//cip/linux-5.10.y-cip/v5.10.131-cip13-24-ga6f4ea41fe167/arm64/defconfig+arm64-chromebook/gcc-10/lab-broonie/baseline-qemu_arm64-virt-gicv2.txt
HTML log: https://storage.kernelci.org//cip/linux-5.10.y-cip/v5.10.131-cip13-24-ga6f4ea41fe167/arm64/defconfig+arm64-chromebook/gcc-10/lab-broonie/baseline-qemu_arm64-virt-gicv2.html
Rootfs: http://storage.kernelci.org/images/rootfs/buildroot/buildroot-baseline/20220718.0/arm64/rootfs.cpio.gz


* baseline.login: https://kernelci.org/test/case/id/62eaac9bf7de322b9adaf067
new failure (last pass: v5.10.83-cip1-178-g2cf1d12aab81)



platform | arch | lab | compiler | defconfig | regressions
---------------------------+-------+---------------+----------+----------------------------+------------
qemu_arm64-virt-gicv2 | arm64 | lab-collabora | gcc-10 | defconfig | 1

Details: https://kernelci.org/test/plan/id/62eaab32d3aa38f235daf066

Results: 0 PASS, 1 FAIL, 0 SKIP
Full config: defconfig
Compiler: gcc-10 (aarch64-linux-gnu-gcc (Debian 10.2.1-6) 10.2.1 20210110)
Plain log: https://storage.kernelci.org//cip/linux-5.10.y-cip/v5.10.131-cip13-24-ga6f4ea41fe167/arm64/defconfig/gcc-10/lab-collabora/baseline-qemu_arm64-virt-gicv2.txt
HTML log: https://storage.kernelci.org//cip/linux-5.10.y-cip/v5.10.131-cip13-24-ga6f4ea41fe167/arm64/defconfig/gcc-10/lab-collabora/baseline-qemu_arm64-virt-gicv2.html
Rootfs: http://storage.kernelci.org/images/rootfs/buildroot/buildroot-baseline/20220718.0/arm64/rootfs.cpio.gz


* baseline.login: https://kernelci.org/test/case/id/62eaab32d3aa38f235daf067
failing since 8 days (last pass: v5.10.83-cip1-178-g2cf1d12aab81, first fail: v5.10.129-cip12-36-g21d9d56f4de5a)



platform | arch | lab | compiler | defconfig | regressions
---------------------------+-------+---------------+----------+----------------------------+------------
qemu_arm64-virt-gicv2 | arm64 | lab-collabora | gcc-10 | defconfig+arm64-chromebook | 1

Details: https://kernelci.org/test/plan/id/62eaabffc1cbb475b4daf05e

Results: 0 PASS, 1 FAIL, 0 SKIP
Full config: defconfig+arm64-chromebook
Compiler: gcc-10 (aarch64-linux-gnu-gcc (Debian 10.2.1-6) 10.2.1 20210110)
Plain log: https://storage.kernelci.org//cip/linux-5.10.y-cip/v5.10.131-cip13-24-ga6f4ea41fe167/arm64/defconfig+arm64-chromebook/gcc-10/lab-collabora/baseline-qemu_arm64-virt-gicv2.txt
HTML log: https://storage.kernelci.org//cip/linux-5.10.y-cip/v5.10.131-cip13-24-ga6f4ea41fe167/arm64/defconfig+arm64-chromebook/gcc-10/lab-collabora/baseline-qemu_arm64-virt-gicv2.html
Rootfs: http://storage.kernelci.org/images/rootfs/buildroot/buildroot-baseline/20220718.0/arm64/rootfs.cpio.gz


* baseline.login: https://kernelci.org/test/case/id/62eaabffc1cbb475b4daf05f
new failure (last pass: v5.10.83-cip1-178-g2cf1d12aab81)



platform | arch | lab | compiler | defconfig | regressions
---------------------------+-------+---------------+----------+----------------------------+------------
qemu_arm64-virt-gicv2-uefi | arm64 | lab-broonie | gcc-10 | defconfig | 1

Details: https://kernelci.org/test/plan/id/62eaab31b77df36a61daf074

Results: 0 PASS, 1 FAIL, 0 SKIP
Full config: defconfig
Compiler: gcc-10 (aarch64-linux-gnu-gcc (Debian 10.2.1-6) 10.2.1 20210110)
Plain log: https://storage.kernelci.org//cip/linux-5.10.y-cip/v5.10.131-cip13-24-ga6f4ea41fe167/arm64/defconfig/gcc-10/lab-broonie/baseline-qemu_arm64-virt-gicv2-uefi.txt
HTML log: https://storage.kernelci.org//cip/linux-5.10.y-cip/v5.10.131-cip13-24-ga6f4ea41fe167/arm64/defconfig/gcc-10/lab-broonie/baseline-qemu_arm64-virt-gicv2-uefi.html
Rootfs: http://storage.kernelci.org/images/rootfs/buildroot/buildroot-baseline/20220718.0/arm64/rootfs.cpio.gz


* baseline.login: https://kernelci.org/test/case/id/62eaab31b77df36a61daf075
new failure (last pass: v5.10.83-cip1-178-g2cf1d12aab81)



platform | arch | lab | compiler | defconfig | regressions
---------------------------+-------+---------------+----------+----------------------------+------------
qemu_arm64-virt-gicv2-uefi | arm64 | lab-broonie | gcc-10 | defconfig+arm64-chromebook | 1

Details: https://kernelci.org/test/plan/id/62eaac0cc607b7c3f6daf059

Results: 0 PASS, 1 FAIL, 0 SKIP
Full config: defconfig+arm64-chromebook
Compiler: gcc-10 (aarch64-linux-gnu-gcc (Debian 10.2.1-6) 10.2.1 20210110)
Plain log: https://storage.kernelci.org//cip/linux-5.10.y-cip/v5.10.131-cip13-24-ga6f4ea41fe167/arm64/defconfig+arm64-chromebook/gcc-10/lab-broonie/baseline-qemu_arm64-virt-gicv2-uefi.txt
HTML log: https://storage.kernelci.org//cip/linux-5.10.y-cip/v5.10.131-cip13-24-ga6f4ea41fe167/arm64/defconfig+arm64-chromebook/gcc-10/lab-broonie/baseline-qemu_arm64-virt-gicv2-uefi.html
Rootfs: http://storage.kernelci.org/images/rootfs/buildroot/buildroot-baseline/20220718.0/arm64/rootfs.cpio.gz


* baseline.login: https://kernelci.org/test/case/id/62eaac0cc607b7c3f6daf05a
failing since 54 days (last pass: v5.10.112-cip6, first fail: v5.10.121-cip9)



platform | arch | lab | compiler | defconfig | regressions
---------------------------+-------+---------------+----------+----------------------------+------------
qemu_arm64-virt-gicv2-uefi | arm64 | lab-collabora | gcc-10 | defconfig | 1

Details: https://kernelci.org/test/plan/id/62eaab20b52207f2b8daf06f

Results: 0 PASS, 1 FAIL, 0 SKIP
Full config: defconfig
Compiler: gcc-10 (aarch64-linux-gnu-gcc (Debian 10.2.1-6) 10.2.1 20210110)
Plain log: https://storage.kernelci.org//cip/linux-5.10.y-cip/v5.10.131-cip13-24-ga6f4ea41fe167/arm64/defconfig/gcc-10/lab-collabora/baseline-qemu_arm64-virt-gicv2-uefi.txt
HTML log: https://storage.kernelci.org//cip/linux-5.10.y-cip/v5.10.131-cip13-24-ga6f4ea41fe167/arm64/defconfig/gcc-10/lab-collabora/baseline-qemu_arm64-virt-gicv2-uefi.html
Rootfs: http://storage.kernelci.org/images/rootfs/buildroot/buildroot-baseline/20220718.0/arm64/rootfs.cpio.gz


* baseline.login: https://kernelci.org/test/case/id/62eaab20b52207f2b8daf070
new failure (last pass: v5.10.83-cip1-178-g2cf1d12aab81)



platform | arch | lab | compiler | defconfig | regressions
---------------------------+-------+---------------+----------+----------------------------+------------
qemu_arm64-virt-gicv3 | arm64 | lab-broonie | gcc-10 | defconfig | 1

Details: https://kernelci.org/test/plan/id/62eaab339f3062c7e2daf06a

Results: 0 PASS, 1 FAIL, 0 SKIP
Full config: defconfig
Compiler: gcc-10 (aarch64-linux-gnu-gcc (Debian 10.2.1-6) 10.2.1 20210110)
Plain log: https://storage.kernelci.org//cip/linux-5.10.y-cip/v5.10.131-cip13-24-ga6f4ea41fe167/arm64/defconfig/gcc-10/lab-broonie/baseline-qemu_arm64-virt-gicv3.txt
HTML log: https://storage.kernelci.org//cip/linux-5.10.y-cip/v5.10.131-cip13-24-ga6f4ea41fe167/arm64/defconfig/gcc-10/lab-broonie/baseline-qemu_arm64-virt-gicv3.html
Rootfs: http://storage.kernelci.org/images/rootfs/buildroot/buildroot-baseline/20220718.0/arm64/rootfs.cpio.gz


* baseline.login: https://kernelci.org/test/case/id/62eaab339f3062c7e2daf06b
new failure (last pass: v5.10.83-cip1-178-g2cf1d12aab81)



platform | arch | lab | compiler | defconfig | regressions
---------------------------+-------+---------------+----------+----------------------------+------------
qemu_arm64-virt-gicv3 | arm64 | lab-broonie | gcc-10 | defconfig+arm64-chromebook | 1

Details: https://kernelci.org/test/plan/id/62eaac99446e247a65daf060

Results: 0 PASS, 1 FAIL, 0 SKIP
Full config: defconfig+arm64-chromebook
Compiler: gcc-10 (aarch64-linux-gnu-gcc (Debian 10.2.1-6) 10.2.1 20210110)
Plain log: https://storage.kernelci.org//cip/linux-5.10.y-cip/v5.10.131-cip13-24-ga6f4ea41fe167/arm64/defconfig+arm64-chromebook/gcc-10/lab-broonie/baseline-qemu_arm64-virt-gicv3.txt
HTML log: https://storage.kernelci.org//cip/linux-5.10.y-cip/v5.10.131-cip13-24-ga6f4ea41fe167/arm64/defconfig+arm64-chromebook/gcc-10/lab-broonie/baseline-qemu_arm64-virt-gicv3.html
Rootfs: http://storage.kernelci.org/images/rootfs/buildroot/buildroot-baseline/20220718.0/arm64/rootfs.cpio.gz


* baseline.login: https://kernelci.org/test/case/id/62eaac99446e247a65daf061
failing since 8 days (last pass: v5.10.83-cip1-178-g2cf1d12aab81, first fail: v5.10.129-cip12-36-g21d9d56f4de5a)



platform | arch | lab | compiler | defconfig | regressions
---------------------------+-------+---------------+----------+----------------------------+------------
qemu_arm64-virt-gicv3 | arm64 | lab-collabora | gcc-10 | defconfig | 1

Details: https://kernelci.org/test/plan/id/62eaab21d3aa38f235daf05a

Results: 0 PASS, 1 FAIL, 0 SKIP
Full config: defconfig
Compiler: gcc-10 (aarch64-linux-gnu-gcc (Debian 10.2.1-6) 10.2.1 20210110)
Plain log: https://storage.kernelci.org//cip/linux-5.10.y-cip/v5.10.131-cip13-24-ga6f4ea41fe167/arm64/defconfig/gcc-10/lab-collabora/baseline-qemu_arm64-virt-gicv3.txt
HTML log: https://storage.kernelci.org//cip/linux-5.10.y-cip/v5.10.131-cip13-24-ga6f4ea41fe167/arm64/defconfig/gcc-10/lab-collabora/baseline-qemu_arm64-virt-gicv3.html
Rootfs: http://storage.kernelci.org/images/rootfs/buildroot/buildroot-baseline/20220718.0/arm64/rootfs.cpio.gz


* baseline.login: https://kernelci.org/test/case/id/62eaab21d3aa38f235daf05b
new failure (last pass: v5.10.83-cip1-178-g2cf1d12aab81)



platform | arch | lab | compiler | defconfig | regressions
---------------------------+-------+---------------+----------+----------------------------+------------
qemu_arm64-virt-gicv3 | arm64 | lab-collabora | gcc-10 | defconfig+arm64-chromebook | 1

Details: https://kernelci.org/test/plan/id/62eaabfcaa63766b55daf0d5

Results: 0 PASS, 1 FAIL, 0 SKIP
Full config: defconfig+arm64-chromebook
Compiler: gcc-10 (aarch64-linux-gnu-gcc (Debian 10.2.1-6) 10.2.1 20210110)
Plain log: https://storage.kernelci.org//cip/linux-5.10.y-cip/v5.10.131-cip13-24-ga6f4ea41fe167/arm64/defconfig+arm64-chromebook/gcc-10/lab-collabora/baseline-qemu_arm64-virt-gicv3.txt
HTML log: https://storage.kernelci.org//cip/linux-5.10.y-cip/v5.10.131-cip13-24-ga6f4ea41fe167/arm64/defconfig+arm64-chromebook/gcc-10/lab-collabora/baseline-qemu_arm64-virt-gicv3.html
Rootfs: http://storage.kernelci.org/images/rootfs/buildroot/buildroot-baseline/20220718.0/arm64/rootfs.cpio.gz


* baseline.login: https://kernelci.org/test/case/id/62eaabfcaa63766b55daf0d6
failing since 8 days (last pass: v5.10.83-cip1-178-g2cf1d12aab81, first fail: v5.10.129-cip12-36-g21d9d56f4de5a)



platform | arch | lab | compiler | defconfig | regressions
---------------------------+-------+---------------+----------+----------------------------+------------
qemu_arm64-virt-gicv3-uefi | arm64 | lab-broonie | gcc-10 | defconfig | 1

Details: https://kernelci.org/test/plan/id/62eaab30f95139dc4edaf0a7

Results: 0 PASS, 1 FAIL, 0 SKIP
Full config: defconfig
Compiler: gcc-10 (aarch64-linux-gnu-gcc (Debian 10.2.1-6) 10.2.1 20210110)
Plain log: https://storage.kernelci.org//cip/linux-5.10.y-cip/v5.10.131-cip13-24-ga6f4ea41fe167/arm64/defconfig/gcc-10/lab-broonie/baseline-qemu_arm64-virt-gicv3-uefi.txt
HTML log: https://storage.kernelci.org//cip/linux-5.10.y-cip/v5.10.131-cip13-24-ga6f4ea41fe167/arm64/defconfig/gcc-10/lab-broonie/baseline-qemu_arm64-virt-gicv3-uefi.html
Rootfs: http://storage.kernelci.org/images/rootfs/buildroot/buildroot-baseline/20220718.0/arm64/rootfs.cpio.gz


* baseline.login: https://kernelci.org/test/case/id/62eaab30f95139dc4edaf0a8
failing since 36 days (last pass: v5.10.112-cip6, first fail: v5.10.125-cip10)



platform | arch | lab | compiler | defconfig | regressions
---------------------------+-------+---------------+----------+----------------------------+------------
qemu_arm64-virt-gicv3-uefi | arm64 | lab-broonie | gcc-10 | defconfig+arm64-chromebook | 1

Details: https://kernelci.org/test/plan/id/62eaac9abda61c3b37daf059

Results: 0 PASS, 1 FAIL, 0 SKIP
Full config: defconfig+arm64-chromebook
Compiler: gcc-10 (aarch64-linux-gnu-gcc (Debian 10.2.1-6) 10.2.1 20210110)
Plain log: https://storage.kernelci.org//cip/linux-5.10.y-cip/v5.10.131-cip13-24-ga6f4ea41fe167/arm64/defconfig+arm64-chromebook/gcc-10/lab-broonie/baseline-qemu_arm64-virt-gicv3-uefi.txt
HTML log: https://storage.kernelci.org//cip/linux-5.10.y-cip/v5.10.131-cip13-24-ga6f4ea41fe167/arm64/defconfig+arm64-chromebook/gcc-10/lab-broonie/baseline-qemu_arm64-virt-gicv3-uefi.html
Rootfs: http://storage.kernelci.org/images/rootfs/buildroot/buildroot-baseline/20220718.0/arm64/rootfs.cpio.gz


* baseline.login: https://kernelci.org/test/case/id/62eaac9abda61c3b37daf05a
new failure (last pass: v5.10.83-cip1-178-g2cf1d12aab81)



platform | arch | lab | compiler | defconfig | regressions
---------------------------+-------+---------------+----------+----------------------------+------------
qemu_arm64-virt-gicv3-uefi | arm64 | lab-collabora | gcc-10 | defconfig+arm64-chromebook | 1

Details: https://kernelci.org/test/plan/id/62eaabfdaa63766b55daf0e3

Results: 0 PASS, 1 FAIL, 0 SKIP
Full config: defconfig+arm64-chromebook
Compiler: gcc-10 (aarch64-linux-gnu-gcc (Debian 10.2.1-6) 10.2.1 20210110)
Plain log: https://storage.kernelci.org//cip/linux-5.10.y-cip/v5.10.131-cip13-24-ga6f4ea41fe167/arm64/defconfig+arm64-chromebook/gcc-10/lab-collabora/baseline-qemu_arm64-virt-gicv3-uefi.txt
HTML log: https://storage.kernelci.org//cip/linux-5.10.y-cip/v5.10.131-cip13-24-ga6f4ea41fe167/arm64/defconfig+arm64-chromebook/gcc-10/lab-collabora/baseline-qemu_arm64-virt-gicv3-uefi.html
Rootfs: http://storage.kernelci.org/images/rootfs/buildroot/buildroot-baseline/20220718.0/arm64/rootfs.cpio.gz


* baseline.login: https://kernelci.org/test/case/id/62eaabfdaa63766b55daf0e4
new failure (last pass: v5.10.83-cip1-178-g2cf1d12aab81)



platform | arch | lab | compiler | defconfig | regressions
---------------------------+-------+---------------+----------+----------------------------+------------
r8a774a1-hihope-rzg2m-ex | arm64 | lab-cip | gcc-10 | defconfig+arm64-chromebook | 1

Details: https://kernelci.org/test/plan/id/62eab2a8df1ac24306daf072

Results: 0 PASS, 1 FAIL, 0 SKIP
Full config: defconfig+arm64-chromebook
Compiler: gcc-10 (aarch64-linux-gnu-gcc (Debian 10.2.1-6) 10.2.1 20210110)
Plain log: https://storage.kernelci.org//cip/linux-5.10.y-cip/v5.10.131-cip13-24-ga6f4ea41fe167/arm64/defconfig+arm64-chromebook/gcc-10/lab-cip/baseline-r8a774a1-hihope-rzg2m-ex.txt
HTML log: https://storage.kernelci.org//cip/linux-5.10.y-cip/v5.10.131-cip13-24-ga6f4ea41fe167/arm64/defconfig+arm64-chromebook/gcc-10/lab-cip/baseline-r8a774a1-hihope-rzg2m-ex.html
Rootfs: http://storage.kernelci.org/images/rootfs/buildroot/buildroot-baseline/20220718.0/arm64/rootfs.cpio.gz


* baseline.login: https://kernelci.org/test/case/id/62eab2a8df1ac24306daf073
new failure (last pass: v5.10.129-cip12)



platform | arch | lab | compiler | defconfig | regressions
---------------------------+-------+---------------+----------+----------------------------+------------
rk3399-gru-kevin | arm64 | lab-collabora | gcc-10 | defconfig+arm64-chromebook | 1

Details: https://kernelci.org/test/plan/id/62eaad22332d01c4e9daf0d2

Results: 90 PASS, 2 FAIL, 0 SKIP
Full config: defconfig+arm64-chromebook
Compiler: gcc-10 (aarch64-linux-gnu-gcc (Debian 10.2.1-6) 10.2.1 20210110)
Plain log: https://storage.kernelci.org//cip/linux-5.10.y-cip/v5.10.131-cip13-24-ga6f4ea41fe167/arm64/defconfig+arm64-chromebook/gcc-10/lab-collabora/baseline-rk3399-gru-kevin.txt
HTML log: https://storage.kernelci.org//cip/linux-5.10.y-cip/v5.10.131-cip13-24-ga6f4ea41fe167/arm64/defconfig+arm64-chromebook/gcc-10/lab-collabora/baseline-rk3399-gru-kevin.html
Rootfs: http://storage.kernelci.org/images/rootfs/buildroot/buildroot-baseline/20220718.0/arm64/rootfs.cpio.gz


* baseline.bootrr.rockchip-i2s1-probed: https://kernelci.org/test/case/id/62eaad22332d01c4e9daf0f4
failing since 127 days (last pass: v5.10.83-cip1-178-g2cf1d12aab81, first fail: v5.10.106-cip4)

2022-08-03T17:14:56.089478 /lava-6963180/1/../bin/lava-test-case
2022-08-03T17:14:56.100302 <8>[ 60.533816] <LAVA_SIGNAL_TESTCASE TEST_CASE_ID=rockchip-i2s1-probed RESULT=fail>


cip/linux-5.10.y-cip baseline-nfs: 34 runs, 2 regressions (v5.10.131-cip13-24-ga6f4ea41fe167) #kernelci

kernelci.org bot <bot@...>
 

cip/linux-5.10.y-cip baseline-nfs: 34 runs, 2 regressions (v5.10.131-cip13-24-ga6f4ea41fe167)

Regressions Summary
-------------------

platform | arch | lab | compiler | defconfig | regressions
-----------------+-------+---------------+----------+----------------------------+------------
at91sam9g20ek | arm | lab-broonie | gcc-10 | multi_v5_defconfig | 1
rk3399-gru-kevin | arm64 | lab-collabora | gcc-10 | defconfig+arm64-chromebook | 1

Details: https://kernelci.org/test/job/cip/branch/linux-5.10.y-cip/kernel/v5.10.131-cip13-24-ga6f4ea41fe167/plan/baseline-nfs/

Test: baseline-nfs
Tree: cip
Branch: linux-5.10.y-cip
Describe: v5.10.131-cip13-24-ga6f4ea41fe167
URL: https://git.kernel.org/pub/scm/linux/kernel/git/cip/linux-cip.git
SHA: a6f4ea41fe167f956d4000eaf276a1e383603071


Test Regressions
----------------


platform | arch | lab | compiler | defconfig | regressions
-----------------+-------+---------------+----------+----------------------------+------------
at91sam9g20ek | arm | lab-broonie | gcc-10 | multi_v5_defconfig | 1

Details: https://kernelci.org/test/plan/id/62eaa8d002883eb07adaf098

Results: 0 PASS, 1 FAIL, 0 SKIP
Full config: multi_v5_defconfig
Compiler: gcc-10 (arm-linux-gnueabihf-gcc (Debian 10.2.1-6) 10.2.1 20210110)
Plain log: https://storage.kernelci.org//cip/linux-5.10.y-cip/v5.10.131-cip13-24-ga6f4ea41fe167/arm/multi_v5_defconfig/gcc-10/lab-broonie/baseline-nfs-at91sam9g20ek.txt
HTML log: https://storage.kernelci.org//cip/linux-5.10.y-cip/v5.10.131-cip13-24-ga6f4ea41fe167/arm/multi_v5_defconfig/gcc-10/lab-broonie/baseline-nfs-at91sam9g20ek.html
Rootfs: http://storage.kernelci.org/images/rootfs/debian/bullseye/20220718.0/armel/initrd.cpio.gz


* baseline-nfs.login: https://kernelci.org/test/case/id/62eaa8d002883eb07adaf099
new failure (last pass: v5.10.129-cip12-36-g21d9d56f4de5a)



platform | arch | lab | compiler | defconfig | regressions
-----------------+-------+---------------+----------+----------------------------+------------
rk3399-gru-kevin | arm64 | lab-collabora | gcc-10 | defconfig+arm64-chromebook | 1

Details: https://kernelci.org/test/plan/id/62eaac3c7f6d242667daf059

Results: 84 PASS, 4 FAIL, 0 SKIP
Full config: defconfig+arm64-chromebook
Compiler: gcc-10 (aarch64-linux-gnu-gcc (Debian 10.2.1-6) 10.2.1 20210110)
Plain log: https://storage.kernelci.org//cip/linux-5.10.y-cip/v5.10.131-cip13-24-ga6f4ea41fe167/arm64/defconfig+arm64-chromebook/gcc-10/lab-collabora/baseline-nfs-rk3399-gru-kevin.txt
HTML log: https://storage.kernelci.org//cip/linux-5.10.y-cip/v5.10.131-cip13-24-ga6f4ea41fe167/arm64/defconfig+arm64-chromebook/gcc-10/lab-collabora/baseline-nfs-rk3399-gru-kevin.html
Rootfs: http://storage.kernelci.org/images/rootfs/debian/bullseye/20220718.0/arm64/initrd.cpio.gz


* baseline-nfs.bootrr.rockchip-i2s1-probed: https://kernelci.org/test/case/id/62eaac3c7f6d242667daf07b
failing since 127 days (last pass: v5.10.83-cip1-178-g2cf1d12aab81, first fail: v5.10.106-cip4)

2022-08-03T17:11:12.641628 <4>[ 37.477747] cdn-dp fec00000.dp: Direct firmware load for rockchip/dptx.bin failed with error -2
2022-08-03T17:11:12.650517 <4>[ 37.488177] cdn-dp fec00000.dp: Falling back to sysfs fallback for: rockchip/dptx.bin
2022-08-03T17:11:13.346905 /lava-6963172/1/../bin/lava-test-case
2022-08-03T17:11:13.386988 <8>[ 38.225015] <LAVA_SIGNAL_TESTCASE TEST_CASE_ID=rockchip-i2s1-probed RESULT=fail>


cip/linux-5.10.y-cip baseline-cip-nfs: 8 runs, 1 regressions (v5.10.131-cip13-24-ga6f4ea41fe167) #kernelci

kernelci.org bot <bot@...>
 

cip/linux-5.10.y-cip baseline-cip-nfs: 8 runs, 1 regressions (v5.10.131-cip13-24-ga6f4ea41fe167)

Regressions Summary
-------------------

platform | arch | lab | compiler | defconfig | regressions
-----------------+------+-------------+----------+--------------------+------------
beaglebone-black | arm | lab-broonie | gcc-10 | multi_v7_defconfig | 1

Details: https://kernelci.org/test/job/cip/branch/linux-5.10.y-cip/kernel/v5.10.131-cip13-24-ga6f4ea41fe167/plan/baseline-cip-nfs/

Test: baseline-cip-nfs
Tree: cip
Branch: linux-5.10.y-cip
Describe: v5.10.131-cip13-24-ga6f4ea41fe167
URL: https://git.kernel.org/pub/scm/linux/kernel/git/cip/linux-cip.git
SHA: a6f4ea41fe167f956d4000eaf276a1e383603071


Test Regressions
----------------


platform | arch | lab | compiler | defconfig | regressions
-----------------+------+-------------+----------+--------------------+------------
beaglebone-black | arm | lab-broonie | gcc-10 | multi_v7_defconfig | 1

Details: https://kernelci.org/test/plan/id/62eaaae026a7e50100daf058

Results: 0 PASS, 1 FAIL, 0 SKIP
Full config: multi_v7_defconfig
Compiler: gcc-10 (arm-linux-gnueabihf-gcc (Debian 10.2.1-6) 10.2.1 20210110)
Plain log: https://storage.kernelci.org//cip/linux-5.10.y-cip/v5.10.131-cip13-24-ga6f4ea41fe167/arm/multi_v7_defconfig/gcc-10/lab-broonie/baseline-cip-nfs-beaglebone-black.txt
HTML log: https://storage.kernelci.org//cip/linux-5.10.y-cip/v5.10.131-cip13-24-ga6f4ea41fe167/arm/multi_v7_defconfig/gcc-10/lab-broonie/baseline-cip-nfs-beaglebone-black.html
Rootfs: https://storage.kernelci.org/images/rootfs/cip/20211105/qemu-arm/cip-core-image-kernelci-cip-core-buster-qemu-arm-initrd.img.gz


* baseline-cip-nfs.login: https://kernelci.org/test/case/id/62eaaae026a7e50100daf059
new failure (last pass: v5.10.129-cip12-36-g21d9d56f4de5a)


cip-gitlab/ci/pavel/linux-test baseline-nfs: 17 runs, 7 regressions (v4.4-st20-74-gc99f2b257bde3) #kernelci

kernelci.org bot <bot@...>
 

cip-gitlab/ci/pavel/linux-test baseline-nfs: 17 runs, 7 regressions (v4.4-st20-74-gc99f2b257bde3)

Regressions Summary
-------------------

platform | arch | lab | compiler | defconfig | regressions
--------------------------+--------+---------------+----------+------------------------------+------------
asus-C433TA-AJ0005-rammus | x86_64 | lab-collabora | gcc-10 | x86_64_defcon...6-chromebook | 1
asus-C523NA-A20057-coral | x86_64 | lab-collabora | gcc-10 | x86_64_defcon...6-chromebook | 1
asus-cx9400-volteer | x86_64 | lab-collabora | gcc-10 | x86_64_defcon...6-chromebook | 1
beaglebone-black | arm | lab-broonie | gcc-10 | multi_v7_defconfig | 1
beaglebone-black | arm | lab-cip | gcc-10 | multi_v7_defconfig | 1
beaglebone-black | arm | lab-broonie | gcc-10 | omap2plus_defconfig | 1
beaglebone-black | arm | lab-cip | gcc-10 | omap2plus_defconfig | 1

Details: https://kernelci.org/test/job/cip-gitlab/branch/ci%2Fpavel%2Flinux-test/kernel/v4.4-st20-74-gc99f2b257bde3/plan/baseline-nfs/

Test: baseline-nfs
Tree: cip-gitlab
Branch: ci/pavel/linux-test
Describe: v4.4-st20-74-gc99f2b257bde3
URL: https://gitlab.com/cip-project/cip-kernel/linux-cip.git
SHA: c99f2b257bde3cd60a833056aab624ad5fab3812


Test Regressions
----------------


platform | arch | lab | compiler | defconfig | regressions
--------------------------+--------+---------------+----------+------------------------------+------------
asus-C433TA-AJ0005-rammus | x86_64 | lab-collabora | gcc-10 | x86_64_defcon...6-chromebook | 1

Details: https://kernelci.org/test/plan/id/62eaa30eb0643174eedaf184

Results: 0 PASS, 1 FAIL, 0 SKIP
Full config: x86_64_defconfig+x86-chromebook
Compiler: gcc-10 (gcc (Debian 10.2.1-6) 10.2.1 20210110)
Plain log: https://storage.kernelci.org//cip-gitlab/ci-pavel-linux-test/v4.4-st20-74-gc99f2b257bde3/x86_64/x86_64_defconfig+x86-chromebook/gcc-10/lab-collabora/baseline-nfs-asus-C433TA-AJ0005-rammus.txt
HTML log: https://storage.kernelci.org//cip-gitlab/ci-pavel-linux-test/v4.4-st20-74-gc99f2b257bde3/x86_64/x86_64_defconfig+x86-chromebook/gcc-10/lab-collabora/baseline-nfs-asus-C433TA-AJ0005-rammus.html
Rootfs: http://storage.kernelci.org/images/rootfs/debian/bullseye/20220718.0/amd64/initrd.cpio.gz


* baseline-nfs.login: https://kernelci.org/test/case/id/62eaa30eb0643174eedaf185
failing since 0 day (last pass: v5.10.131-cip13-24-ga6f4ea41fe167, first fail: v4.4.302-cip70-rt40)



platform | arch | lab | compiler | defconfig | regressions
--------------------------+--------+---------------+----------+------------------------------+------------
asus-C523NA-A20057-coral | x86_64 | lab-collabora | gcc-10 | x86_64_defcon...6-chromebook | 1

Details: https://kernelci.org/test/plan/id/62eaa9388848cd77bbdaf48c

Results: 0 PASS, 1 FAIL, 0 SKIP
Full config: x86_64_defconfig+x86-chromebook
Compiler: gcc-10 (gcc (Debian 10.2.1-6) 10.2.1 20210110)
Plain log: https://storage.kernelci.org//cip-gitlab/ci-pavel-linux-test/v4.4-st20-74-gc99f2b257bde3/x86_64/x86_64_defconfig+x86-chromebook/gcc-10/lab-collabora/baseline-nfs-asus-C523NA-A20057-coral.txt
HTML log: https://storage.kernelci.org//cip-gitlab/ci-pavel-linux-test/v4.4-st20-74-gc99f2b257bde3/x86_64/x86_64_defconfig+x86-chromebook/gcc-10/lab-collabora/baseline-nfs-asus-C523NA-A20057-coral.html
Rootfs: http://storage.kernelci.org/images/rootfs/debian/bullseye/20220718.0/amd64/initrd.cpio.gz


* baseline-nfs.login: https://kernelci.org/test/case/id/62eaa9388848cd77bbdaf48d
failing since 0 day (last pass: v5.10.131-cip13-24-ga6f4ea41fe167, first fail: v4.4.302-cip70-rt40)



platform | arch | lab | compiler | defconfig | regressions
--------------------------+--------+---------------+----------+------------------------------+------------
asus-cx9400-volteer | x86_64 | lab-collabora | gcc-10 | x86_64_defcon...6-chromebook | 1

Details: https://kernelci.org/test/plan/id/62eaa28044e690a60edaf069

Results: 0 PASS, 1 FAIL, 0 SKIP
Full config: x86_64_defconfig+x86-chromebook
Compiler: gcc-10 (gcc (Debian 10.2.1-6) 10.2.1 20210110)
Plain log: https://storage.kernelci.org//cip-gitlab/ci-pavel-linux-test/v4.4-st20-74-gc99f2b257bde3/x86_64/x86_64_defconfig+x86-chromebook/gcc-10/lab-collabora/baseline-nfs-asus-cx9400-volteer.txt
HTML log: https://storage.kernelci.org//cip-gitlab/ci-pavel-linux-test/v4.4-st20-74-gc99f2b257bde3/x86_64/x86_64_defconfig+x86-chromebook/gcc-10/lab-collabora/baseline-nfs-asus-cx9400-volteer.html
Rootfs: http://storage.kernelci.org/images/rootfs/debian/bullseye/20220718.0/amd64/initrd.cpio.gz


* baseline-nfs.login: https://kernelci.org/test/case/id/62eaa28044e690a60edaf06a
failing since 0 day (last pass: v5.10.131-cip13-24-ga6f4ea41fe167, first fail: v4.4.302-cip70-rt40)



platform | arch | lab | compiler | defconfig | regressions
--------------------------+--------+---------------+----------+------------------------------+------------
beaglebone-black | arm | lab-broonie | gcc-10 | multi_v7_defconfig | 1

Details: https://kernelci.org/test/plan/id/62eaa52bd9e020a812daf07e

Results: 3 PASS, 1 FAIL, 1 SKIP
Full config: multi_v7_defconfig
Compiler: gcc-10 (arm-linux-gnueabihf-gcc (Debian 10.2.1-6) 10.2.1 20210110)
Plain log: https://storage.kernelci.org//cip-gitlab/ci-pavel-linux-test/v4.4-st20-74-gc99f2b257bde3/arm/multi_v7_defconfig/gcc-10/lab-broonie/baseline-nfs-beaglebone-black.txt
HTML log: https://storage.kernelci.org//cip-gitlab/ci-pavel-linux-test/v4.4-st20-74-gc99f2b257bde3/arm/multi_v7_defconfig/gcc-10/lab-broonie/baseline-nfs-beaglebone-black.html
Rootfs: http://storage.kernelci.org/images/rootfs/debian/bullseye/20220718.0/armhf/initrd.cpio.gz


* baseline-nfs.dmesg.crit: https://kernelci.org/test/case/id/62eaa52bd9e020a812daf085
failing since 0 day (last pass: v5.10.131-cip13-24-ga6f4ea41fe167, first fail: v4.4.302-cip70-rt40)
1 lines

2022-08-03T16:40:51.998990 / #
2022-08-03T16:40:52.005617
2022-08-03T16:40:57.029920 / # export NFS_ROOTFS='/var/lib/lava/dispatcher/tmp/382137/extract-nfsrootfs-x46bcfki'
2022-08-03T16:40:57.040943 export NFS_ROOTFS='/var/lib/lava/dispatcher/tmp/382137/extract-nfsrootfs-x46bcfki'
2022-08-03T16:40:59.330941 / # export NFS_SERVER_IP='192.168.56.123'
2022-08-03T16:40:59.341948 export NFS_SERVER_IP='192.168.56.123'
2022-08-03T16:40:59.447195 / # #
2022-08-03T16:40:59.453513 #
2022-08-03T16:40:59.556733 / # export SHELL=/bin/sh
2022-08-03T16:40:59.562818 export SHELL=/bin/sh
... (13 line(s) more)



platform | arch | lab | compiler | defconfig | regressions
--------------------------+--------+---------------+----------+------------------------------+------------
beaglebone-black | arm | lab-cip | gcc-10 | multi_v7_defconfig | 1

Details: https://kernelci.org/test/plan/id/62eaa6c902418fb9c6daf085

Results: 3 PASS, 1 FAIL, 1 SKIP
Full config: multi_v7_defconfig
Compiler: gcc-10 (arm-linux-gnueabihf-gcc (Debian 10.2.1-6) 10.2.1 20210110)
Plain log: https://storage.kernelci.org//cip-gitlab/ci-pavel-linux-test/v4.4-st20-74-gc99f2b257bde3/arm/multi_v7_defconfig/gcc-10/lab-cip/baseline-nfs-beaglebone-black.txt
HTML log: https://storage.kernelci.org//cip-gitlab/ci-pavel-linux-test/v4.4-st20-74-gc99f2b257bde3/arm/multi_v7_defconfig/gcc-10/lab-cip/baseline-nfs-beaglebone-black.html
Rootfs: http://storage.kernelci.org/images/rootfs/debian/bullseye/20220718.0/armhf/initrd.cpio.gz


* baseline-nfs.dmesg.crit: https://kernelci.org/test/case/id/62eaa6c902418fb9c6daf08a
failing since 0 day (last pass: v5.10.131-cip13-24-ga6f4ea41fe167, first fail: v4.4.302-cip70-rt40)
1 lines

2022-08-03T16:47:48.627520 / #
2022-08-03T16:47:48.629874
2022-08-03T16:47:53.639262 / # export NFS_ROOTFS='/var/lib/lava/dispatcher/tmp/720593/extract-nfsrootfs-vcetbc6c'
2022-08-03T16:47:53.649947 export NFS_ROOTFS='/var/lib/lava/dispatcher/tmp/720593/extract-nfsrootfs-vcetbc6c'
2022-08-03T16:47:55.816492 / # export NFS_SERVER_IP='192.168.11.5'
2022-08-03T16:47:55.827162 export NFS_SERVER_IP='192.168.11.5'
2022-08-03T16:47:55.930483 / # #
2022-08-03T16:47:55.932802 #
2022-08-03T16:47:56.035995 / # export SHELL=/bin/sh
2022-08-03T16:47:56.038290 export SHELL=/bin/sh
... (13 line(s) more)



platform | arch | lab | compiler | defconfig | regressions
--------------------------+--------+---------------+----------+------------------------------+------------
beaglebone-black | arm | lab-broonie | gcc-10 | omap2plus_defconfig | 1

Details: https://kernelci.org/test/plan/id/62eaa283534ed79436daf056

Results: 3 PASS, 1 FAIL, 1 SKIP
Full config: omap2plus_defconfig
Compiler: gcc-10 (arm-linux-gnueabihf-gcc (Debian 10.2.1-6) 10.2.1 20210110)
Plain log: https://storage.kernelci.org//cip-gitlab/ci-pavel-linux-test/v4.4-st20-74-gc99f2b257bde3/arm/omap2plus_defconfig/gcc-10/lab-broonie/baseline-nfs-beaglebone-black.txt
HTML log: https://storage.kernelci.org//cip-gitlab/ci-pavel-linux-test/v4.4-st20-74-gc99f2b257bde3/arm/omap2plus_defconfig/gcc-10/lab-broonie/baseline-nfs-beaglebone-black.html
Rootfs: http://storage.kernelci.org/images/rootfs/debian/bullseye/20220718.0/armhf/initrd.cpio.gz


* baseline-nfs.dmesg.crit: https://kernelci.org/test/case/id/62eaa283534ed79436daf05d
failing since 0 day (last pass: v5.10.131-cip13, first fail: v4.4.302-cip70-rt40)
1 lines

2022-08-03T16:29:27.666449 / #
2022-08-03T16:29:27.670988
2022-08-03T16:29:32.684053 / # export NFS_ROOTFS='/var/lib/lava/dispatcher/tmp/382102/extract-nfsrootfs-7qgn4__x'
2022-08-03T16:29:32.695260 export NFS_ROOTFS='/var/lib/lava/dispatcher/tmp/382102/extract-nfsrootfs-7qgn4__x'
2022-08-03T16:29:34.999894 / # export NFS_SERVER_IP='192.168.56.123'
2022-08-03T16:29:35.011100 export NFS_SERVER_IP='192.168.56.123'
2022-08-03T16:29:35.122850 / # #
2022-08-03T16:29:35.127580 #
2022-08-03T16:29:35.243230 / # export SHELL=/bin/sh
2022-08-03T16:29:35.247901 export SHELL=/bin/sh
... (13 line(s) more)



platform | arch | lab | compiler | defconfig | regressions
--------------------------+--------+---------------+----------+------------------------------+------------
beaglebone-black | arm | lab-cip | gcc-10 | omap2plus_defconfig | 1

Details: https://kernelci.org/test/plan/id/62eaa18dcd17c149f1daf05d

Results: 3 PASS, 1 FAIL, 1 SKIP
Full config: omap2plus_defconfig
Compiler: gcc-10 (arm-linux-gnueabihf-gcc (Debian 10.2.1-6) 10.2.1 20210110)
Plain log: https://storage.kernelci.org//cip-gitlab/ci-pavel-linux-test/v4.4-st20-74-gc99f2b257bde3/arm/omap2plus_defconfig/gcc-10/lab-cip/baseline-nfs-beaglebone-black.txt
HTML log: https://storage.kernelci.org//cip-gitlab/ci-pavel-linux-test/v4.4-st20-74-gc99f2b257bde3/arm/omap2plus_defconfig/gcc-10/lab-cip/baseline-nfs-beaglebone-black.html
Rootfs: http://storage.kernelci.org/images/rootfs/debian/bullseye/20220718.0/armhf/initrd.cpio.gz


* baseline-nfs.dmesg.crit: https://kernelci.org/test/case/id/62eaa18dcd17c149f1daf062
failing since 0 day (last pass: v5.10.131-cip13, first fail: v4.4.302-cip70-rt40)
1 lines

2022-08-03T16:25:33.224055 / #
2022-08-03T16:25:33.227251
2022-08-03T16:25:38.240661 / # export NFS_ROOTFS='/var/lib/lava/dispatcher/tmp/720575/extract-nfsrootfs-4n19eyj1'
2022-08-03T16:25:38.251387 export NFS_ROOTFS='/var/lib/lava/dispatcher/tmp/720575/extract-nfsrootfs-4n19eyj1'
2022-08-03T16:25:40.425524 / # export NFS_SERVER_IP='192.168.11.5'
2022-08-03T16:25:40.436213 export NFS_SERVER_IP='192.168.11.5'
2022-08-03T16:25:40.544082 / # #
2022-08-03T16:25:40.546709 #
2022-08-03T16:25:40.660927 / # export SHELL=/bin/sh
2022-08-03T16:25:40.663512 export SHELL=/bin/sh
... (13 line(s) more)


cip-gitlab/ci/pavel/linux-test baseline: 60 runs, 24 regressions (v4.4-st20-74-gc99f2b257bde3) #kernelci

kernelci.org bot <bot@...>
 

cip-gitlab/ci/pavel/linux-test baseline: 60 runs, 24 regressions (v4.4-st20-74-gc99f2b257bde3)

Regressions Summary
-------------------

platform | arch | lab | compiler | defconfig | regressions
---------------------------+--------+---------------+----------+------------------------------+------------
asus-cx9400-volteer | x86_64 | lab-collabora | gcc-10 | x86_64_defcon...6-chromebook | 1
bcm2835-rpi-b-rev2 | arm | lab-broonie | gcc-10 | bcm2835_defconfig | 1
beaglebone-black | arm | lab-broonie | gcc-10 | multi_v7_defconfig | 1
beaglebone-black | arm | lab-cip | gcc-10 | multi_v7_defconfig | 1
beaglebone-black | arm | lab-broonie | gcc-10 | omap2plus_defconfig | 1
beaglebone-black | arm | lab-cip | gcc-10 | omap2plus_defconfig | 1
odroid-xu3 | arm | lab-collabora | gcc-10 | exynos_defconfig | 1
qemu_arm-virt-gicv2 | arm | lab-baylibre | gcc-10 | multi_v7_defconfig | 1
qemu_arm-virt-gicv2 | arm | lab-broonie | gcc-10 | multi_v7_defconfig | 1
qemu_arm-virt-gicv2-uefi | arm | lab-baylibre | gcc-10 | multi_v7_defconfig | 1
qemu_arm-virt-gicv2-uefi | arm | lab-broonie | gcc-10 | multi_v7_defconfig | 1
qemu_arm-virt-gicv3 | arm | lab-baylibre | gcc-10 | multi_v7_defconfig | 1
qemu_arm-virt-gicv3 | arm | lab-broonie | gcc-10 | multi_v7_defconfig | 1
qemu_arm-virt-gicv3-uefi | arm | lab-baylibre | gcc-10 | multi_v7_defconfig | 1
qemu_arm-virt-gicv3-uefi | arm | lab-broonie | gcc-10 | multi_v7_defconfig | 1
qemu_arm64-virt-gicv2 | arm64 | lab-broonie | gcc-10 | defconfig+arm64-chromebook | 1
qemu_arm64-virt-gicv2-uefi | arm64 | lab-broonie | gcc-10 | defconfig+arm64-chromebook | 1
qemu_arm64-virt-gicv3 | arm64 | lab-broonie | gcc-10 | defconfig+arm64-chromebook | 1
qemu_arm64-virt-gicv3-uefi | arm64 | lab-broonie | gcc-10 | defconfig+arm64-chromebook | 1
qemu_x86_64-uefi-mixed | x86_64 | lab-baylibre | gcc-10 | x86_64_defconfig | 1
qemu_x86_64-uefi-mixed | x86_64 | lab-baylibre | gcc-10 | x86_64_defcon...6-chromebook | 1
qemu_x86_64-uefi-mixed | x86_64 | lab-broonie | gcc-10 | x86_64_defconfig | 1
qemu_x86_64-uefi-mixed | x86_64 | lab-broonie | gcc-10 | x86_64_defcon...6-chromebook | 1
qemu_x86_64-uefi-mixed | x86_64 | lab-collabora | gcc-10 | x86_64_defconfig | 1

Details: https://kernelci.org/test/job/cip-gitlab/branch/ci%2Fpavel%2Flinux-test/kernel/v4.4-st20-74-gc99f2b257bde3/plan/baseline/

Test: baseline
Tree: cip-gitlab
Branch: ci/pavel/linux-test
Describe: v4.4-st20-74-gc99f2b257bde3
URL: https://gitlab.com/cip-project/cip-kernel/linux-cip.git
SHA: c99f2b257bde3cd60a833056aab624ad5fab3812


Test Regressions
----------------


platform | arch | lab | compiler | defconfig | regressions
---------------------------+--------+---------------+----------+------------------------------+------------
asus-cx9400-volteer | x86_64 | lab-collabora | gcc-10 | x86_64_defcon...6-chromebook | 1

Details: https://kernelci.org/test/plan/id/62eaa27fd8dfb7c421daf06b

Results: 0 PASS, 1 FAIL, 0 SKIP
Full config: x86_64_defconfig+x86-chromebook
Compiler: gcc-10 (gcc (Debian 10.2.1-6) 10.2.1 20210110)
Plain log: https://storage.kernelci.org//cip-gitlab/ci-pavel-linux-test/v4.4-st20-74-gc99f2b257bde3/x86_64/x86_64_defconfig+x86-chromebook/gcc-10/lab-collabora/baseline-asus-cx9400-volteer.txt
HTML log: https://storage.kernelci.org//cip-gitlab/ci-pavel-linux-test/v4.4-st20-74-gc99f2b257bde3/x86_64/x86_64_defconfig+x86-chromebook/gcc-10/lab-collabora/baseline-asus-cx9400-volteer.html
Rootfs: http://storage.kernelci.org/images/rootfs/buildroot/buildroot-baseline/20220718.0/x86/rootfs.cpio.gz


* baseline.login: https://kernelci.org/test/case/id/62eaa27fd8dfb7c421daf06c
failing since 0 day (last pass: v5.10.131-cip13-24-ga6f4ea41fe167, first fail: v4.4.302-cip70-rt40)



platform | arch | lab | compiler | defconfig | regressions
---------------------------+--------+---------------+----------+------------------------------+------------
bcm2835-rpi-b-rev2 | arm | lab-broonie | gcc-10 | bcm2835_defconfig | 1

Details: https://kernelci.org/test/plan/id/62eaa108005cb81725daf059

Results: 0 PASS, 1 FAIL, 0 SKIP
Full config: bcm2835_defconfig
Compiler: gcc-10 (arm-linux-gnueabihf-gcc (Debian 10.2.1-6) 10.2.1 20210110)
Plain log: https://storage.kernelci.org//cip-gitlab/ci-pavel-linux-test/v4.4-st20-74-gc99f2b257bde3/arm/bcm2835_defconfig/gcc-10/lab-broonie/baseline-bcm2835-rpi-b-rev2.txt
HTML log: https://storage.kernelci.org//cip-gitlab/ci-pavel-linux-test/v4.4-st20-74-gc99f2b257bde3/arm/bcm2835_defconfig/gcc-10/lab-broonie/baseline-bcm2835-rpi-b-rev2.html
Rootfs: http://storage.kernelci.org/images/rootfs/buildroot/buildroot-baseline/20220718.0/armel/rootfs.cpio.gz


* baseline.login: https://kernelci.org/test/case/id/62eaa108005cb81725daf05a
failing since 0 day (last pass: v5.10.131-cip13-24-ga6f4ea41fe167, first fail: v4.4.302-cip70-rt40)



platform | arch | lab | compiler | defconfig | regressions
---------------------------+--------+---------------+----------+------------------------------+------------
beaglebone-black | arm | lab-broonie | gcc-10 | multi_v7_defconfig | 1

Details: https://kernelci.org/test/plan/id/62eaa1cecd17c149f1daf071

Results: 4 PASS, 1 FAIL, 2 SKIP
Full config: multi_v7_defconfig
Compiler: gcc-10 (arm-linux-gnueabihf-gcc (Debian 10.2.1-6) 10.2.1 20210110)
Plain log: https://storage.kernelci.org//cip-gitlab/ci-pavel-linux-test/v4.4-st20-74-gc99f2b257bde3/arm/multi_v7_defconfig/gcc-10/lab-broonie/baseline-beaglebone-black.txt
HTML log: https://storage.kernelci.org//cip-gitlab/ci-pavel-linux-test/v4.4-st20-74-gc99f2b257bde3/arm/multi_v7_defconfig/gcc-10/lab-broonie/baseline-beaglebone-black.html
Rootfs: http://storage.kernelci.org/images/rootfs/buildroot/buildroot-baseline/20220718.0/armel/rootfs.cpio.gz


* baseline.dmesg.crit: https://kernelci.org/test/case/id/62eaa1cecd17c149f1daf07a
failing since 8 days (last pass: v5.10.129-cip12-36-g21d9d56f4de5a, first fail: v4.4-st5-586-geb97410e0086c)
1 lines

2022-08-03T16:26:46.158819 / #
2022-08-03T16:26:46.164004
2022-08-03T16:26:46.270647 / # #
2022-08-03T16:26:46.276507 #
2022-08-03T16:26:46.379158 / # export SHELL=/bin/sh
2022-08-03T16:26:46.384748 export SHELL=/bin/sh
2022-08-03T16:26:46.486899 / # . /lava-382135/environment
2022-08-03T16:26:46.492607 . /lava-382135/environment
2022-08-03T16:26:46.594804 / # /lava-382135/bin/lava-test-runner /lava-382135/0
2022-08-03T16:26:46.599984 /lava-382135/bin/lava-test-runner /lava-382135/0
... (9 line(s) more)



platform | arch | lab | compiler | defconfig | regressions
---------------------------+--------+---------------+----------+------------------------------+------------
beaglebone-black | arm | lab-cip | gcc-10 | multi_v7_defconfig | 1

Details: https://kernelci.org/test/plan/id/62eaa6b3fb4a829902daf09c

Results: 4 PASS, 1 FAIL, 2 SKIP
Full config: multi_v7_defconfig
Compiler: gcc-10 (arm-linux-gnueabihf-gcc (Debian 10.2.1-6) 10.2.1 20210110)
Plain log: https://storage.kernelci.org//cip-gitlab/ci-pavel-linux-test/v4.4-st20-74-gc99f2b257bde3/arm/multi_v7_defconfig/gcc-10/lab-cip/baseline-beaglebone-black.txt
HTML log: https://storage.kernelci.org//cip-gitlab/ci-pavel-linux-test/v4.4-st20-74-gc99f2b257bde3/arm/multi_v7_defconfig/gcc-10/lab-cip/baseline-beaglebone-black.html
Rootfs: http://storage.kernelci.org/images/rootfs/buildroot/buildroot-baseline/20220718.0/armel/rootfs.cpio.gz


* baseline.dmesg.crit: https://kernelci.org/test/case/id/62eaa6b3fb4a829902daf0a3
failing since 8 days (last pass: v5.10.129-cip12-36-g21d9d56f4de5a, first fail: v4.4-st5-586-geb97410e0086c)
1 lines

2022-08-03T16:47:24.661342 / #
2022-08-03T16:47:24.669235
2022-08-03T16:47:24.773917 / # #
2022-08-03T16:47:24.780616 #
2022-08-03T16:47:24.882758 / # export SHELL=/bin/sh
2022-08-03T16:47:24.890167 export SHELL=/bin/sh
2022-08-03T16:47:24.991985 / # . /lava-720592/environment
2022-08-03T16:47:24.998675 . /lava-720592/environment
2022-08-03T16:47:25.100050 / # /lava-720592/bin/lava-test-runner /lava-720592/0
2022-08-03T16:47:25.106401 /lava-720592/bin/lava-test-runner /lava-720592/0
... (9 line(s) more)



platform | arch | lab | compiler | defconfig | regressions
---------------------------+--------+---------------+----------+------------------------------+------------
beaglebone-black | arm | lab-broonie | gcc-10 | omap2plus_defconfig | 1

Details: https://kernelci.org/test/plan/id/62eaa16d9aed0c5a2cdaf056

Results: 4 PASS, 1 FAIL, 2 SKIP
Full config: omap2plus_defconfig
Compiler: gcc-10 (arm-linux-gnueabihf-gcc (Debian 10.2.1-6) 10.2.1 20210110)
Plain log: https://storage.kernelci.org//cip-gitlab/ci-pavel-linux-test/v4.4-st20-74-gc99f2b257bde3/arm/omap2plus_defconfig/gcc-10/lab-broonie/baseline-beaglebone-black.txt
HTML log: https://storage.kernelci.org//cip-gitlab/ci-pavel-linux-test/v4.4-st20-74-gc99f2b257bde3/arm/omap2plus_defconfig/gcc-10/lab-broonie/baseline-beaglebone-black.html
Rootfs: http://storage.kernelci.org/images/rootfs/buildroot/buildroot-baseline/20220718.0/armel/rootfs.cpio.gz


* baseline.dmesg.crit: https://kernelci.org/test/case/id/62eaa16d9aed0c5a2cdaf05f
failing since 0 day (last pass: v5.10.131-cip13, first fail: v4.4.302-cip70-rt40)
1 lines

2022-08-03T16:24:50.749458 / #
2022-08-03T16:24:50.755814
2022-08-03T16:24:50.859053 / # #
2022-08-03T16:24:50.863660 #
2022-08-03T16:24:50.965048 / # export SHELL=/bin/sh
2022-08-03T16:24:50.972750 export SHELL=/bin/sh
2022-08-03T16:24:51.074171 / # . /lava-382101/environment
2022-08-03T16:24:51.078797 . /lava-382101/environment
2022-08-03T16:24:51.183374 / # /lava-382101/bin/lava-test-runner /lava-382101/0
2022-08-03T16:24:51.187536 /lava-382101/bin/lava-test-runner /lava-382101/0
... (9 line(s) more)



platform | arch | lab | compiler | defconfig | regressions
---------------------------+--------+---------------+----------+------------------------------+------------
beaglebone-black | arm | lab-cip | gcc-10 | omap2plus_defconfig | 1

Details: https://kernelci.org/test/plan/id/62eaa1636e46ef9af6daf05d

Results: 4 PASS, 1 FAIL, 2 SKIP
Full config: omap2plus_defconfig
Compiler: gcc-10 (arm-linux-gnueabihf-gcc (Debian 10.2.1-6) 10.2.1 20210110)
Plain log: https://storage.kernelci.org//cip-gitlab/ci-pavel-linux-test/v4.4-st20-74-gc99f2b257bde3/arm/omap2plus_defconfig/gcc-10/lab-cip/baseline-beaglebone-black.txt
HTML log: https://storage.kernelci.org//cip-gitlab/ci-pavel-linux-test/v4.4-st20-74-gc99f2b257bde3/arm/omap2plus_defconfig/gcc-10/lab-cip/baseline-beaglebone-black.html
Rootfs: http://storage.kernelci.org/images/rootfs/buildroot/buildroot-baseline/20220718.0/armel/rootfs.cpio.gz


* baseline.dmesg.crit: https://kernelci.org/test/case/id/62eaa1636e46ef9af6daf064
failing since 0 day (last pass: v5.10.131-cip13, first fail: v4.4.302-cip70-rt40)
1 lines

2022-08-03T16:24:48.373875 / #
2022-08-03T16:24:48.383978
2022-08-03T16:24:48.490473 / # #
2022-08-03T16:24:48.498588 #
2022-08-03T16:24:48.600950 / # export SHELL=/bin/sh
2022-08-03T16:24:48.609853 export SHELL=/bin/sh
2022-08-03T16:24:48.711779 / # . /lava-720574/environment
2022-08-03T16:24:48.718360 . /lava-720574/environment
2022-08-03T16:24:48.822566 / # /lava-720574/bin/lava-test-runner /lava-720574/0
2022-08-03T16:24:48.830463 /lava-720574/bin/lava-test-runner /lava-720574/0
... (9 line(s) more)



platform | arch | lab | compiler | defconfig | regressions
---------------------------+--------+---------------+----------+------------------------------+------------
odroid-xu3 | arm | lab-collabora | gcc-10 | exynos_defconfig | 1

Details: https://kernelci.org/test/plan/id/62eaae84e553e5fd6bdaf07c

Results: 4 PASS, 1 FAIL, 2 SKIP
Full config: exynos_defconfig
Compiler: gcc-10 (arm-linux-gnueabihf-gcc (Debian 10.2.1-6) 10.2.1 20210110)
Plain log: https://storage.kernelci.org//cip-gitlab/ci-pavel-linux-test/v4.4-st20-74-gc99f2b257bde3/arm/exynos_defconfig/gcc-10/lab-collabora/baseline-odroid-xu3.txt
HTML log: https://storage.kernelci.org//cip-gitlab/ci-pavel-linux-test/v4.4-st20-74-gc99f2b257bde3/arm/exynos_defconfig/gcc-10/lab-collabora/baseline-odroid-xu3.html
Rootfs: http://storage.kernelci.org/images/rootfs/buildroot/buildroot-baseline/20220718.0/armel/rootfs.cpio.gz


* baseline.bootrr.all-cpus-are-online: https://kernelci.org/test/case/id/62eaae84e553e5fd6bdaf080
failing since 0 day (last pass: v5.10.131-cip13-24-ga6f4ea41fe167, first fail: v4.4.302-cip70-rt40)

2022-08-03T17:20:53.869271 /lava-6962768/1/../bin/lava-test-case
2022-08-03T17:20:53.885278 [ 16.005382] <LAVA_SIGNAL_TESTCASE TEST_CASE_ID=all-cpus-are-online RESULT=fail>



platform | arch | lab | compiler | defconfig | regressions
---------------------------+--------+---------------+----------+------------------------------+------------
qemu_arm-virt-gicv2 | arm | lab-baylibre | gcc-10 | multi_v7_defconfig | 1

Details: https://kernelci.org/test/plan/id/62eaa1b625ffbf4b9cdaf087

Results: 0 PASS, 1 FAIL, 0 SKIP
Full config: multi_v7_defconfig
Compiler: gcc-10 (arm-linux-gnueabihf-gcc (Debian 10.2.1-6) 10.2.1 20210110)
Plain log: https://storage.kernelci.org//cip-gitlab/ci-pavel-linux-test/v4.4-st20-74-gc99f2b257bde3/arm/multi_v7_defconfig/gcc-10/lab-baylibre/baseline-qemu_arm-virt-gicv2.txt
HTML log: https://storage.kernelci.org//cip-gitlab/ci-pavel-linux-test/v4.4-st20-74-gc99f2b257bde3/arm/multi_v7_defconfig/gcc-10/lab-baylibre/baseline-qemu_arm-virt-gicv2.html
Rootfs: http://storage.kernelci.org/images/rootfs/buildroot/buildroot-baseline/20220718.0/armel/rootfs.cpio.gz


* baseline.login: https://kernelci.org/test/case/id/62eaa1b625ffbf4b9cdaf088
failing since 0 day (last pass: v5.10.131-cip13-24-ga6f4ea41fe167, first fail: v4.4.302-cip70-rt40)



platform | arch | lab | compiler | defconfig | regressions
---------------------------+--------+---------------+----------+------------------------------+------------
qemu_arm-virt-gicv2 | arm | lab-broonie | gcc-10 | multi_v7_defconfig | 1

Details: https://kernelci.org/test/plan/id/62eaa1e325ffbf4b9cdaf0c0

Results: 0 PASS, 1 FAIL, 0 SKIP
Full config: multi_v7_defconfig
Compiler: gcc-10 (arm-linux-gnueabihf-gcc (Debian 10.2.1-6) 10.2.1 20210110)
Plain log: https://storage.kernelci.org//cip-gitlab/ci-pavel-linux-test/v4.4-st20-74-gc99f2b257bde3/arm/multi_v7_defconfig/gcc-10/lab-broonie/baseline-qemu_arm-virt-gicv2.txt
HTML log: https://storage.kernelci.org//cip-gitlab/ci-pavel-linux-test/v4.4-st20-74-gc99f2b257bde3/arm/multi_v7_defconfig/gcc-10/lab-broonie/baseline-qemu_arm-virt-gicv2.html
Rootfs: http://storage.kernelci.org/images/rootfs/buildroot/buildroot-baseline/20220718.0/armel/rootfs.cpio.gz


* baseline.login: https://kernelci.org/test/case/id/62eaa1e325ffbf4b9cdaf0c1
failing since 0 day (last pass: v5.10.131-cip13-24-ga6f4ea41fe167, first fail: v4.4.302-cip70-rt40)



platform | arch | lab | compiler | defconfig | regressions
---------------------------+--------+---------------+----------+------------------------------+------------
qemu_arm-virt-gicv2-uefi | arm | lab-baylibre | gcc-10 | multi_v7_defconfig | 1

Details: https://kernelci.org/test/plan/id/62eaa280220107e79fdaf0b0

Results: 0 PASS, 1 FAIL, 0 SKIP
Full config: multi_v7_defconfig
Compiler: gcc-10 (arm-linux-gnueabihf-gcc (Debian 10.2.1-6) 10.2.1 20210110)
Plain log: https://storage.kernelci.org//cip-gitlab/ci-pavel-linux-test/v4.4-st20-74-gc99f2b257bde3/arm/multi_v7_defconfig/gcc-10/lab-baylibre/baseline-qemu_arm-virt-gicv2-uefi.txt
HTML log: https://storage.kernelci.org//cip-gitlab/ci-pavel-linux-test/v4.4-st20-74-gc99f2b257bde3/arm/multi_v7_defconfig/gcc-10/lab-baylibre/baseline-qemu_arm-virt-gicv2-uefi.html
Rootfs: http://storage.kernelci.org/images/rootfs/buildroot/buildroot-baseline/20220718.0/armel/rootfs.cpio.gz


* baseline.login: https://kernelci.org/test/case/id/62eaa280220107e79fdaf0b1
failing since 0 day (last pass: v5.10.131-cip13-24-ga6f4ea41fe167, first fail: v4.4.302-cip70-rt40)



platform | arch | lab | compiler | defconfig | regressions
---------------------------+--------+---------------+----------+------------------------------+------------
qemu_arm-virt-gicv2-uefi | arm | lab-broonie | gcc-10 | multi_v7_defconfig | 1

Details: https://kernelci.org/test/plan/id/62eaa30fb0643174eedaf187

Results: 0 PASS, 1 FAIL, 0 SKIP
Full config: multi_v7_defconfig
Compiler: gcc-10 (arm-linux-gnueabihf-gcc (Debian 10.2.1-6) 10.2.1 20210110)
Plain log: https://storage.kernelci.org//cip-gitlab/ci-pavel-linux-test/v4.4-st20-74-gc99f2b257bde3/arm/multi_v7_defconfig/gcc-10/lab-broonie/baseline-qemu_arm-virt-gicv2-uefi.txt
HTML log: https://storage.kernelci.org//cip-gitlab/ci-pavel-linux-test/v4.4-st20-74-gc99f2b257bde3/arm/multi_v7_defconfig/gcc-10/lab-broonie/baseline-qemu_arm-virt-gicv2-uefi.html
Rootfs: http://storage.kernelci.org/images/rootfs/buildroot/buildroot-baseline/20220718.0/armel/rootfs.cpio.gz


* baseline.login: https://kernelci.org/test/case/id/62eaa30fb0643174eedaf188
failing since 0 day (last pass: v5.10.131-cip13-24-ga6f4ea41fe167, first fail: v4.4.302-cip70-rt40)



platform | arch | lab | compiler | defconfig | regressions
---------------------------+--------+---------------+----------+------------------------------+------------
qemu_arm-virt-gicv3 | arm | lab-baylibre | gcc-10 | multi_v7_defconfig | 1

Details: https://kernelci.org/test/plan/id/62eaa1b7502f5c46dfdaf090

Results: 0 PASS, 1 FAIL, 0 SKIP
Full config: multi_v7_defconfig
Compiler: gcc-10 (arm-linux-gnueabihf-gcc (Debian 10.2.1-6) 10.2.1 20210110)
Plain log: https://storage.kernelci.org//cip-gitlab/ci-pavel-linux-test/v4.4-st20-74-gc99f2b257bde3/arm/multi_v7_defconfig/gcc-10/lab-baylibre/baseline-qemu_arm-virt-gicv3.txt
HTML log: https://storage.kernelci.org//cip-gitlab/ci-pavel-linux-test/v4.4-st20-74-gc99f2b257bde3/arm/multi_v7_defconfig/gcc-10/lab-baylibre/baseline-qemu_arm-virt-gicv3.html
Rootfs: http://storage.kernelci.org/images/rootfs/buildroot/buildroot-baseline/20220718.0/armel/rootfs.cpio.gz


* baseline.login: https://kernelci.org/test/case/id/62eaa1b7502f5c46dfdaf091
failing since 0 day (last pass: v5.10.131-cip13-24-ga6f4ea41fe167, first fail: v4.4.302-cip70-rt40)



platform | arch | lab | compiler | defconfig | regressions
---------------------------+--------+---------------+----------+------------------------------+------------
qemu_arm-virt-gicv3 | arm | lab-broonie | gcc-10 | multi_v7_defconfig | 1

Details: https://kernelci.org/test/plan/id/62eaa20b0eb19840acdaf063

Results: 0 PASS, 1 FAIL, 0 SKIP
Full config: multi_v7_defconfig
Compiler: gcc-10 (arm-linux-gnueabihf-gcc (Debian 10.2.1-6) 10.2.1 20210110)
Plain log: https://storage.kernelci.org//cip-gitlab/ci-pavel-linux-test/v4.4-st20-74-gc99f2b257bde3/arm/multi_v7_defconfig/gcc-10/lab-broonie/baseline-qemu_arm-virt-gicv3.txt
HTML log: https://storage.kernelci.org//cip-gitlab/ci-pavel-linux-test/v4.4-st20-74-gc99f2b257bde3/arm/multi_v7_defconfig/gcc-10/lab-broonie/baseline-qemu_arm-virt-gicv3.html
Rootfs: http://storage.kernelci.org/images/rootfs/buildroot/buildroot-baseline/20220718.0/armel/rootfs.cpio.gz


* baseline.login: https://kernelci.org/test/case/id/62eaa20b0eb19840acdaf064
failing since 0 day (last pass: v5.10.131-cip13-24-ga6f4ea41fe167, first fail: v4.4.302-cip70-rt40)



platform | arch | lab | compiler | defconfig | regressions
---------------------------+--------+---------------+----------+------------------------------+------------
qemu_arm-virt-gicv3-uefi | arm | lab-baylibre | gcc-10 | multi_v7_defconfig | 1

Details: https://kernelci.org/test/plan/id/62eaa27f220107e79fdaf0ad

Results: 0 PASS, 1 FAIL, 0 SKIP
Full config: multi_v7_defconfig
Compiler: gcc-10 (arm-linux-gnueabihf-gcc (Debian 10.2.1-6) 10.2.1 20210110)
Plain log: https://storage.kernelci.org//cip-gitlab/ci-pavel-linux-test/v4.4-st20-74-gc99f2b257bde3/arm/multi_v7_defconfig/gcc-10/lab-baylibre/baseline-qemu_arm-virt-gicv3-uefi.txt
HTML log: https://storage.kernelci.org//cip-gitlab/ci-pavel-linux-test/v4.4-st20-74-gc99f2b257bde3/arm/multi_v7_defconfig/gcc-10/lab-baylibre/baseline-qemu_arm-virt-gicv3-uefi.html
Rootfs: http://storage.kernelci.org/images/rootfs/buildroot/buildroot-baseline/20220718.0/armel/rootfs.cpio.gz


* baseline.login: https://kernelci.org/test/case/id/62eaa27f220107e79fdaf0ae
failing since 0 day (last pass: v5.10.131-cip13-24-ga6f4ea41fe167, first fail: v4.4.302-cip70-rt40)



platform | arch | lab | compiler | defconfig | regressions
---------------------------+--------+---------------+----------+------------------------------+------------
qemu_arm-virt-gicv3-uefi | arm | lab-broonie | gcc-10 | multi_v7_defconfig | 1

Details: https://kernelci.org/test/plan/id/62eaa2bfb6bb667221daf1c7

Results: 0 PASS, 1 FAIL, 0 SKIP
Full config: multi_v7_defconfig
Compiler: gcc-10 (arm-linux-gnueabihf-gcc (Debian 10.2.1-6) 10.2.1 20210110)
Plain log: https://storage.kernelci.org//cip-gitlab/ci-pavel-linux-test/v4.4-st20-74-gc99f2b257bde3/arm/multi_v7_defconfig/gcc-10/lab-broonie/baseline-qemu_arm-virt-gicv3-uefi.txt
HTML log: https://storage.kernelci.org//cip-gitlab/ci-pavel-linux-test/v4.4-st20-74-gc99f2b257bde3/arm/multi_v7_defconfig/gcc-10/lab-broonie/baseline-qemu_arm-virt-gicv3-uefi.html
Rootfs: http://storage.kernelci.org/images/rootfs/buildroot/buildroot-baseline/20220718.0/armel/rootfs.cpio.gz


* baseline.login: https://kernelci.org/test/case/id/62eaa2bfb6bb667221daf1c8
failing since 0 day (last pass: v5.10.131-cip13-24-ga6f4ea41fe167, first fail: v4.4.302-cip70-rt40)



platform | arch | lab | compiler | defconfig | regressions
---------------------------+--------+---------------+----------+------------------------------+------------
qemu_arm64-virt-gicv2 | arm64 | lab-broonie | gcc-10 | defconfig+arm64-chromebook | 1

Details: https://kernelci.org/test/plan/id/62eaa0f5fa740ee51ddaf092

Results: 0 PASS, 1 FAIL, 0 SKIP
Full config: defconfig+arm64-chromebook
Compiler: gcc-10 (aarch64-linux-gnu-gcc (Debian 10.2.1-6) 10.2.1 20210110)
Plain log: https://storage.kernelci.org//cip-gitlab/ci-pavel-linux-test/v4.4-st20-74-gc99f2b257bde3/arm64/defconfig+arm64-chromebook/gcc-10/lab-broonie/baseline-qemu_arm64-virt-gicv2.txt
HTML log: https://storage.kernelci.org//cip-gitlab/ci-pavel-linux-test/v4.4-st20-74-gc99f2b257bde3/arm64/defconfig+arm64-chromebook/gcc-10/lab-broonie/baseline-qemu_arm64-virt-gicv2.html
Rootfs: http://storage.kernelci.org/images/rootfs/buildroot/buildroot-baseline/20220718.0/arm64/rootfs.cpio.gz


* baseline.login: https://kernelci.org/test/case/id/62eaa0f5fa740ee51ddaf093
failing since 85 days (last pass: v4.19.233-516-ge5e741fbfc87, first fail: v5.10.109-cip5-384-g722204542e8a)



platform | arch | lab | compiler | defconfig | regressions
---------------------------+--------+---------------+----------+------------------------------+------------
qemu_arm64-virt-gicv2-uefi | arm64 | lab-broonie | gcc-10 | defconfig+arm64-chromebook | 1

Details: https://kernelci.org/test/plan/id/62eaa0f3fa740ee51ddaf08c

Results: 0 PASS, 1 FAIL, 0 SKIP
Full config: defconfig+arm64-chromebook
Compiler: gcc-10 (aarch64-linux-gnu-gcc (Debian 10.2.1-6) 10.2.1 20210110)
Plain log: https://storage.kernelci.org//cip-gitlab/ci-pavel-linux-test/v4.4-st20-74-gc99f2b257bde3/arm64/defconfig+arm64-chromebook/gcc-10/lab-broonie/baseline-qemu_arm64-virt-gicv2-uefi.txt
HTML log: https://storage.kernelci.org//cip-gitlab/ci-pavel-linux-test/v4.4-st20-74-gc99f2b257bde3/arm64/defconfig+arm64-chromebook/gcc-10/lab-broonie/baseline-qemu_arm64-virt-gicv2-uefi.html
Rootfs: http://storage.kernelci.org/images/rootfs/buildroot/buildroot-baseline/20220718.0/arm64/rootfs.cpio.gz


* baseline.login: https://kernelci.org/test/case/id/62eaa0f3fa740ee51ddaf08d
failing since 85 days (last pass: v4.19.233-516-ge5e741fbfc87, first fail: v5.10.109-cip5-384-g722204542e8a)



platform | arch | lab | compiler | defconfig | regressions
---------------------------+--------+---------------+----------+------------------------------+------------
qemu_arm64-virt-gicv3 | arm64 | lab-broonie | gcc-10 | defconfig+arm64-chromebook | 1

Details: https://kernelci.org/test/plan/id/62eaa0f6fa740ee51ddaf095

Results: 0 PASS, 1 FAIL, 0 SKIP
Full config: defconfig+arm64-chromebook
Compiler: gcc-10 (aarch64-linux-gnu-gcc (Debian 10.2.1-6) 10.2.1 20210110)
Plain log: https://storage.kernelci.org//cip-gitlab/ci-pavel-linux-test/v4.4-st20-74-gc99f2b257bde3/arm64/defconfig+arm64-chromebook/gcc-10/lab-broonie/baseline-qemu_arm64-virt-gicv3.txt
HTML log: https://storage.kernelci.org//cip-gitlab/ci-pavel-linux-test/v4.4-st20-74-gc99f2b257bde3/arm64/defconfig+arm64-chromebook/gcc-10/lab-broonie/baseline-qemu_arm64-virt-gicv3.html
Rootfs: http://storage.kernelci.org/images/rootfs/buildroot/buildroot-baseline/20220718.0/arm64/rootfs.cpio.gz


* baseline.login: https://kernelci.org/test/case/id/62eaa0f6fa740ee51ddaf096
failing since 85 days (last pass: v4.19.233-516-ge5e741fbfc87, first fail: v5.10.109-cip5-384-g722204542e8a)



platform | arch | lab | compiler | defconfig | regressions
---------------------------+--------+---------------+----------+------------------------------+------------
qemu_arm64-virt-gicv3-uefi | arm64 | lab-broonie | gcc-10 | defconfig+arm64-chromebook | 1

Details: https://kernelci.org/test/plan/id/62eaa0f4fa740ee51ddaf08f

Results: 0 PASS, 1 FAIL, 0 SKIP
Full config: defconfig+arm64-chromebook
Compiler: gcc-10 (aarch64-linux-gnu-gcc (Debian 10.2.1-6) 10.2.1 20210110)
Plain log: https://storage.kernelci.org//cip-gitlab/ci-pavel-linux-test/v4.4-st20-74-gc99f2b257bde3/arm64/defconfig+arm64-chromebook/gcc-10/lab-broonie/baseline-qemu_arm64-virt-gicv3-uefi.txt
HTML log: https://storage.kernelci.org//cip-gitlab/ci-pavel-linux-test/v4.4-st20-74-gc99f2b257bde3/arm64/defconfig+arm64-chromebook/gcc-10/lab-broonie/baseline-qemu_arm64-virt-gicv3-uefi.html
Rootfs: http://storage.kernelci.org/images/rootfs/buildroot/buildroot-baseline/20220718.0/arm64/rootfs.cpio.gz


* baseline.login: https://kernelci.org/test/case/id/62eaa0f4fa740ee51ddaf090
failing since 85 days (last pass: v4.19.233-516-ge5e741fbfc87, first fail: v5.10.109-cip5-384-g722204542e8a)



platform | arch | lab | compiler | defconfig | regressions
---------------------------+--------+---------------+----------+------------------------------+------------
qemu_x86_64-uefi-mixed | x86_64 | lab-baylibre | gcc-10 | x86_64_defconfig | 1

Details: https://kernelci.org/test/plan/id/62eaa22ebc6c2cbd65daf056

Results: 0 PASS, 1 FAIL, 0 SKIP
Full config: x86_64_defconfig
Compiler: gcc-10 (gcc (Debian 10.2.1-6) 10.2.1 20210110)
Plain log: https://storage.kernelci.org//cip-gitlab/ci-pavel-linux-test/v4.4-st20-74-gc99f2b257bde3/x86_64/x86_64_defconfig/gcc-10/lab-baylibre/baseline-qemu_x86_64-uefi-mixed.txt
HTML log: https://storage.kernelci.org//cip-gitlab/ci-pavel-linux-test/v4.4-st20-74-gc99f2b257bde3/x86_64/x86_64_defconfig/gcc-10/lab-baylibre/baseline-qemu_x86_64-uefi-mixed.html
Rootfs: http://storage.kernelci.org/images/rootfs/buildroot/buildroot-baseline/20220718.0/x86/rootfs.cpio.gz


* baseline.login: https://kernelci.org/test/case/id/62eaa22ebc6c2cbd65daf057
new failure (last pass: v5.10.131-cip13-24-ga6f4ea41fe167)



platform | arch | lab | compiler | defconfig | regressions
---------------------------+--------+---------------+----------+------------------------------+------------
qemu_x86_64-uefi-mixed | x86_64 | lab-baylibre | gcc-10 | x86_64_defcon...6-chromebook | 1

Details: https://kernelci.org/test/plan/id/62eaa26b0ba6c0e932daf063

Results: 0 PASS, 1 FAIL, 0 SKIP
Full config: x86_64_defconfig+x86-chromebook
Compiler: gcc-10 (gcc (Debian 10.2.1-6) 10.2.1 20210110)
Plain log: https://storage.kernelci.org//cip-gitlab/ci-pavel-linux-test/v4.4-st20-74-gc99f2b257bde3/x86_64/x86_64_defconfig+x86-chromebook/gcc-10/lab-baylibre/baseline-qemu_x86_64-uefi-mixed.txt
HTML log: https://storage.kernelci.org//cip-gitlab/ci-pavel-linux-test/v4.4-st20-74-gc99f2b257bde3/x86_64/x86_64_defconfig+x86-chromebook/gcc-10/lab-baylibre/baseline-qemu_x86_64-uefi-mixed.html
Rootfs: http://storage.kernelci.org/images/rootfs/buildroot/buildroot-baseline/20220718.0/x86/rootfs.cpio.gz


* baseline.login: https://kernelci.org/test/case/id/62eaa26b0ba6c0e932daf064
failing since 0 day (last pass: v5.10.131-cip13-24-ga6f4ea41fe167, first fail: v4.4.302-cip70-rt40)



platform | arch | lab | compiler | defconfig | regressions
---------------------------+--------+---------------+----------+------------------------------+------------
qemu_x86_64-uefi-mixed | x86_64 | lab-broonie | gcc-10 | x86_64_defconfig | 1

Details: https://kernelci.org/test/plan/id/62eaa25bfaecdb8bf6daf065

Results: 0 PASS, 1 FAIL, 0 SKIP
Full config: x86_64_defconfig
Compiler: gcc-10 (gcc (Debian 10.2.1-6) 10.2.1 20210110)
Plain log: https://storage.kernelci.org//cip-gitlab/ci-pavel-linux-test/v4.4-st20-74-gc99f2b257bde3/x86_64/x86_64_defconfig/gcc-10/lab-broonie/baseline-qemu_x86_64-uefi-mixed.txt
HTML log: https://storage.kernelci.org//cip-gitlab/ci-pavel-linux-test/v4.4-st20-74-gc99f2b257bde3/x86_64/x86_64_defconfig/gcc-10/lab-broonie/baseline-qemu_x86_64-uefi-mixed.html
Rootfs: http://storage.kernelci.org/images/rootfs/buildroot/buildroot-baseline/20220718.0/x86/rootfs.cpio.gz


* baseline.login: https://kernelci.org/test/case/id/62eaa25bfaecdb8bf6daf066
new failure (last pass: v5.10.131-cip13-24-ga6f4ea41fe167)



platform | arch | lab | compiler | defconfig | regressions
---------------------------+--------+---------------+----------+------------------------------+------------
qemu_x86_64-uefi-mixed | x86_64 | lab-broonie | gcc-10 | x86_64_defcon...6-chromebook | 1

Details: https://kernelci.org/test/plan/id/62eaa283d8dfb7c421daf06f

Results: 0 PASS, 1 FAIL, 0 SKIP
Full config: x86_64_defconfig+x86-chromebook
Compiler: gcc-10 (gcc (Debian 10.2.1-6) 10.2.1 20210110)
Plain log: https://storage.kernelci.org//cip-gitlab/ci-pavel-linux-test/v4.4-st20-74-gc99f2b257bde3/x86_64/x86_64_defconfig+x86-chromebook/gcc-10/lab-broonie/baseline-qemu_x86_64-uefi-mixed.txt
HTML log: https://storage.kernelci.org//cip-gitlab/ci-pavel-linux-test/v4.4-st20-74-gc99f2b257bde3/x86_64/x86_64_defconfig+x86-chromebook/gcc-10/lab-broonie/baseline-qemu_x86_64-uefi-mixed.html
Rootfs: http://storage.kernelci.org/images/rootfs/buildroot/buildroot-baseline/20220718.0/x86/rootfs.cpio.gz


* baseline.login: https://kernelci.org/test/case/id/62eaa283d8dfb7c421daf070
failing since 0 day (last pass: v5.10.131-cip13-24-ga6f4ea41fe167, first fail: v4.4.302-cip70-rt40)



platform | arch | lab | compiler | defconfig | regressions
---------------------------+--------+---------------+----------+------------------------------+------------
qemu_x86_64-uefi-mixed | x86_64 | lab-collabora | gcc-10 | x86_64_defconfig | 1

Details: https://kernelci.org/test/plan/id/62eaa22011c165293adaf076

Results: 0 PASS, 1 FAIL, 0 SKIP
Full config: x86_64_defconfig
Compiler: gcc-10 (gcc (Debian 10.2.1-6) 10.2.1 20210110)
Plain log: https://storage.kernelci.org//cip-gitlab/ci-pavel-linux-test/v4.4-st20-74-gc99f2b257bde3/x86_64/x86_64_defconfig/gcc-10/lab-collabora/baseline-qemu_x86_64-uefi-mixed.txt
HTML log: https://storage.kernelci.org//cip-gitlab/ci-pavel-linux-test/v4.4-st20-74-gc99f2b257bde3/x86_64/x86_64_defconfig/gcc-10/lab-collabora/baseline-qemu_x86_64-uefi-mixed.html
Rootfs: http://storage.kernelci.org/images/rootfs/buildroot/buildroot-baseline/20220718.0/x86/rootfs.cpio.gz


* baseline.login: https://kernelci.org/test/case/id/62eaa22011c165293adaf077
new failure (last pass: v5.10.131-cip13-24-ga6f4ea41fe167)


cip-gitlab/ci/pavel/linux-test baseline-cip-nfs: 4 runs, 4 regressions (v4.4-st20-74-gc99f2b257bde3) #kernelci

kernelci.org bot <bot@...>
 

cip-gitlab/ci/pavel/linux-test baseline-cip-nfs: 4 runs, 4 regressions (v4.4-st20-74-gc99f2b257bde3)

Regressions Summary
-------------------

platform | arch | lab | compiler | defconfig | regressions
-----------------+------+-------------+----------+---------------------+------------
beaglebone-black | arm | lab-broonie | gcc-10 | multi_v7_defconfig | 1
beaglebone-black | arm | lab-cip | gcc-10 | multi_v7_defconfig | 1
beaglebone-black | arm | lab-broonie | gcc-10 | omap2plus_defconfig | 1
beaglebone-black | arm | lab-cip | gcc-10 | omap2plus_defconfig | 1

Details: https://kernelci.org/test/job/cip-gitlab/branch/ci%2Fpavel%2Flinux-test/kernel/v4.4-st20-74-gc99f2b257bde3/plan/baseline-cip-nfs/

Test: baseline-cip-nfs
Tree: cip-gitlab
Branch: ci/pavel/linux-test
Describe: v4.4-st20-74-gc99f2b257bde3
URL: https://gitlab.com/cip-project/cip-kernel/linux-cip.git
SHA: c99f2b257bde3cd60a833056aab624ad5fab3812


Test Regressions
----------------


platform | arch | lab | compiler | defconfig | regressions
-----------------+------+-------------+----------+---------------------+------------
beaglebone-black | arm | lab-broonie | gcc-10 | multi_v7_defconfig | 1

Details: https://kernelci.org/test/plan/id/62eaa48d426c3a643edaf0c7

Results: 3 PASS, 1 FAIL, 0 SKIP
Full config: multi_v7_defconfig
Compiler: gcc-10 (arm-linux-gnueabihf-gcc (Debian 10.2.1-6) 10.2.1 20210110)
Plain log: https://storage.kernelci.org//cip-gitlab/ci-pavel-linux-test/v4.4-st20-74-gc99f2b257bde3/arm/multi_v7_defconfig/gcc-10/lab-broonie/baseline-cip-nfs-beaglebone-black.txt
HTML log: https://storage.kernelci.org//cip-gitlab/ci-pavel-linux-test/v4.4-st20-74-gc99f2b257bde3/arm/multi_v7_defconfig/gcc-10/lab-broonie/baseline-cip-nfs-beaglebone-black.html
Rootfs: https://storage.kernelci.org/images/rootfs/cip/20211105/qemu-arm/cip-core-image-kernelci-cip-core-buster-qemu-arm-initrd.img.gz


* baseline-cip-nfs.dmesg.crit: https://kernelci.org/test/case/id/62eaa48d426c3a643edaf0cc
failing since 0 day (last pass: v5.10.131-cip13-24-ga6f4ea41fe167, first fail: v4.4.302-cip70-rt40)
1 lines

2022-08-03T16:38:07.347114 / #
2022-08-03T16:38:07.350747
2022-08-03T16:38:12.371544 / # export NFS_ROOTFS='/var/lib/lava/dispatcher/tmp/382134/extract-nfsrootfs-7_f665zj'
2022-08-03T16:38:12.382476 export NFS_ROOTFS='/var/lib/lava/dispatcher/tmp/382134/extract-nfsrootfs-</lib/lava/dispatcher/tmp/382134/extract-nfsrootfs-7 _f665zj'
2022-08-03T16:38:14.675434 / # export NFS_SERVER_IP='192.168.56.123'
2022-08-03T16:38:14.686106 export NFS_SERVER_IP='192.168.56.123'
2022-08-03T16:38:14.796450 / # #
2022-08-03T16:38:14.801072 #
2022-08-03T16:38:14.913390 / # export SHELL=/bin/sh
2022-08-03T16:38:14.917387 export SHELL=/bin/sh
... (13 line(s) more)



platform | arch | lab | compiler | defconfig | regressions
-----------------+------+-------------+----------+---------------------+------------
beaglebone-black | arm | lab-cip | gcc-10 | multi_v7_defconfig | 1

Details: https://kernelci.org/test/plan/id/62eaa63becb009a6f3daf075

Results: 3 PASS, 1 FAIL, 0 SKIP
Full config: multi_v7_defconfig
Compiler: gcc-10 (arm-linux-gnueabihf-gcc (Debian 10.2.1-6) 10.2.1 20210110)
Plain log: https://storage.kernelci.org//cip-gitlab/ci-pavel-linux-test/v4.4-st20-74-gc99f2b257bde3/arm/multi_v7_defconfig/gcc-10/lab-cip/baseline-cip-nfs-beaglebone-black.txt
HTML log: https://storage.kernelci.org//cip-gitlab/ci-pavel-linux-test/v4.4-st20-74-gc99f2b257bde3/arm/multi_v7_defconfig/gcc-10/lab-cip/baseline-cip-nfs-beaglebone-black.html
Rootfs: https://storage.kernelci.org/images/rootfs/cip/20211105/qemu-arm/cip-core-image-kernelci-cip-core-buster-qemu-arm-initrd.img.gz


* baseline-cip-nfs.dmesg.crit: https://kernelci.org/test/case/id/62eaa63becb009a6f3daf078
failing since 0 day (last pass: v5.10.131-cip13-24-ga6f4ea41fe167, first fail: v4.4.302-cip70-rt40)
1 lines

2022-08-03T16:45:14.867566 / #
2022-08-03T16:45:14.874580
2022-08-03T16:45:19.890300 / # export NFS_ROOTFS='/var/lib/lava/dispatcher/tmp/720591/extract-nfsrootfs-v85ag0xx'
2022-08-03T16:45:19.901074 export NFS_ROOTFS='/var/lib/lava/dispatcher/tmp/720591/extract-nfsrootfs-</lib/lava/dispatcher/tmp/720591/extract-nfsrootfs-v 85ag0xx'
2022-08-03T16:45:21.957583 / # export NFS_SERVER_IP='172.16.3.3'
2022-08-03T16:45:21.968427 export NFS_SERVER_IP='172.16.3.3'
2022-08-03T16:45:22.079654 / # #
2022-08-03T16:45:22.086391 #
2022-08-03T16:45:22.197366 / # export SHELL=/bin/sh
2022-08-03T16:45:22.203599 export SHELL=/bin/sh
... (13 line(s) more)



platform | arch | lab | compiler | defconfig | regressions
-----------------+------+-------------+----------+---------------------+------------
beaglebone-black | arm | lab-broonie | gcc-10 | omap2plus_defconfig | 1

Details: https://kernelci.org/test/plan/id/62eaa3ebe30a6cbed9daf06e

Results: 0 PASS, 1 FAIL, 0 SKIP
Full config: omap2plus_defconfig
Compiler: gcc-10 (arm-linux-gnueabihf-gcc (Debian 10.2.1-6) 10.2.1 20210110)
Plain log: https://storage.kernelci.org//cip-gitlab/ci-pavel-linux-test/v4.4-st20-74-gc99f2b257bde3/arm/omap2plus_defconfig/gcc-10/lab-broonie/baseline-cip-nfs-beaglebone-black.txt
HTML log: https://storage.kernelci.org//cip-gitlab/ci-pavel-linux-test/v4.4-st20-74-gc99f2b257bde3/arm/omap2plus_defconfig/gcc-10/lab-broonie/baseline-cip-nfs-beaglebone-black.html
Rootfs: https://storage.kernelci.org/images/rootfs/cip/20211105/qemu-arm/cip-core-image-kernelci-cip-core-buster-qemu-arm-initrd.img.gz


* baseline-cip-nfs.login: https://kernelci.org/test/case/id/62eaa3ebe30a6cbed9daf06f
new failure (last pass: v5.10.131-cip13)



platform | arch | lab | compiler | defconfig | regressions
-----------------+------+-------------+----------+---------------------+------------
beaglebone-black | arm | lab-cip | gcc-10 | omap2plus_defconfig | 1

Details: https://kernelci.org/test/plan/id/62eaa1b3d6f280e03ddaf07d

Results: 3 PASS, 1 FAIL, 0 SKIP
Full config: omap2plus_defconfig
Compiler: gcc-10 (arm-linux-gnueabihf-gcc (Debian 10.2.1-6) 10.2.1 20210110)
Plain log: https://storage.kernelci.org//cip-gitlab/ci-pavel-linux-test/v4.4-st20-74-gc99f2b257bde3/arm/omap2plus_defconfig/gcc-10/lab-cip/baseline-cip-nfs-beaglebone-black.txt
HTML log: https://storage.kernelci.org//cip-gitlab/ci-pavel-linux-test/v4.4-st20-74-gc99f2b257bde3/arm/omap2plus_defconfig/gcc-10/lab-cip/baseline-cip-nfs-beaglebone-black.html
Rootfs: https://storage.kernelci.org/images/rootfs/cip/20211105/qemu-arm/cip-core-image-kernelci-cip-core-buster-qemu-arm-initrd.img.gz


* baseline-cip-nfs.dmesg.crit: https://kernelci.org/test/case/id/62eaa1b3d6f280e03ddaf080
failing since 0 day (last pass: v5.10.131-cip13, first fail: v4.4.302-cip70-rt40)
1 lines

2022-08-03T16:26:00.233722 / #
2022-08-03T16:26:00.243555
2022-08-03T16:26:05.300461 / # export NFS_ROOTFS='/var/lib/lava/dispatcher/tmp/720576/extract-nfsrootfs-d7f6zfor'
2022-08-03T16:26:05.311587 export NFS_ROOTFS='/var/lib/lava/dispatcher/tmp/720576/extract-nfsrootfs-</lib/lava/dispatcher/tmp/720576/extract-nfsrootfs-d 7f6zfor'
2022-08-03T16:26:07.424601 / # export NFS_SERVER_IP='172.16.3.3'
2022-08-03T16:26:07.435124 export NFS_SERVER_IP='172.16.3.3'
2022-08-03T16:26:07.595615 / # #
2022-08-03T16:26:07.602726 #
2022-08-03T16:26:07.737399 / # export SHELL=/bin/sh
2022-08-03T16:26:07.744021 export SHELL=/bin/sh
... (13 line(s) more)


cip/linux-5.10.y-cip build: 164 builds: 3 failed, 161 passed, 4 errors, 10 warnings (v5.10.131-cip13-24-ga6f4ea41fe167) #kernelci

kernelci.org bot <bot@...>
 

cip/linux-5.10.y-cip build: 164 builds: 3 failed, 161 passed, 4 errors, 10 warnings (v5.10.131-cip13-24-ga6f4ea41fe167)

Full Build Summary: https://kernelci.org/build/cip/branch/linux-5.10.y-cip/kernel/v5.10.131-cip13-24-ga6f4ea41fe167/

Tree: cip
Branch: linux-5.10.y-cip
Git Describe: v5.10.131-cip13-24-ga6f4ea41fe167
Git Commit: a6f4ea41fe167f956d4000eaf276a1e383603071
Git URL: https://git.kernel.org/pub/scm/linux/kernel/git/cip/linux-cip.git
Built: 7 unique architectures

Build Failures Detected:

arm:
rpc_defconfig: (gcc-10) FAIL

mips:
ip27_defconfig: (gcc-10) FAIL
ip28_defconfig: (gcc-10) FAIL

Errors and Warnings Detected:

arc:

arm64:

arm:
rpc_defconfig (gcc-10): 4 errors

i386:

mips:
32r2el_defconfig (gcc-10): 1 warning
decstation_64_defconfig (gcc-10): 1 warning
decstation_defconfig (gcc-10): 1 warning
decstation_r4k_defconfig (gcc-10): 1 warning
lemote2f_defconfig (gcc-10): 1 warning
rm200_defconfig (gcc-10): 1 warning

riscv:
rv32_defconfig (gcc-10): 4 warnings

x86_64:

Errors summary:

2 arm-linux-gnueabihf-gcc: error: unrecognized -march target: armv3m
2 arm-linux-gnueabihf-gcc: error: missing argument to ‘-march=’

Warnings summary:

3 kernel/rcu/tasks.h:710:13: warning: ‘show_rcu_tasks_rude_gp_kthread’ defined but not used [-Wunused-function]
2 <stdin>:830:2: warning: #warning syscall fstat64 not implemented [-Wcpp]
2 <stdin>:1127:2: warning: #warning syscall fstatat64 not implemented [-Wcpp]
1 net/mac80211/mlme.c:4349:1: warning: the frame size of 1040 bytes is larger than 1024 bytes [-Wframe-larger-than=]
1 drivers/block/paride/bpck.c:32: warning: "PC" redefined
1 WARNING: modpost: Symbol info of vmlinux is missing. Unresolved symbol check will be entirely skipped.

Section mismatches summary:

1 WARNING: modpost: vmlinux.o(___ksymtab_gpl+ixp4xx_irq_init+0x0): Section mismatch in reference from the variable __ksymtab_ixp4xx_irq_init to the function .init.text:ixp4xx_irq_init()
1 WARNING: modpost: vmlinux.o(___ksymtab+prom_init_numa_memory+0x0): Section mismatch in reference from the variable __ksymtab_prom_init_numa_memory to the function .init.text:prom_init_numa_memory()

================================================================================

Detailed per-defconfig build reports:

--------------------------------------------------------------------------------
32r2el_defconfig (mips, gcc-10) — PASS, 0 errors, 1 warning, 0 section mismatches

Warnings:
WARNING: modpost: Symbol info of vmlinux is missing. Unresolved symbol check will be entirely skipped.

--------------------------------------------------------------------------------
allnoconfig (x86_64, gcc-10) — PASS, 0 errors, 0 warnings, 0 section mismatches

--------------------------------------------------------------------------------
allnoconfig (i386, gcc-10) — PASS, 0 errors, 0 warnings, 0 section mismatches

--------------------------------------------------------------------------------
allnoconfig (arc, gcc-10) — PASS, 0 errors, 0 warnings, 0 section mismatches

--------------------------------------------------------------------------------
am200epdkit_defconfig (arm, gcc-10) — PASS, 0 errors, 0 warnings, 0 section mismatches

--------------------------------------------------------------------------------
ar7_defconfig (mips, gcc-10) — PASS, 0 errors, 0 warnings, 0 section mismatches

--------------------------------------------------------------------------------
aspeed_g4_defconfig (arm, gcc-10) — PASS, 0 errors, 0 warnings, 0 section mismatches

--------------------------------------------------------------------------------
aspeed_g5_defconfig (arm, gcc-10) — PASS, 0 errors, 0 warnings, 0 section mismatches

--------------------------------------------------------------------------------
assabet_defconfig (arm, gcc-10) — PASS, 0 errors, 0 warnings, 0 section mismatches

--------------------------------------------------------------------------------
ath79_defconfig (mips, gcc-10) — PASS, 0 errors, 0 warnings, 0 section mismatches

--------------------------------------------------------------------------------
axm55xx_defconfig (arm, gcc-10) — PASS, 0 errors, 0 warnings, 0 section mismatches

--------------------------------------------------------------------------------
axs103_defconfig (arc, gcc-10) — PASS, 0 errors, 0 warnings, 0 section mismatches

--------------------------------------------------------------------------------
axs103_smp_defconfig (arc, gcc-10) — PASS, 0 errors, 0 warnings, 0 section mismatches

--------------------------------------------------------------------------------
badge4_defconfig (arm, gcc-10) — PASS, 0 errors, 0 warnings, 0 section mismatches

--------------------------------------------------------------------------------
bcm2835_defconfig (arm, gcc-10) — PASS, 0 errors, 0 warnings, 0 section mismatches

--------------------------------------------------------------------------------
bcm63xx_defconfig (mips, gcc-10) — PASS, 0 errors, 0 warnings, 0 section mismatches

--------------------------------------------------------------------------------
bigsur_defconfig (mips, gcc-10) — PASS, 0 errors, 0 warnings, 0 section mismatches

--------------------------------------------------------------------------------
bmips_be_defconfig (mips, gcc-10) — PASS, 0 errors, 0 warnings, 0 section mismatches

--------------------------------------------------------------------------------
bmips_stb_defconfig (mips, gcc-10) — PASS, 0 errors, 0 warnings, 0 section mismatches

--------------------------------------------------------------------------------
cavium_octeon_defconfig (mips, gcc-10) — PASS, 0 errors, 0 warnings, 0 section mismatches

--------------------------------------------------------------------------------
cerfcube_defconfig (arm, gcc-10) — PASS, 0 errors, 0 warnings, 0 section mismatches

--------------------------------------------------------------------------------
ci20_defconfig (mips, gcc-10) — PASS, 0 errors, 0 warnings, 0 section mismatches

--------------------------------------------------------------------------------
cm_x300_defconfig (arm, gcc-10) — PASS, 0 errors, 0 warnings, 0 section mismatches

--------------------------------------------------------------------------------
cobalt_defconfig (mips, gcc-10) — PASS, 0 errors, 0 warnings, 0 section mismatches

--------------------------------------------------------------------------------
colibri_pxa270_defconfig (arm, gcc-10) — PASS, 0 errors, 0 warnings, 0 section mismatches

--------------------------------------------------------------------------------
colibri_pxa300_defconfig (arm, gcc-10) — PASS, 0 errors, 0 warnings, 0 section mismatches

--------------------------------------------------------------------------------
collie_defconfig (arm, gcc-10) — PASS, 0 errors, 0 warnings, 0 section mismatches

--------------------------------------------------------------------------------
corgi_defconfig (arm, gcc-10) — PASS, 0 errors, 0 warnings, 0 section mismatches

--------------------------------------------------------------------------------
cu1000-neo_defconfig (mips, gcc-10) — PASS, 0 errors, 0 warnings, 0 section mismatches

--------------------------------------------------------------------------------
davinci_all_defconfig (arm, gcc-10) — PASS, 0 errors, 0 warnings, 0 section mismatches

--------------------------------------------------------------------------------
decstation_64_defconfig (mips, gcc-10) — PASS, 0 errors, 1 warning, 0 section mismatches

Warnings:
kernel/rcu/tasks.h:710:13: warning: ‘show_rcu_tasks_rude_gp_kthread’ defined but not used [-Wunused-function]

--------------------------------------------------------------------------------
decstation_defconfig (mips, gcc-10) — PASS, 0 errors, 1 warning, 0 section mismatches

Warnings:
kernel/rcu/tasks.h:710:13: warning: ‘show_rcu_tasks_rude_gp_kthread’ defined but not used [-Wunused-function]

--------------------------------------------------------------------------------
decstation_r4k_defconfig (mips, gcc-10) — PASS, 0 errors, 1 warning, 0 section mismatches

Warnings:
kernel/rcu/tasks.h:710:13: warning: ‘show_rcu_tasks_rude_gp_kthread’ defined but not used [-Wunused-function]

--------------------------------------------------------------------------------
defconfig (riscv, gcc-10) — PASS, 0 errors, 0 warnings, 0 section mismatches

--------------------------------------------------------------------------------
defconfig (arm64, gcc-10) — PASS, 0 errors, 0 warnings, 0 section mismatches

--------------------------------------------------------------------------------
defconfig+arm64-chromebook (arm64, gcc-10) — PASS, 0 errors, 0 warnings, 0 section mismatches

--------------------------------------------------------------------------------
defconfig+arm64-chromebook+kselftest (arm64, gcc-10) — PASS, 0 errors, 0 warnings, 0 section mismatches

--------------------------------------------------------------------------------
defconfig+kselftest (arm64, gcc-10) — PASS, 0 errors, 0 warnings, 0 section mismatches

--------------------------------------------------------------------------------
e55_defconfig (mips, gcc-10) — PASS, 0 errors, 0 warnings, 0 section mismatches

--------------------------------------------------------------------------------
ebsa110_defconfig (arm, gcc-10) — PASS, 0 errors, 0 warnings, 0 section mismatches

--------------------------------------------------------------------------------
efm32_defconfig (arm, gcc-10) — PASS, 0 errors, 0 warnings, 0 section mismatches

--------------------------------------------------------------------------------
ep93xx_defconfig (arm, gcc-10) — PASS, 0 errors, 0 warnings, 0 section mismatches

--------------------------------------------------------------------------------
eseries_pxa_defconfig (arm, gcc-10) — PASS, 0 errors, 0 warnings, 0 section mismatches

--------------------------------------------------------------------------------
exynos_defconfig (arm, gcc-10) — PASS, 0 errors, 0 warnings, 0 section mismatches

--------------------------------------------------------------------------------
footbridge_defconfig (arm, gcc-10) — PASS, 0 errors, 0 warnings, 0 section mismatches

--------------------------------------------------------------------------------
fuloong2e_defconfig (mips, gcc-10) — PASS, 0 errors, 0 warnings, 0 section mismatches

--------------------------------------------------------------------------------
gcw0_defconfig (mips, gcc-10) — PASS, 0 errors, 0 warnings, 0 section mismatches

--------------------------------------------------------------------------------
gemini_defconfig (arm, gcc-10) — PASS, 0 errors, 0 warnings, 0 section mismatches

--------------------------------------------------------------------------------
gpr_defconfig (mips, gcc-10) — PASS, 0 errors, 0 warnings, 0 section mismatches

--------------------------------------------------------------------------------
h5000_defconfig (arm, gcc-10) — PASS, 0 errors, 0 warnings, 0 section mismatches

--------------------------------------------------------------------------------
hackkit_defconfig (arm, gcc-10) — PASS, 0 errors, 0 warnings, 0 section mismatches

--------------------------------------------------------------------------------
haps_hs_defconfig (arc, gcc-10) — PASS, 0 errors, 0 warnings, 0 section mismatches

--------------------------------------------------------------------------------
haps_hs_smp_defconfig (arc, gcc-10) — PASS, 0 errors, 0 warnings, 0 section mismatches

--------------------------------------------------------------------------------
hisi_defconfig (arm, gcc-10) — PASS, 0 errors, 0 warnings, 0 section mismatches

--------------------------------------------------------------------------------
hsdk_defconfig (arc, gcc-10) — PASS, 0 errors, 0 warnings, 0 section mismatches

--------------------------------------------------------------------------------
i386_defconfig (i386, gcc-10) — PASS, 0 errors, 0 warnings, 0 section mismatches

--------------------------------------------------------------------------------
imote2_defconfig (arm, gcc-10) — PASS, 0 errors, 0 warnings, 0 section mismatches

--------------------------------------------------------------------------------
imx_v4_v5_defconfig (arm, gcc-10) — PASS, 0 errors, 0 warnings, 0 section mismatches

--------------------------------------------------------------------------------
integrator_defconfig (arm, gcc-10) — PASS, 0 errors, 0 warnings, 0 section mismatches

--------------------------------------------------------------------------------
ip22_defconfig (mips, gcc-10) — PASS, 0 errors, 0 warnings, 0 section mismatches

--------------------------------------------------------------------------------
ip27_defconfig (mips, gcc-10) — FAIL, 0 errors, 0 warnings, 0 section mismatches

--------------------------------------------------------------------------------
ip28_defconfig (mips, gcc-10) — FAIL, 0 errors, 0 warnings, 0 section mismatches

--------------------------------------------------------------------------------
ip32_defconfig (mips, gcc-10) — PASS, 0 errors, 0 warnings, 0 section mismatches

--------------------------------------------------------------------------------
ixp4xx_defconfig (arm, gcc-10) — PASS, 0 errors, 0 warnings, 0 section mismatches

Section mismatches:
WARNING: modpost: vmlinux.o(___ksymtab_gpl+ixp4xx_irq_init+0x0): Section mismatch in reference from the variable __ksymtab_ixp4xx_irq_init to the function .init.text:ixp4xx_irq_init()

--------------------------------------------------------------------------------
jazz_defconfig (mips, gcc-10) — PASS, 0 errors, 0 warnings, 0 section mismatches

--------------------------------------------------------------------------------
jmr3927_defconfig (mips, gcc-10) — PASS, 0 errors, 0 warnings, 0 section mismatches

--------------------------------------------------------------------------------
jornada720_defconfig (arm, gcc-10) — PASS, 0 errors, 0 warnings, 0 section mismatches

--------------------------------------------------------------------------------
keystone_defconfig (arm, gcc-10) — PASS, 0 errors, 0 warnings, 0 section mismatches

--------------------------------------------------------------------------------
lart_defconfig (arm, gcc-10) — PASS, 0 errors, 0 warnings, 0 section mismatches

--------------------------------------------------------------------------------
lemote2f_defconfig (mips, gcc-10) — PASS, 0 errors, 1 warning, 0 section mismatches

Warnings:
net/mac80211/mlme.c:4349:1: warning: the frame size of 1040 bytes is larger than 1024 bytes [-Wframe-larger-than=]

--------------------------------------------------------------------------------
loongson1b_defconfig (mips, gcc-10) — PASS, 0 errors, 0 warnings, 0 section mismatches

--------------------------------------------------------------------------------
loongson1c_defconfig (mips, gcc-10) — PASS, 0 errors, 0 warnings, 0 section mismatches

--------------------------------------------------------------------------------
loongson3_defconfig (mips, gcc-10) — PASS, 0 errors, 0 warnings, 0 section mismatches

Section mismatches:
WARNING: modpost: vmlinux.o(___ksymtab+prom_init_numa_memory+0x0): Section mismatch in reference from the variable __ksymtab_prom_init_numa_memory to the function .init.text:prom_init_numa_memory()

--------------------------------------------------------------------------------
lpc18xx_defconfig (arm, gcc-10) — PASS, 0 errors, 0 warnings, 0 section mismatches

--------------------------------------------------------------------------------
lpc32xx_defconfig (arm, gcc-10) — PASS, 0 errors, 0 warnings, 0 section mismatches

--------------------------------------------------------------------------------
lpd270_defconfig (arm, gcc-10) — PASS, 0 errors, 0 warnings, 0 section mismatches

--------------------------------------------------------------------------------
lubbock_defconfig (arm, gcc-10) — PASS, 0 errors, 0 warnings, 0 section mismatches

--------------------------------------------------------------------------------
magician_defconfig (arm, gcc-10) — PASS, 0 errors, 0 warnings, 0 section mismatches

--------------------------------------------------------------------------------
mainstone_defconfig (arm, gcc-10) — PASS, 0 errors, 0 warnings, 0 section mismatches

--------------------------------------------------------------------------------
malta_defconfig (mips, gcc-10) — PASS, 0 errors, 0 warnings, 0 section mismatches

--------------------------------------------------------------------------------
malta_kvm_defconfig (mips, gcc-10) — PASS, 0 errors, 0 warnings, 0 section mismatches

--------------------------------------------------------------------------------
malta_kvm_guest_defconfig (mips, gcc-10) — PASS, 0 errors, 0 warnings, 0 section mismatches

--------------------------------------------------------------------------------
maltaaprp_defconfig (mips, gcc-10) — PASS, 0 errors, 0 warnings, 0 section mismatches

--------------------------------------------------------------------------------
maltasmvp_eva_defconfig (mips, gcc-10) — PASS, 0 errors, 0 warnings, 0 section mismatches

--------------------------------------------------------------------------------
maltaup_xpa_defconfig (mips, gcc-10) — PASS, 0 errors, 0 warnings, 0 section mismatches

--------------------------------------------------------------------------------
mini2440_defconfig (arm, gcc-10) — PASS, 0 errors, 0 warnings, 0 section mismatches

--------------------------------------------------------------------------------
mmp2_defconfig (arm, gcc-10) — PASS, 0 errors, 0 warnings, 0 section mismatches

--------------------------------------------------------------------------------
moxart_defconfig (arm, gcc-10) — PASS, 0 errors, 0 warnings, 0 section mismatches

--------------------------------------------------------------------------------
mpc30x_defconfig (mips, gcc-10) — PASS, 0 errors, 0 warnings, 0 section mismatches

--------------------------------------------------------------------------------
mps2_defconfig (arm, gcc-10) — PASS, 0 errors, 0 warnings, 0 section mismatches

--------------------------------------------------------------------------------
mtx1_defconfig (mips, gcc-10) — PASS, 0 errors, 0 warnings, 0 section mismatches

--------------------------------------------------------------------------------
multi_v4t_defconfig (arm, gcc-10) — PASS, 0 errors, 0 warnings, 0 section mismatches

--------------------------------------------------------------------------------
multi_v5_defconfig (arm, gcc-10) — PASS, 0 errors, 0 warnings, 0 section mismatches

--------------------------------------------------------------------------------
multi_v7_defconfig (arm, gcc-10) — PASS, 0 errors, 0 warnings, 0 section mismatches

--------------------------------------------------------------------------------
multi_v7_defconfig+kselftest (arm, gcc-10) — PASS, 0 errors, 0 warnings, 0 section mismatches

--------------------------------------------------------------------------------
mvebu_v5_defconfig (arm, gcc-10) — PASS, 0 errors, 0 warnings, 0 section mismatches

--------------------------------------------------------------------------------
mvebu_v7_defconfig (arm, gcc-10) — PASS, 0 errors, 0 warnings, 0 section mismatches

--------------------------------------------------------------------------------
mxs_defconfig (arm, gcc-10) — PASS, 0 errors, 0 warnings, 0 section mismatches

--------------------------------------------------------------------------------
neponset_defconfig (arm, gcc-10) — PASS, 0 errors, 0 warnings, 0 section mismatches

--------------------------------------------------------------------------------
nlm_xlp_defconfig (mips, gcc-10) — PASS, 0 errors, 0 warnings, 0 section mismatches

--------------------------------------------------------------------------------
nommu_k210_defconfig (riscv, gcc-10) — PASS, 0 errors, 0 warnings, 0 section mismatches

--------------------------------------------------------------------------------
nsimosci_hs_defconfig (arc, gcc-10) — PASS, 0 errors, 0 warnings, 0 section mismatches

--------------------------------------------------------------------------------
nsimosci_hs_smp_defconfig (arc, gcc-10) — PASS, 0 errors, 0 warnings, 0 section mismatches

--------------------------------------------------------------------------------
omap1_defconfig (arm, gcc-10) — PASS, 0 errors, 0 warnings, 0 section mismatches

--------------------------------------------------------------------------------
omap2plus_defconfig (arm, gcc-10) — PASS, 0 errors, 0 warnings, 0 section mismatches

--------------------------------------------------------------------------------
orion5x_defconfig (arm, gcc-10) — PASS, 0 errors, 0 warnings, 0 section mismatches

--------------------------------------------------------------------------------
oxnas_v6_defconfig (arm, gcc-10) — PASS, 0 errors, 0 warnings, 0 section mismatches

--------------------------------------------------------------------------------
palmz72_defconfig (arm, gcc-10) — PASS, 0 errors, 0 warnings, 0 section mismatches

--------------------------------------------------------------------------------
pic32mzda_defconfig (mips, gcc-10) — PASS, 0 errors, 0 warnings, 0 section mismatches

--------------------------------------------------------------------------------
pistachio_defconfig (mips, gcc-10) — PASS, 0 errors, 0 warnings, 0 section mismatches

--------------------------------------------------------------------------------
pleb_defconfig (arm, gcc-10) — PASS, 0 errors, 0 warnings, 0 section mismatches

--------------------------------------------------------------------------------
prima2_defconfig (arm, gcc-10) — PASS, 0 errors, 0 warnings, 0 section mismatches

--------------------------------------------------------------------------------
pxa168_defconfig (arm, gcc-10) — PASS, 0 errors, 0 warnings, 0 section mismatches

--------------------------------------------------------------------------------
pxa255-idp_defconfig (arm, gcc-10) — PASS, 0 errors, 0 warnings, 0 section mismatches

--------------------------------------------------------------------------------
pxa3xx_defconfig (arm, gcc-10) — PASS, 0 errors, 0 warnings, 0 section mismatches

--------------------------------------------------------------------------------
pxa910_defconfig (arm, gcc-10) — PASS, 0 errors, 0 warnings, 0 section mismatches

--------------------------------------------------------------------------------
pxa_defconfig (arm, gcc-10) — PASS, 0 errors, 0 warnings, 0 section mismatches

--------------------------------------------------------------------------------
qcom_defconfig (arm, gcc-10) — PASS, 0 errors, 0 warnings, 0 section mismatches

--------------------------------------------------------------------------------
rb532_defconfig (mips, gcc-10) — PASS, 0 errors, 0 warnings, 0 section mismatches

--------------------------------------------------------------------------------
rbtx49xx_defconfig (mips, gcc-10) — PASS, 0 errors, 0 warnings, 0 section mismatches

--------------------------------------------------------------------------------
rm200_defconfig (mips, gcc-10) — PASS, 0 errors, 1 warning, 0 section mismatches

Warnings:
drivers/block/paride/bpck.c:32: warning: "PC" redefined

--------------------------------------------------------------------------------
rpc_defconfig (arm, gcc-10) — FAIL, 4 errors, 0 warnings, 0 section mismatches

Errors:
arm-linux-gnueabihf-gcc: error: unrecognized -march target: armv3m
arm-linux-gnueabihf-gcc: error: missing argument to ‘-march=’
arm-linux-gnueabihf-gcc: error: unrecognized -march target: armv3m
arm-linux-gnueabihf-gcc: error: missing argument to ‘-march=’

--------------------------------------------------------------------------------
rs90_defconfig (mips, gcc-10) — PASS, 0 errors, 0 warnings, 0 section mismatches

--------------------------------------------------------------------------------
rt305x_defconfig (mips, gcc-10) — PASS, 0 errors, 0 warnings, 0 section mismatches

--------------------------------------------------------------------------------
rv32_defconfig (riscv, gcc-10) — PASS, 0 errors, 4 warnings, 0 section mismatches

Warnings:
<stdin>:830:2: warning: #warning syscall fstat64 not implemented [-Wcpp]
<stdin>:1127:2: warning: #warning syscall fstatat64 not implemented [-Wcpp]
<stdin>:830:2: warning: #warning syscall fstat64 not implemented [-Wcpp]
<stdin>:1127:2: warning: #warning syscall fstatat64 not implemented [-Wcpp]

--------------------------------------------------------------------------------
s3c2410_defconfig (arm, gcc-10) — PASS, 0 errors, 0 warnings, 0 section mismatches

--------------------------------------------------------------------------------
s3c6400_defconfig (arm, gcc-10) — PASS, 0 errors, 0 warnings, 0 section mismatches

--------------------------------------------------------------------------------
s5pv210_defconfig (arm, gcc-10) — PASS, 0 errors, 0 warnings, 0 section mismatches

--------------------------------------------------------------------------------
sb1250_swarm_defconfig (mips, gcc-10) — PASS, 0 errors, 0 warnings, 0 section mismatches

--------------------------------------------------------------------------------
shannon_defconfig (arm, gcc-10) — PASS, 0 errors, 0 warnings, 0 section mismatches

--------------------------------------------------------------------------------
shmobile_defconfig (arm, gcc-10) — PASS, 0 errors, 0 warnings, 0 section mismatches

--------------------------------------------------------------------------------
simpad_defconfig (arm, gcc-10) — PASS, 0 errors, 0 warnings, 0 section mismatches

--------------------------------------------------------------------------------
socfpga_defconfig (arm, gcc-10) — PASS, 0 errors, 0 warnings, 0 section mismatches

--------------------------------------------------------------------------------
spear13xx_defconfig (arm, gcc-10) — PASS, 0 errors, 0 warnings, 0 section mismatches

--------------------------------------------------------------------------------
spear3xx_defconfig (arm, gcc-10) — PASS, 0 errors, 0 warnings, 0 section mismatches

--------------------------------------------------------------------------------
spear6xx_defconfig (arm, gcc-10) — PASS, 0 errors, 0 warnings, 0 section mismatches

--------------------------------------------------------------------------------
spitz_defconfig (arm, gcc-10) — PASS, 0 errors, 0 warnings, 0 section mismatches

--------------------------------------------------------------------------------
stm32_defconfig (arm, gcc-10) — PASS, 0 errors, 0 warnings, 0 section mismatches

--------------------------------------------------------------------------------
sunxi_defconfig (arm, gcc-10) — PASS, 0 errors, 0 warnings, 0 section mismatches

--------------------------------------------------------------------------------
tb0219_defconfig (mips, gcc-10) — PASS, 0 errors, 0 warnings, 0 section mismatches

--------------------------------------------------------------------------------
tb0226_defconfig (mips, gcc-10) — PASS, 0 errors, 0 warnings, 0 section mismatches

--------------------------------------------------------------------------------
tb0287_defconfig (mips, gcc-10) — PASS, 0 errors, 0 warnings, 0 section mismatches

--------------------------------------------------------------------------------
tct_hammer_defconfig (arm, gcc-10) — PASS, 0 errors, 0 warnings, 0 section mismatches

--------------------------------------------------------------------------------
tinyconfig (arc, gcc-10) — PASS, 0 errors, 0 warnings, 0 section mismatches

--------------------------------------------------------------------------------
tinyconfig (x86_64, gcc-10) — PASS, 0 errors, 0 warnings, 0 section mismatches

--------------------------------------------------------------------------------
tinyconfig (i386, gcc-10) — PASS, 0 errors, 0 warnings, 0 section mismatches

--------------------------------------------------------------------------------
trizeps4_defconfig (arm, gcc-10) — PASS, 0 errors, 0 warnings, 0 section mismatches

--------------------------------------------------------------------------------
u300_defconfig (arm, gcc-10) — PASS, 0 errors, 0 warnings, 0 section mismatches

--------------------------------------------------------------------------------
u8500_defconfig (arm, gcc-10) — PASS, 0 errors, 0 warnings, 0 section mismatches

--------------------------------------------------------------------------------
vdk_hs38_defconfig (arc, gcc-10) — PASS, 0 errors, 0 warnings, 0 section mismatches

--------------------------------------------------------------------------------
vdk_hs38_smp_defconfig (arc, gcc-10) — PASS, 0 errors, 0 warnings, 0 section mismatches

--------------------------------------------------------------------------------
versatile_defconfig (arm, gcc-10) — PASS, 0 errors, 0 warnings, 0 section mismatches

--------------------------------------------------------------------------------
vexpress_defconfig (arm, gcc-10) — PASS, 0 errors, 0 warnings, 0 section mismatches

--------------------------------------------------------------------------------
vf610m4_defconfig (arm, gcc-10) — PASS, 0 errors, 0 warnings, 0 section mismatches

--------------------------------------------------------------------------------
viper_defconfig (arm, gcc-10) — PASS, 0 errors, 0 warnings, 0 section mismatches

--------------------------------------------------------------------------------
vocore2_defconfig (mips, gcc-10) — PASS, 0 errors, 0 warnings, 0 section mismatches

--------------------------------------------------------------------------------
workpad_defconfig (mips, gcc-10) — PASS, 0 errors, 0 warnings, 0 section mismatches

--------------------------------------------------------------------------------
x86_64_defconfig (x86_64, gcc-10) — PASS, 0 errors, 0 warnings, 0 section mismatches

--------------------------------------------------------------------------------
x86_64_defconfig+kselftest (x86_64, gcc-10) — PASS, 0 errors, 0 warnings, 0 section mismatches

--------------------------------------------------------------------------------
x86_64_defconfig+x86-chromebook (x86_64, gcc-10) — PASS, 0 errors, 0 warnings, 0 section mismatches

--------------------------------------------------------------------------------
x86_64_defconfig+x86-chromebook+kselftest (x86_64, gcc-10) — PASS, 0 errors, 0 warnings, 0 section mismatches

--------------------------------------------------------------------------------
xcep_defconfig (arm, gcc-10) — PASS, 0 errors, 0 warnings, 0 section mismatches

--------------------------------------------------------------------------------
zeus_defconfig (arm, gcc-10) — PASS, 0 errors, 0 warnings, 0 section mismatches

--------------------------------------------------------------------------------
zx_defconfig (arm, gcc-10) — PASS, 0 errors, 0 warnings, 0 section mismatches

---
For more info write to <info@...>


cip-gitlab/ci/pavel/linux-test build: 180 builds: 5 failed, 175 passed, 6 errors, 191 warnings (v4.4-st20-74-gc99f2b257bde3) #kernelci

kernelci.org bot <bot@...>
 

cip-gitlab/ci/pavel/linux-test build: 180 builds: 5 failed, 175 passed, 6 errors, 191 warnings (v4.4-st20-74-gc99f2b257bde3)

Full Build Summary: https://kernelci.org/build/cip-gitlab/branch/ci%2Fpavel%2Flinux-test/kernel/v4.4-st20-74-gc99f2b257bde3/

Tree: cip-gitlab
Branch: ci/pavel/linux-test
Git Describe: v4.4-st20-74-gc99f2b257bde3
Git Commit: c99f2b257bde3cd60a833056aab624ad5fab3812
Git URL: https://gitlab.com/cip-project/cip-kernel/linux-cip.git
Built: 6 unique architectures

Build Failures Detected:

arm:
rpc_defconfig: (gcc-10) FAIL

mips:
fuloong2e_defconfig: (gcc-10) FAIL
ip27_defconfig: (gcc-10) FAIL
ip28_defconfig: (gcc-10) FAIL
lemote2f_defconfig: (gcc-10) FAIL

Errors and Warnings Detected:

arc:
axs103_defconfig (gcc-10): 1 warning
axs103_smp_defconfig (gcc-10): 1 warning
nsim_hs_defconfig (gcc-10): 1 warning
nsim_hs_smp_defconfig (gcc-10): 1 warning
nsimosci_hs_defconfig (gcc-10): 1 warning
nsimosci_hs_smp_defconfig (gcc-10): 1 warning
vdk_hs38_defconfig (gcc-10): 1 warning
vdk_hs38_smp_defconfig (gcc-10): 1 warning

arm64:
defconfig+arm64-chromebook (gcc-10): 2 warnings

arm:
acs5k_defconfig (gcc-10): 1 warning
acs5k_tiny_defconfig (gcc-10): 1 warning
assabet_defconfig (gcc-10): 1 warning
at91_dt_defconfig (gcc-10): 1 warning
axm55xx_defconfig (gcc-10): 1 warning
badge4_defconfig (gcc-10): 1 warning
bcm2835_defconfig (gcc-10): 1 warning
bcm_defconfig (gcc-10): 1 warning
cerfcube_defconfig (gcc-10): 1 warning
clps711x_defconfig (gcc-10): 2 warnings
cm_x2xx_defconfig (gcc-10): 1 warning
cm_x300_defconfig (gcc-10): 1 warning
colibri_pxa270_defconfig (gcc-10): 1 warning
colibri_pxa300_defconfig (gcc-10): 1 warning
collie_defconfig (gcc-10): 1 warning
corgi_defconfig (gcc-10): 1 warning
davinci_all_defconfig (gcc-10): 2 warnings
dove_defconfig (gcc-10): 1 warning
ebsa110_defconfig (gcc-10): 1 warning
efm32_defconfig (gcc-10): 1 warning
em_x270_defconfig (gcc-10): 1 warning
ep93xx_defconfig (gcc-10): 1 warning
eseries_pxa_defconfig (gcc-10): 1 warning
exynos_defconfig (gcc-10): 1 warning
ezx_defconfig (gcc-10): 1 warning
footbridge_defconfig (gcc-10): 1 warning
h3600_defconfig (gcc-10): 1 warning
h5000_defconfig (gcc-10): 1 warning
hackkit_defconfig (gcc-10): 1 warning
hisi_defconfig (gcc-10): 1 warning
imote2_defconfig (gcc-10): 1 warning
imx_v4_v5_defconfig (gcc-10): 1 warning
imx_v6_v7_defconfig (gcc-10): 1 warning
integrator_defconfig (gcc-10): 1 warning
iop13xx_defconfig (gcc-10): 1 warning
iop32x_defconfig (gcc-10): 1 warning
iop33x_defconfig (gcc-10): 1 warning
ixp4xx_defconfig (gcc-10): 1 warning
jornada720_defconfig (gcc-10): 1 warning
keystone_defconfig (gcc-10): 1 warning
ks8695_defconfig (gcc-10): 1 warning
lart_defconfig (gcc-10): 1 warning
lpc18xx_defconfig (gcc-10): 1 warning
lpc32xx_defconfig (gcc-10): 2 warnings
lpd270_defconfig (gcc-10): 1 warning
lubbock_defconfig (gcc-10): 1 warning
magician_defconfig (gcc-10): 1 warning
mainstone_defconfig (gcc-10): 1 warning
mini2440_defconfig (gcc-10): 2 warnings
mmp2_defconfig (gcc-10): 1 warning
multi_v7_defconfig (gcc-10): 1 warning
mv78xx0_defconfig (gcc-10): 1 warning
mvebu_v5_defconfig (gcc-10): 1 warning
mvebu_v7_defconfig (gcc-10): 1 warning
mxs_defconfig (gcc-10): 2 warnings
neponset_defconfig (gcc-10): 1 warning
netwinder_defconfig (gcc-10): 1 warning
netx_defconfig (gcc-10): 1 warning
nhk8815_defconfig (gcc-10): 1 warning
omap1_defconfig (gcc-10): 2 warnings
omap2plus_defconfig (gcc-10): 1 warning
orion5x_defconfig (gcc-10): 1 warning
pcm027_defconfig (gcc-10): 1 warning
pleb_defconfig (gcc-10): 1 warning
pxa168_defconfig (gcc-10): 1 warning
pxa255-idp_defconfig (gcc-10): 1 warning
pxa3xx_defconfig (gcc-10): 1 warning
pxa910_defconfig (gcc-10): 1 warning
qcom_defconfig (gcc-10): 1 warning
realview-smp_defconfig (gcc-10): 1 warning
realview_defconfig (gcc-10): 1 warning
rpc_defconfig (gcc-10): 2 errors
s3c2410_defconfig (gcc-10): 2 warnings
s3c6400_defconfig (gcc-10): 2 warnings
sama5_defconfig (gcc-10): 1 warning
shannon_defconfig (gcc-10): 1 warning
shmobile_defconfig (gcc-10): 1 warning
simpad_defconfig (gcc-10): 1 warning
socfpga_defconfig (gcc-10): 1 warning
spear13xx_defconfig (gcc-10): 1 warning
spitz_defconfig (gcc-10): 1 warning
sunxi_defconfig (gcc-10): 1 warning
tegra_defconfig (gcc-10): 1 warning
u8500_defconfig (gcc-10): 1 warning
versatile_defconfig (gcc-10): 1 warning
vexpress_defconfig (gcc-10): 1 warning
viper_defconfig (gcc-10): 1 warning
vt8500_v6_v7_defconfig (gcc-10): 1 warning
xcep_defconfig (gcc-10): 1 warning
zeus_defconfig (gcc-10): 1 warning

i386:
i386_defconfig (gcc-10): 5 warnings

mips:
ar7_defconfig (gcc-10): 1 warning
ath79_defconfig (gcc-10): 1 warning
bcm47xx_defconfig (gcc-10): 1 warning
bcm63xx_defconfig (gcc-10): 1 warning
bigsur_defconfig (gcc-10): 1 warning
bmips_be_defconfig (gcc-10): 1 warning
bmips_stb_defconfig (gcc-10): 1 warning
capcella_defconfig (gcc-10): 1 warning
cavium_octeon_defconfig (gcc-10): 1 warning
ci20_defconfig (gcc-10): 1 warning
cobalt_defconfig (gcc-10): 1 warning
db1xxx_defconfig (gcc-10): 1 warning
fuloong2e_defconfig (gcc-10): 2 errors
gpr_defconfig (gcc-10): 1 warning
ip22_defconfig (gcc-10): 2 warnings
ip32_defconfig (gcc-10): 1 warning
jazz_defconfig (gcc-10): 1 warning
jmr3927_defconfig (gcc-10): 1 warning
lasat_defconfig (gcc-10): 1 warning
lemote2f_defconfig (gcc-10): 2 errors
loongson3_defconfig (gcc-10): 1 warning
ls1b_defconfig (gcc-10): 1 warning
malta_defconfig (gcc-10): 1 warning
malta_kvm_defconfig (gcc-10): 1 warning
malta_kvm_guest_defconfig (gcc-10): 1 warning
malta_qemu_32r6_defconfig (gcc-10): 1 warning
maltaaprp_defconfig (gcc-10): 1 warning
maltasmvp_defconfig (gcc-10): 1 warning
maltasmvp_eva_defconfig (gcc-10): 1 warning
maltaup_defconfig (gcc-10): 1 warning
maltaup_xpa_defconfig (gcc-10): 1 warning
markeins_defconfig (gcc-10): 1 warning
mips_paravirt_defconfig (gcc-10): 1 warning
mpc30x_defconfig (gcc-10): 1 warning
msp71xx_defconfig (gcc-10): 1 warning
mtx1_defconfig (gcc-10): 4 warnings
nlm_xlp_defconfig (gcc-10): 1 warning
nlm_xlr_defconfig (gcc-10): 1 warning
pnx8335_stb225_defconfig (gcc-10): 1 warning
qi_lb60_defconfig (gcc-10): 1 warning
rb532_defconfig (gcc-10): 1 warning
rbtx49xx_defconfig (gcc-10): 1 warning
rm200_defconfig (gcc-10): 1 warning
rt305x_defconfig (gcc-10): 1 warning
sb1250_swarm_defconfig (gcc-10): 1 warning
sead3_defconfig (gcc-10): 1 warning
sead3micro_defconfig (gcc-10): 1 warning
tb0219_defconfig (gcc-10): 1 warning
tb0226_defconfig (gcc-10): 1 warning
tb0287_defconfig (gcc-10): 1 warning
workpad_defconfig (gcc-10): 1 warning
xway_defconfig (gcc-10): 1 warning

x86_64:
allnoconfig (gcc-10): 4 warnings
tinyconfig (gcc-10): 3 warnings
x86_64_defconfig (gcc-10): 9 warnings
x86_64_defconfig+x86-chromebook (gcc-10): 9 warnings

Errors summary:

4 cc1: error: ‘-mloongson-mmi’ must be used with ‘-mhard-float’
1 arm-linux-gnueabihf-gcc: error: unrecognized -march target: armv3
1 arm-linux-gnueabihf-gcc: error: missing argument to ‘-march=’

Warnings summary:

142 net/ipv4/inet_hashtables.c:608:68: warning: suggest parentheses around ‘+’ in operand of ‘&’ [-Wparentheses]
8 net/ipv4/inet_hashtables.c:608:68: warning: suggest parentheses around '+' in operand of '&' [-Wparentheses]
7 arch/x86/kernel/process.c:456: Warning: no instruction mnemonic suffix given and no register operands; using default for `btr'
4 arch/x86/entry/entry_64.S:487: Warning: no instruction mnemonic suffix given and no register operands; using default for `btr'
4 arch/x86/entry/entry_64.S:1642: Warning: no instruction mnemonic suffix given and no register operands; using default for `sysret'
3 ld: warning: creating DT_TEXTREL in a PIE
3 drivers/tty/serial/samsung.c:1776:34: warning: array ‘s3c24xx_uart_dt_match’ assumed to have one element
3 WARNING: vmlinux.o (.discard.retpoline_safe): unexpected non-allocatable section.
3 WARNING: vmlinux.o (.discard.nospec): unexpected non-allocatable section.
2 sound/pci/echoaudio/echoaudio_dsp.c:647:9: warning: iteration 1073741824 invokes undefined behavior [-Waggressive-loop-optimizations]
2 ld: arch/x86/boot/compressed/head_64.o: warning: relocation in read-only section `.head.text'
1 sound/pci/echoaudio/echoaudio_dsp.c:658:9: warning: iteration 1073741824 invokes undefined behavior [-Waggressive-loop-optimizations]
1 ld: arch/x86/boot/compressed/head_32.o: warning: relocation in read-only section `.head.text'
1 drivers/net/ethernet/seeq/sgiseeq.c:804:26: warning: passing argument 5 of ‘dma_free_attrs’ makes pointer from integer without a cast [-Wint-conversion]
1 drivers/net/ethernet/apm/xgene/xgene_enet_main.c:32:36: warning: array ‘xgene_enet_acpi_match’ assumed to have one element
1 drivers/mmc/host/sdhci-s3c.c:429:34: warning: array ‘sdhci_s3c_dt_match’ assumed to have one element
1 drivers/gpio/gpio-omap.c:1161:34: warning: array ‘omap_gpio_match’ assumed to have one element
1 arch/arm/mach-mxs/mach-mxs.c:285:26: warning: duplicate ‘const’ declaration specifier [-Wduplicate-decl-specifier]
1 arch/arm/mach-lpc32xx/phy3250.c:215:36: warning: duplicate ‘const’ declaration specifier [-Wduplicate-decl-specifier]
1 arch/arm/mach-davinci/da8xx-dt.c:23:34: warning: duplicate ‘const’ declaration specifier [-Wduplicate-decl-specifier]
1 arch/arm/mach-clps711x/board-autcpu12.c:163:26: warning: duplicate ‘const’ declaration specifier [-Wduplicate-decl-specifier]

================================================================================

Detailed per-defconfig build reports:

--------------------------------------------------------------------------------
acs5k_defconfig (arm, gcc-10) — PASS, 0 errors, 1 warning, 0 section mismatches

Warnings:
net/ipv4/inet_hashtables.c:608:68: warning: suggest parentheses around ‘+’ in operand of ‘&’ [-Wparentheses]

--------------------------------------------------------------------------------
acs5k_tiny_defconfig (arm, gcc-10) — PASS, 0 errors, 1 warning, 0 section mismatches

Warnings:
net/ipv4/inet_hashtables.c:608:68: warning: suggest parentheses around ‘+’ in operand of ‘&’ [-Wparentheses]

--------------------------------------------------------------------------------
allnoconfig (mips, gcc-10) — PASS, 0 errors, 0 warnings, 0 section mismatches

--------------------------------------------------------------------------------
allnoconfig (x86_64, gcc-10) — PASS, 0 errors, 4 warnings, 0 section mismatches

Warnings:
arch/x86/entry/entry_64.S:487: Warning: no instruction mnemonic suffix given and no register operands; using default for `btr'
arch/x86/entry/entry_64.S:1642: Warning: no instruction mnemonic suffix given and no register operands; using default for `sysret'
arch/x86/kernel/process.c:456: Warning: no instruction mnemonic suffix given and no register operands; using default for `btr'
arch/x86/kernel/process.c:456: Warning: no instruction mnemonic suffix given and no register operands; using default for `btr'

--------------------------------------------------------------------------------
allnoconfig (arm, gcc-10) — PASS, 0 errors, 0 warnings, 0 section mismatches

--------------------------------------------------------------------------------
allnoconfig (arc, gcc-10) — PASS, 0 errors, 0 warnings, 0 section mismatches

--------------------------------------------------------------------------------
allnoconfig (i386, gcc-10) — PASS, 0 errors, 0 warnings, 0 section mismatches

--------------------------------------------------------------------------------
ar7_defconfig (mips, gcc-10) — PASS, 0 errors, 1 warning, 0 section mismatches

Warnings:
net/ipv4/inet_hashtables.c:608:68: warning: suggest parentheses around ‘+’ in operand of ‘&’ [-Wparentheses]

--------------------------------------------------------------------------------
assabet_defconfig (arm, gcc-10) — PASS, 0 errors, 1 warning, 0 section mismatches

Warnings:
net/ipv4/inet_hashtables.c:608:68: warning: suggest parentheses around ‘+’ in operand of ‘&’ [-Wparentheses]

--------------------------------------------------------------------------------
at91_dt_defconfig (arm, gcc-10) — PASS, 0 errors, 1 warning, 0 section mismatches

Warnings:
net/ipv4/inet_hashtables.c:608:68: warning: suggest parentheses around ‘+’ in operand of ‘&’ [-Wparentheses]

--------------------------------------------------------------------------------
ath79_defconfig (mips, gcc-10) — PASS, 0 errors, 1 warning, 0 section mismatches

Warnings:
net/ipv4/inet_hashtables.c:608:68: warning: suggest parentheses around ‘+’ in operand of ‘&’ [-Wparentheses]

--------------------------------------------------------------------------------
axm55xx_defconfig (arm, gcc-10) — PASS, 0 errors, 1 warning, 0 section mismatches

Warnings:
net/ipv4/inet_hashtables.c:608:68: warning: suggest parentheses around ‘+’ in operand of ‘&’ [-Wparentheses]

--------------------------------------------------------------------------------
axs103_defconfig (arc, gcc-10) — PASS, 0 errors, 1 warning, 0 section mismatches

Warnings:
net/ipv4/inet_hashtables.c:608:68: warning: suggest parentheses around '+' in operand of '&' [-Wparentheses]

--------------------------------------------------------------------------------
axs103_smp_defconfig (arc, gcc-10) — PASS, 0 errors, 1 warning, 0 section mismatches

Warnings:
net/ipv4/inet_hashtables.c:608:68: warning: suggest parentheses around '+' in operand of '&' [-Wparentheses]

--------------------------------------------------------------------------------
badge4_defconfig (arm, gcc-10) — PASS, 0 errors, 1 warning, 0 section mismatches

Warnings:
net/ipv4/inet_hashtables.c:608:68: warning: suggest parentheses around ‘+’ in operand of ‘&’ [-Wparentheses]

--------------------------------------------------------------------------------
bcm2835_defconfig (arm, gcc-10) — PASS, 0 errors, 1 warning, 0 section mismatches

Warnings:
net/ipv4/inet_hashtables.c:608:68: warning: suggest parentheses around ‘+’ in operand of ‘&’ [-Wparentheses]

--------------------------------------------------------------------------------
bcm47xx_defconfig (mips, gcc-10) — PASS, 0 errors, 1 warning, 0 section mismatches

Warnings:
net/ipv4/inet_hashtables.c:608:68: warning: suggest parentheses around ‘+’ in operand of ‘&’ [-Wparentheses]

--------------------------------------------------------------------------------
bcm63xx_defconfig (mips, gcc-10) — PASS, 0 errors, 1 warning, 0 section mismatches

Warnings:
net/ipv4/inet_hashtables.c:608:68: warning: suggest parentheses around ‘+’ in operand of ‘&’ [-Wparentheses]

--------------------------------------------------------------------------------
bcm_defconfig (arm, gcc-10) — PASS, 0 errors, 1 warning, 0 section mismatches

Warnings:
net/ipv4/inet_hashtables.c:608:68: warning: suggest parentheses around ‘+’ in operand of ‘&’ [-Wparentheses]

--------------------------------------------------------------------------------
bigsur_defconfig (mips, gcc-10) — PASS, 0 errors, 1 warning, 0 section mismatches

Warnings:
net/ipv4/inet_hashtables.c:608:68: warning: suggest parentheses around ‘+’ in operand of ‘&’ [-Wparentheses]

--------------------------------------------------------------------------------
bmips_be_defconfig (mips, gcc-10) — PASS, 0 errors, 1 warning, 0 section mismatches

Warnings:
net/ipv4/inet_hashtables.c:608:68: warning: suggest parentheses around ‘+’ in operand of ‘&’ [-Wparentheses]

--------------------------------------------------------------------------------
bmips_stb_defconfig (mips, gcc-10) — PASS, 0 errors, 1 warning, 0 section mismatches

Warnings:
net/ipv4/inet_hashtables.c:608:68: warning: suggest parentheses around ‘+’ in operand of ‘&’ [-Wparentheses]

--------------------------------------------------------------------------------
capcella_defconfig (mips, gcc-10) — PASS, 0 errors, 1 warning, 0 section mismatches

Warnings:
net/ipv4/inet_hashtables.c:608:68: warning: suggest parentheses around ‘+’ in operand of ‘&’ [-Wparentheses]

--------------------------------------------------------------------------------
cavium_octeon_defconfig (mips, gcc-10) — PASS, 0 errors, 1 warning, 0 section mismatches

Warnings:
net/ipv4/inet_hashtables.c:608:68: warning: suggest parentheses around ‘+’ in operand of ‘&’ [-Wparentheses]

--------------------------------------------------------------------------------
cerfcube_defconfig (arm, gcc-10) — PASS, 0 errors, 1 warning, 0 section mismatches

Warnings:
net/ipv4/inet_hashtables.c:608:68: warning: suggest parentheses around ‘+’ in operand of ‘&’ [-Wparentheses]

--------------------------------------------------------------------------------
ci20_defconfig (mips, gcc-10) — PASS, 0 errors, 1 warning, 0 section mismatches

Warnings:
net/ipv4/inet_hashtables.c:608:68: warning: suggest parentheses around ‘+’ in operand of ‘&’ [-Wparentheses]

--------------------------------------------------------------------------------
clps711x_defconfig (arm, gcc-10) — PASS, 0 errors, 2 warnings, 0 section mismatches

Warnings:
arch/arm/mach-clps711x/board-autcpu12.c:163:26: warning: duplicate ‘const’ declaration specifier [-Wduplicate-decl-specifier]
net/ipv4/inet_hashtables.c:608:68: warning: suggest parentheses around ‘+’ in operand of ‘&’ [-Wparentheses]

--------------------------------------------------------------------------------
cm_x2xx_defconfig (arm, gcc-10) — PASS, 0 errors, 1 warning, 0 section mismatches

Warnings:
net/ipv4/inet_hashtables.c:608:68: warning: suggest parentheses around ‘+’ in operand of ‘&’ [-Wparentheses]

--------------------------------------------------------------------------------
cm_x300_defconfig (arm, gcc-10) — PASS, 0 errors, 1 warning, 0 section mismatches

Warnings:
net/ipv4/inet_hashtables.c:608:68: warning: suggest parentheses around ‘+’ in operand of ‘&’ [-Wparentheses]

--------------------------------------------------------------------------------
cobalt_defconfig (mips, gcc-10) — PASS, 0 errors, 1 warning, 0 section mismatches

Warnings:
net/ipv4/inet_hashtables.c:608:68: warning: suggest parentheses around ‘+’ in operand of ‘&’ [-Wparentheses]

--------------------------------------------------------------------------------
colibri_pxa270_defconfig (arm, gcc-10) — PASS, 0 errors, 1 warning, 0 section mismatches

Warnings:
net/ipv4/inet_hashtables.c:608:68: warning: suggest parentheses around ‘+’ in operand of ‘&’ [-Wparentheses]

--------------------------------------------------------------------------------
colibri_pxa300_defconfig (arm, gcc-10) — PASS, 0 errors, 1 warning, 0 section mismatches

Warnings:
net/ipv4/inet_hashtables.c:608:68: warning: suggest parentheses around ‘+’ in operand of ‘&’ [-Wparentheses]

--------------------------------------------------------------------------------
collie_defconfig (arm, gcc-10) — PASS, 0 errors, 1 warning, 0 section mismatches

Warnings:
net/ipv4/inet_hashtables.c:608:68: warning: suggest parentheses around ‘+’ in operand of ‘&’ [-Wparentheses]

--------------------------------------------------------------------------------
corgi_defconfig (arm, gcc-10) — PASS, 0 errors, 1 warning, 0 section mismatches

Warnings:
net/ipv4/inet_hashtables.c:608:68: warning: suggest parentheses around ‘+’ in operand of ‘&’ [-Wparentheses]

--------------------------------------------------------------------------------
davinci_all_defconfig (arm, gcc-10) — PASS, 0 errors, 2 warnings, 0 section mismatches

Warnings:
arch/arm/mach-davinci/da8xx-dt.c:23:34: warning: duplicate ‘const’ declaration specifier [-Wduplicate-decl-specifier]
net/ipv4/inet_hashtables.c:608:68: warning: suggest parentheses around ‘+’ in operand of ‘&’ [-Wparentheses]

--------------------------------------------------------------------------------
db1xxx_defconfig (mips, gcc-10) — PASS, 0 errors, 1 warning, 0 section mismatches

Warnings:
net/ipv4/inet_hashtables.c:608:68: warning: suggest parentheses around ‘+’ in operand of ‘&’ [-Wparentheses]

--------------------------------------------------------------------------------
defconfig+arm64-chromebook (arm64, gcc-10) — PASS, 0 errors, 2 warnings, 0 section mismatches

Warnings:
net/ipv4/inet_hashtables.c:608:68: warning: suggest parentheses around ‘+’ in operand of ‘&’ [-Wparentheses]
drivers/net/ethernet/apm/xgene/xgene_enet_main.c:32:36: warning: array ‘xgene_enet_acpi_match’ assumed to have one element

--------------------------------------------------------------------------------
dove_defconfig (arm, gcc-10) — PASS, 0 errors, 1 warning, 0 section mismatches

Warnings:
net/ipv4/inet_hashtables.c:608:68: warning: suggest parentheses around ‘+’ in operand of ‘&’ [-Wparentheses]

--------------------------------------------------------------------------------
e55_defconfig (mips, gcc-10) — PASS, 0 errors, 0 warnings, 0 section mismatches

--------------------------------------------------------------------------------
ebsa110_defconfig (arm, gcc-10) — PASS, 0 errors, 1 warning, 0 section mismatches

Warnings:
net/ipv4/inet_hashtables.c:608:68: warning: suggest parentheses around ‘+’ in operand of ‘&’ [-Wparentheses]

--------------------------------------------------------------------------------
efm32_defconfig (arm, gcc-10) — PASS, 0 errors, 1 warning, 0 section mismatches

Warnings:
net/ipv4/inet_hashtables.c:608:68: warning: suggest parentheses around ‘+’ in operand of ‘&’ [-Wparentheses]

--------------------------------------------------------------------------------
em_x270_defconfig (arm, gcc-10) — PASS, 0 errors, 1 warning, 0 section mismatches

Warnings:
net/ipv4/inet_hashtables.c:608:68: warning: suggest parentheses around ‘+’ in operand of ‘&’ [-Wparentheses]

--------------------------------------------------------------------------------
ep93xx_defconfig (arm, gcc-10) — PASS, 0 errors, 1 warning, 0 section mismatches

Warnings:
net/ipv4/inet_hashtables.c:608:68: warning: suggest parentheses around ‘+’ in operand of ‘&’ [-Wparentheses]

--------------------------------------------------------------------------------
eseries_pxa_defconfig (arm, gcc-10) — PASS, 0 errors, 1 warning, 0 section mismatches

Warnings:
net/ipv4/inet_hashtables.c:608:68: warning: suggest parentheses around ‘+’ in operand of ‘&’ [-Wparentheses]

--------------------------------------------------------------------------------
exynos_defconfig (arm, gcc-10) — PASS, 0 errors, 1 warning, 0 section mismatches

Warnings:
net/ipv4/inet_hashtables.c:608:68: warning: suggest parentheses around ‘+’ in operand of ‘&’ [-Wparentheses]

--------------------------------------------------------------------------------
ezx_defconfig (arm, gcc-10) — PASS, 0 errors, 1 warning, 0 section mismatches

Warnings:
net/ipv4/inet_hashtables.c:608:68: warning: suggest parentheses around ‘+’ in operand of ‘&’ [-Wparentheses]

--------------------------------------------------------------------------------
footbridge_defconfig (arm, gcc-10) — PASS, 0 errors, 1 warning, 0 section mismatches

Warnings:
net/ipv4/inet_hashtables.c:608:68: warning: suggest parentheses around ‘+’ in operand of ‘&’ [-Wparentheses]

--------------------------------------------------------------------------------
fuloong2e_defconfig (mips, gcc-10) — FAIL, 2 errors, 0 warnings, 0 section mismatches

Errors:
cc1: error: ‘-mloongson-mmi’ must be used with ‘-mhard-float’
cc1: error: ‘-mloongson-mmi’ must be used with ‘-mhard-float’

--------------------------------------------------------------------------------
gpr_defconfig (mips, gcc-10) — PASS, 0 errors, 1 warning, 0 section mismatches

Warnings:
net/ipv4/inet_hashtables.c:608:68: warning: suggest parentheses around ‘+’ in operand of ‘&’ [-Wparentheses]

--------------------------------------------------------------------------------
h3600_defconfig (arm, gcc-10) — PASS, 0 errors, 1 warning, 0 section mismatches

Warnings:
net/ipv4/inet_hashtables.c:608:68: warning: suggest parentheses around ‘+’ in operand of ‘&’ [-Wparentheses]

--------------------------------------------------------------------------------
h5000_defconfig (arm, gcc-10) — PASS, 0 errors, 1 warning, 0 section mismatches

Warnings:
net/ipv4/inet_hashtables.c:608:68: warning: suggest parentheses around ‘+’ in operand of ‘&’ [-Wparentheses]

--------------------------------------------------------------------------------
hackkit_defconfig (arm, gcc-10) — PASS, 0 errors, 1 warning, 0 section mismatches

Warnings:
net/ipv4/inet_hashtables.c:608:68: warning: suggest parentheses around ‘+’ in operand of ‘&’ [-Wparentheses]

--------------------------------------------------------------------------------
hisi_defconfig (arm, gcc-10) — PASS, 0 errors, 1 warning, 0 section mismatches

Warnings:
net/ipv4/inet_hashtables.c:608:68: warning: suggest parentheses around ‘+’ in operand of ‘&’ [-Wparentheses]

--------------------------------------------------------------------------------
i386_defconfig (i386, gcc-10) — PASS, 0 errors, 5 warnings, 0 section mismatches

Warnings:
net/ipv4/inet_hashtables.c:608:68: warning: suggest parentheses around ‘+’ in operand of ‘&’ [-Wparentheses]
WARNING: vmlinux.o (.discard.nospec): unexpected non-allocatable section.
WARNING: vmlinux.o (.discard.retpoline_safe): unexpected non-allocatable section.
ld: arch/x86/boot/compressed/head_32.o: warning: relocation in read-only section `.head.text'
ld: warning: creating DT_TEXTREL in a PIE

--------------------------------------------------------------------------------
imote2_defconfig (arm, gcc-10) — PASS, 0 errors, 1 warning, 0 section mismatches

Warnings:
net/ipv4/inet_hashtables.c:608:68: warning: suggest parentheses around ‘+’ in operand of ‘&’ [-Wparentheses]

--------------------------------------------------------------------------------
imx_v4_v5_defconfig (arm, gcc-10) — PASS, 0 errors, 1 warning, 0 section mismatches

Warnings:
net/ipv4/inet_hashtables.c:608:68: warning: suggest parentheses around ‘+’ in operand of ‘&’ [-Wparentheses]

--------------------------------------------------------------------------------
imx_v6_v7_defconfig (arm, gcc-10) — PASS, 0 errors, 1 warning, 0 section mismatches

Warnings:
net/ipv4/inet_hashtables.c:608:68: warning: suggest parentheses around ‘+’ in operand of ‘&’ [-Wparentheses]

--------------------------------------------------------------------------------
integrator_defconfig (arm, gcc-10) — PASS, 0 errors, 1 warning, 0 section mismatches

Warnings:
net/ipv4/inet_hashtables.c:608:68: warning: suggest parentheses around ‘+’ in operand of ‘&’ [-Wparentheses]

--------------------------------------------------------------------------------
iop13xx_defconfig (arm, gcc-10) — PASS, 0 errors, 1 warning, 0 section mismatches

Warnings:
net/ipv4/inet_hashtables.c:608:68: warning: suggest parentheses around ‘+’ in operand of ‘&’ [-Wparentheses]

--------------------------------------------------------------------------------
iop32x_defconfig (arm, gcc-10) — PASS, 0 errors, 1 warning, 0 section mismatches

Warnings:
net/ipv4/inet_hashtables.c:608:68: warning: suggest parentheses around ‘+’ in operand of ‘&’ [-Wparentheses]

--------------------------------------------------------------------------------
iop33x_defconfig (arm, gcc-10) — PASS, 0 errors, 1 warning, 0 section mismatches

Warnings:
net/ipv4/inet_hashtables.c:608:68: warning: suggest parentheses around ‘+’ in operand of ‘&’ [-Wparentheses]

--------------------------------------------------------------------------------
ip22_defconfig (mips, gcc-10) — PASS, 0 errors, 2 warnings, 0 section mismatches

Warnings:
drivers/net/ethernet/seeq/sgiseeq.c:804:26: warning: passing argument 5 of ‘dma_free_attrs’ makes pointer from integer without a cast [-Wint-conversion]
net/ipv4/inet_hashtables.c:608:68: warning: suggest parentheses around ‘+’ in operand of ‘&’ [-Wparentheses]

--------------------------------------------------------------------------------
ip27_defconfig (mips, gcc-10) — FAIL, 0 errors, 0 warnings, 0 section mismatches

--------------------------------------------------------------------------------
ip28_defconfig (mips, gcc-10) — FAIL, 0 errors, 0 warnings, 0 section mismatches

--------------------------------------------------------------------------------
ip32_defconfig (mips, gcc-10) — PASS, 0 errors, 1 warning, 0 section mismatches

Warnings:
net/ipv4/inet_hashtables.c:608:68: warning: suggest parentheses around ‘+’ in operand of ‘&’ [-Wparentheses]

--------------------------------------------------------------------------------
ixp4xx_defconfig (arm, gcc-10) — PASS, 0 errors, 1 warning, 0 section mismatches

Warnings:
net/ipv4/inet_hashtables.c:608:68: warning: suggest parentheses around ‘+’ in operand of ‘&’ [-Wparentheses]

--------------------------------------------------------------------------------
jazz_defconfig (mips, gcc-10) — PASS, 0 errors, 1 warning, 0 section mismatches

Warnings:
net/ipv4/inet_hashtables.c:608:68: warning: suggest parentheses around ‘+’ in operand of ‘&’ [-Wparentheses]

--------------------------------------------------------------------------------
jmr3927_defconfig (mips, gcc-10) — PASS, 0 errors, 1 warning, 0 section mismatches

Warnings:
net/ipv4/inet_hashtables.c:608:68: warning: suggest parentheses around ‘+’ in operand of ‘&’ [-Wparentheses]

--------------------------------------------------------------------------------
jornada720_defconfig (arm, gcc-10) — PASS, 0 errors, 1 warning, 0 section mismatches

Warnings:
net/ipv4/inet_hashtables.c:608:68: warning: suggest parentheses around ‘+’ in operand of ‘&’ [-Wparentheses]

--------------------------------------------------------------------------------
keystone_defconfig (arm, gcc-10) — PASS, 0 errors, 1 warning, 0 section mismatches

Warnings:
net/ipv4/inet_hashtables.c:608:68: warning: suggest parentheses around ‘+’ in operand of ‘&’ [-Wparentheses]

--------------------------------------------------------------------------------
ks8695_defconfig (arm, gcc-10) — PASS, 0 errors, 1 warning, 0 section mismatches

Warnings:
net/ipv4/inet_hashtables.c:608:68: warning: suggest parentheses around ‘+’ in operand of ‘&’ [-Wparentheses]

--------------------------------------------------------------------------------
lart_defconfig (arm, gcc-10) — PASS, 0 errors, 1 warning, 0 section mismatches

Warnings:
net/ipv4/inet_hashtables.c:608:68: warning: suggest parentheses around ‘+’ in operand of ‘&’ [-Wparentheses]

--------------------------------------------------------------------------------
lasat_defconfig (mips, gcc-10) — PASS, 0 errors, 1 warning, 0 section mismatches

Warnings:
net/ipv4/inet_hashtables.c:608:68: warning: suggest parentheses around ‘+’ in operand of ‘&’ [-Wparentheses]

--------------------------------------------------------------------------------
lemote2f_defconfig (mips, gcc-10) — FAIL, 2 errors, 0 warnings, 0 section mismatches

Errors:
cc1: error: ‘-mloongson-mmi’ must be used with ‘-mhard-float’
cc1: error: ‘-mloongson-mmi’ must be used with ‘-mhard-float’

--------------------------------------------------------------------------------
loongson3_defconfig (mips, gcc-10) — PASS, 0 errors, 1 warning, 0 section mismatches

Warnings:
net/ipv4/inet_hashtables.c:608:68: warning: suggest parentheses around ‘+’ in operand of ‘&’ [-Wparentheses]

--------------------------------------------------------------------------------
lpc18xx_defconfig (arm, gcc-10) — PASS, 0 errors, 1 warning, 0 section mismatches

Warnings:
net/ipv4/inet_hashtables.c:608:68: warning: suggest parentheses around ‘+’ in operand of ‘&’ [-Wparentheses]

--------------------------------------------------------------------------------
lpc32xx_defconfig (arm, gcc-10) — PASS, 0 errors, 2 warnings, 0 section mismatches

Warnings:
arch/arm/mach-lpc32xx/phy3250.c:215:36: warning: duplicate ‘const’ declaration specifier [-Wduplicate-decl-specifier]
net/ipv4/inet_hashtables.c:608:68: warning: suggest parentheses around ‘+’ in operand of ‘&’ [-Wparentheses]

--------------------------------------------------------------------------------
lpd270_defconfig (arm, gcc-10) — PASS, 0 errors, 1 warning, 0 section mismatches

Warnings:
net/ipv4/inet_hashtables.c:608:68: warning: suggest parentheses around ‘+’ in operand of ‘&’ [-Wparentheses]

--------------------------------------------------------------------------------
ls1b_defconfig (mips, gcc-10) — PASS, 0 errors, 1 warning, 0 section mismatches

Warnings:
net/ipv4/inet_hashtables.c:608:68: warning: suggest parentheses around ‘+’ in operand of ‘&’ [-Wparentheses]

--------------------------------------------------------------------------------
lubbock_defconfig (arm, gcc-10) — PASS, 0 errors, 1 warning, 0 section mismatches

Warnings:
net/ipv4/inet_hashtables.c:608:68: warning: suggest parentheses around ‘+’ in operand of ‘&’ [-Wparentheses]

--------------------------------------------------------------------------------
magician_defconfig (arm, gcc-10) — PASS, 0 errors, 1 warning, 0 section mismatches

Warnings:
net/ipv4/inet_hashtables.c:608:68: warning: suggest parentheses around ‘+’ in operand of ‘&’ [-Wparentheses]

--------------------------------------------------------------------------------
mainstone_defconfig (arm, gcc-10) — PASS, 0 errors, 1 warning, 0 section mismatches

Warnings:
net/ipv4/inet_hashtables.c:608:68: warning: suggest parentheses around ‘+’ in operand of ‘&’ [-Wparentheses]

--------------------------------------------------------------------------------
malta_defconfig (mips, gcc-10) — PASS, 0 errors, 1 warning, 0 section mismatches

Warnings:
net/ipv4/inet_hashtables.c:608:68: warning: suggest parentheses around ‘+’ in operand of ‘&’ [-Wparentheses]

--------------------------------------------------------------------------------
malta_kvm_defconfig (mips, gcc-10) — PASS, 0 errors, 1 warning, 0 section mismatches

Warnings:
net/ipv4/inet_hashtables.c:608:68: warning: suggest parentheses around ‘+’ in operand of ‘&’ [-Wparentheses]

--------------------------------------------------------------------------------
malta_kvm_guest_defconfig (mips, gcc-10) — PASS, 0 errors, 1 warning, 0 section mismatches

Warnings:
net/ipv4/inet_hashtables.c:608:68: warning: suggest parentheses around ‘+’ in operand of ‘&’ [-Wparentheses]

--------------------------------------------------------------------------------
malta_qemu_32r6_defconfig (mips, gcc-10) — PASS, 0 errors, 1 warning, 0 section mismatches

Warnings:
net/ipv4/inet_hashtables.c:608:68: warning: suggest parentheses around ‘+’ in operand of ‘&’ [-Wparentheses]

--------------------------------------------------------------------------------
maltaaprp_defconfig (mips, gcc-10) — PASS, 0 errors, 1 warning, 0 section mismatches

Warnings:
net/ipv4/inet_hashtables.c:608:68: warning: suggest parentheses around ‘+’ in operand of ‘&’ [-Wparentheses]

--------------------------------------------------------------------------------
maltasmvp_defconfig (mips, gcc-10) — PASS, 0 errors, 1 warning, 0 section mismatches

Warnings:
net/ipv4/inet_hashtables.c:608:68: warning: suggest parentheses around ‘+’ in operand of ‘&’ [-Wparentheses]

--------------------------------------------------------------------------------
maltasmvp_eva_defconfig (mips, gcc-10) — PASS, 0 errors, 1 warning, 0 section mismatches

Warnings:
net/ipv4/inet_hashtables.c:608:68: warning: suggest parentheses around ‘+’ in operand of ‘&’ [-Wparentheses]

--------------------------------------------------------------------------------
maltaup_defconfig (mips, gcc-10) — PASS, 0 errors, 1 warning, 0 section mismatches

Warnings:
net/ipv4/inet_hashtables.c:608:68: warning: suggest parentheses around ‘+’ in operand of ‘&’ [-Wparentheses]

--------------------------------------------------------------------------------
maltaup_xpa_defconfig (mips, gcc-10) — PASS, 0 errors, 1 warning, 0 section mismatches

Warnings:
net/ipv4/inet_hashtables.c:608:68: warning: suggest parentheses around ‘+’ in operand of ‘&’ [-Wparentheses]

--------------------------------------------------------------------------------
markeins_defconfig (mips, gcc-10) — PASS, 0 errors, 1 warning, 0 section mismatches

Warnings:
net/ipv4/inet_hashtables.c:608:68: warning: suggest parentheses around ‘+’ in operand of ‘&’ [-Wparentheses]

--------------------------------------------------------------------------------
mini2440_defconfig (arm, gcc-10) — PASS, 0 errors, 2 warnings, 0 section mismatches

Warnings:
net/ipv4/inet_hashtables.c:608:68: warning: suggest parentheses around ‘+’ in operand of ‘&’ [-Wparentheses]
drivers/tty/serial/samsung.c:1776:34: warning: array ‘s3c24xx_uart_dt_match’ assumed to have one element

--------------------------------------------------------------------------------
mips_paravirt_defconfig (mips, gcc-10) — PASS, 0 errors, 1 warning, 0 section mismatches

Warnings:
net/ipv4/inet_hashtables.c:608:68: warning: suggest parentheses around ‘+’ in operand of ‘&’ [-Wparentheses]

--------------------------------------------------------------------------------
mmp2_defconfig (arm, gcc-10) — PASS, 0 errors, 1 warning, 0 section mismatches

Warnings:
net/ipv4/inet_hashtables.c:608:68: warning: suggest parentheses around ‘+’ in operand of ‘&’ [-Wparentheses]

--------------------------------------------------------------------------------
mpc30x_defconfig (mips, gcc-10) — PASS, 0 errors, 1 warning, 0 section mismatches

Warnings:
net/ipv4/inet_hashtables.c:608:68: warning: suggest parentheses around ‘+’ in operand of ‘&’ [-Wparentheses]

--------------------------------------------------------------------------------
msp71xx_defconfig (mips, gcc-10) — PASS, 0 errors, 1 warning, 0 section mismatches

Warnings:
net/ipv4/inet_hashtables.c:608:68: warning: suggest parentheses around ‘+’ in operand of ‘&’ [-Wparentheses]

--------------------------------------------------------------------------------
mtx1_defconfig (mips, gcc-10) — PASS, 0 errors, 4 warnings, 0 section mismatches

Warnings:
net/ipv4/inet_hashtables.c:608:68: warning: suggest parentheses around ‘+’ in operand of ‘&’ [-Wparentheses]
sound/pci/echoaudio/echoaudio_dsp.c:647:9: warning: iteration 1073741824 invokes undefined behavior [-Waggressive-loop-optimizations]
sound/pci/echoaudio/echoaudio_dsp.c:658:9: warning: iteration 1073741824 invokes undefined behavior [-Waggressive-loop-optimizations]
sound/pci/echoaudio/echoaudio_dsp.c:647:9: warning: iteration 1073741824 invokes undefined behavior [-Waggressive-loop-optimizations]

--------------------------------------------------------------------------------
multi_v7_defconfig (arm, gcc-10) — PASS, 0 errors, 1 warning, 0 section mismatches

Warnings:
net/ipv4/inet_hashtables.c:608:68: warning: suggest parentheses around ‘+’ in operand of ‘&’ [-Wparentheses]

--------------------------------------------------------------------------------
mv78xx0_defconfig (arm, gcc-10) — PASS, 0 errors, 1 warning, 0 section mismatches

Warnings:
net/ipv4/inet_hashtables.c:608:68: warning: suggest parentheses around ‘+’ in operand of ‘&’ [-Wparentheses]

--------------------------------------------------------------------------------
mvebu_v5_defconfig (arm, gcc-10) — PASS, 0 errors, 1 warning, 0 section mismatches

Warnings:
net/ipv4/inet_hashtables.c:608:68: warning: suggest parentheses around ‘+’ in operand of ‘&’ [-Wparentheses]

--------------------------------------------------------------------------------
mvebu_v7_defconfig (arm, gcc-10) — PASS, 0 errors, 1 warning, 0 section mismatches

Warnings:
net/ipv4/inet_hashtables.c:608:68: warning: suggest parentheses around ‘+’ in operand of ‘&’ [-Wparentheses]

--------------------------------------------------------------------------------
mxs_defconfig (arm, gcc-10) — PASS, 0 errors, 2 warnings, 0 section mismatches

Warnings:
arch/arm/mach-mxs/mach-mxs.c:285:26: warning: duplicate ‘const’ declaration specifier [-Wduplicate-decl-specifier]
net/ipv4/inet_hashtables.c:608:68: warning: suggest parentheses around ‘+’ in operand of ‘&’ [-Wparentheses]

--------------------------------------------------------------------------------
neponset_defconfig (arm, gcc-10) — PASS, 0 errors, 1 warning, 0 section mismatches

Warnings:
net/ipv4/inet_hashtables.c:608:68: warning: suggest parentheses around ‘+’ in operand of ‘&’ [-Wparentheses]

--------------------------------------------------------------------------------
netwinder_defconfig (arm, gcc-10) — PASS, 0 errors, 1 warning, 0 section mismatches

Warnings:
net/ipv4/inet_hashtables.c:608:68: warning: suggest parentheses around ‘+’ in operand of ‘&’ [-Wparentheses]

--------------------------------------------------------------------------------
netx_defconfig (arm, gcc-10) — PASS, 0 errors, 1 warning, 0 section mismatches

Warnings:
net/ipv4/inet_hashtables.c:608:68: warning: suggest parentheses around ‘+’ in operand of ‘&’ [-Wparentheses]

--------------------------------------------------------------------------------
nhk8815_defconfig (arm, gcc-10) — PASS, 0 errors, 1 warning, 0 section mismatches

Warnings:
net/ipv4/inet_hashtables.c:608:68: warning: suggest parentheses around ‘+’ in operand of ‘&’ [-Wparentheses]

--------------------------------------------------------------------------------
nlm_xlp_defconfig (mips, gcc-10) — PASS, 0 errors, 1 warning, 0 section mismatches

Warnings:
net/ipv4/inet_hashtables.c:608:68: warning: suggest parentheses around ‘+’ in operand of ‘&’ [-Wparentheses]

--------------------------------------------------------------------------------
nlm_xlr_defconfig (mips, gcc-10) — PASS, 0 errors, 1 warning, 0 section mismatches

Warnings:
net/ipv4/inet_hashtables.c:608:68: warning: suggest parentheses around ‘+’ in operand of ‘&’ [-Wparentheses]

--------------------------------------------------------------------------------
nsim_hs_defconfig (arc, gcc-10) — PASS, 0 errors, 1 warning, 0 section mismatches

Warnings:
net/ipv4/inet_hashtables.c:608:68: warning: suggest parentheses around '+' in operand of '&' [-Wparentheses]

--------------------------------------------------------------------------------
nsim_hs_smp_defconfig (arc, gcc-10) — PASS, 0 errors, 1 warning, 0 section mismatches

Warnings:
net/ipv4/inet_hashtables.c:608:68: warning: suggest parentheses around '+' in operand of '&' [-Wparentheses]

--------------------------------------------------------------------------------
nsimosci_hs_defconfig (arc, gcc-10) — PASS, 0 errors, 1 warning, 0 section mismatches

Warnings:
net/ipv4/inet_hashtables.c:608:68: warning: suggest parentheses around '+' in operand of '&' [-Wparentheses]

--------------------------------------------------------------------------------
nsimosci_hs_smp_defconfig (arc, gcc-10) — PASS, 0 errors, 1 warning, 0 section mismatches

Warnings:
net/ipv4/inet_hashtables.c:608:68: warning: suggest parentheses around '+' in operand of '&' [-Wparentheses]

--------------------------------------------------------------------------------
nuc910_defconfig (arm, gcc-10) — PASS, 0 errors, 0 warnings, 0 section mismatches

--------------------------------------------------------------------------------
nuc950_defconfig (arm, gcc-10) — PASS, 0 errors, 0 warnings, 0 section mismatches

--------------------------------------------------------------------------------
nuc960_defconfig (arm, gcc-10) — PASS, 0 errors, 0 warnings, 0 section mismatches

--------------------------------------------------------------------------------
omap1_defconfig (arm, gcc-10) — PASS, 0 errors, 2 warnings, 0 section mismatches

Warnings:
drivers/gpio/gpio-omap.c:1161:34: warning: array ‘omap_gpio_match’ assumed to have one element
net/ipv4/inet_hashtables.c:608:68: warning: suggest parentheses around ‘+’ in operand of ‘&’ [-Wparentheses]

--------------------------------------------------------------------------------
omap2plus_defconfig (arm, gcc-10) — PASS, 0 errors, 1 warning, 0 section mismatches

Warnings:
net/ipv4/inet_hashtables.c:608:68: warning: suggest parentheses around ‘+’ in operand of ‘&’ [-Wparentheses]

--------------------------------------------------------------------------------
orion5x_defconfig (arm, gcc-10) — PASS, 0 errors, 1 warning, 0 section mismatches

Warnings:
net/ipv4/inet_hashtables.c:608:68: warning: suggest parentheses around ‘+’ in operand of ‘&’ [-Wparentheses]

--------------------------------------------------------------------------------
pcm027_defconfig (arm, gcc-10) — PASS, 0 errors, 1 warning, 0 section mismatches

Warnings:
net/ipv4/inet_hashtables.c:608:68: warning: suggest parentheses around ‘+’ in operand of ‘&’ [-Wparentheses]

--------------------------------------------------------------------------------
pleb_defconfig (arm, gcc-10) — PASS, 0 errors, 1 warning, 0 section mismatches

Warnings:
net/ipv4/inet_hashtables.c:608:68: warning: suggest parentheses around ‘+’ in operand of ‘&’ [-Wparentheses]

--------------------------------------------------------------------------------
pnx8335_stb225_defconfig (mips, gcc-10) — PASS, 0 errors, 1 warning, 0 section mismatches

Warnings:
net/ipv4/inet_hashtables.c:608:68: warning: suggest parentheses around ‘+’ in operand of ‘&’ [-Wparentheses]

--------------------------------------------------------------------------------
prima2_defconfig (arm, gcc-10) — PASS, 0 errors, 0 warnings, 0 section mismatches

--------------------------------------------------------------------------------
pxa168_defconfig (arm, gcc-10) — PASS, 0 errors, 1 warning, 0 section mismatches

Warnings:
net/ipv4/inet_hashtables.c:608:68: warning: suggest parentheses around ‘+’ in operand of ‘&’ [-Wparentheses]

--------------------------------------------------------------------------------
pxa255-idp_defconfig (arm, gcc-10) — PASS, 0 errors, 1 warning, 0 section mismatches

Warnings:
net/ipv4/inet_hashtables.c:608:68: warning: suggest parentheses around ‘+’ in operand of ‘&’ [-Wparentheses]

--------------------------------------------------------------------------------
pxa3xx_defconfig (arm, gcc-10) — PASS, 0 errors, 1 warning, 0 section mismatches

Warnings:
net/ipv4/inet_hashtables.c:608:68: warning: suggest parentheses around ‘+’ in operand of ‘&’ [-Wparentheses]

--------------------------------------------------------------------------------
pxa910_defconfig (arm, gcc-10) — PASS, 0 errors, 1 warning, 0 section mismatches

Warnings:
net/ipv4/inet_hashtables.c:608:68: warning: suggest parentheses around ‘+’ in operand of ‘&’ [-Wparentheses]

--------------------------------------------------------------------------------
qcom_defconfig (arm, gcc-10) — PASS, 0 errors, 1 warning, 0 section mismatches

Warnings:
net/ipv4/inet_hashtables.c:608:68: warning: suggest parentheses around ‘+’ in operand of ‘&’ [-Wparentheses]

--------------------------------------------------------------------------------
qi_lb60_defconfig (mips, gcc-10) — PASS, 0 errors, 1 warning, 0 section mismatches

Warnings:
net/ipv4/inet_hashtables.c:608:68: warning: suggest parentheses around ‘+’ in operand of ‘&’ [-Wparentheses]

--------------------------------------------------------------------------------
rb532_defconfig (mips, gcc-10) — PASS, 0 errors, 1 warning, 0 section mismatches

Warnings:
net/ipv4/inet_hashtables.c:608:68: warning: suggest parentheses around ‘+’ in operand of ‘&’ [-Wparentheses]

--------------------------------------------------------------------------------
rbtx49xx_defconfig (mips, gcc-10) — PASS, 0 errors, 1 warning, 0 section mismatches

Warnings:
net/ipv4/inet_hashtables.c:608:68: warning: suggest parentheses around ‘+’ in operand of ‘&’ [-Wparentheses]

--------------------------------------------------------------------------------
realview-smp_defconfig (arm, gcc-10) — PASS, 0 errors, 1 warning, 0 section mismatches

Warnings:
net/ipv4/inet_hashtables.c:608:68: warning: suggest parentheses around ‘+’ in operand of ‘&’ [-Wparentheses]

--------------------------------------------------------------------------------
realview_defconfig (arm, gcc-10) — PASS, 0 errors, 1 warning, 0 section mismatches

Warnings:
net/ipv4/inet_hashtables.c:608:68: warning: suggest parentheses around ‘+’ in operand of ‘&’ [-Wparentheses]

--------------------------------------------------------------------------------
rm200_defconfig (mips, gcc-10) — PASS, 0 errors, 1 warning, 0 section mismatches

Warnings:
net/ipv4/inet_hashtables.c:608:68: warning: suggest parentheses around ‘+’ in operand of ‘&’ [-Wparentheses]

--------------------------------------------------------------------------------
rpc_defconfig (arm, gcc-10) — FAIL, 2 errors, 0 warnings, 0 section mismatches

Errors:
arm-linux-gnueabihf-gcc: error: unrecognized -march target: armv3
arm-linux-gnueabihf-gcc: error: missing argument to ‘-march=’

--------------------------------------------------------------------------------
rt305x_defconfig (mips, gcc-10) — PASS, 0 errors, 1 warning, 0 section mismatches

Warnings:
net/ipv4/inet_hashtables.c:608:68: warning: suggest parentheses around ‘+’ in operand of ‘&’ [-Wparentheses]

--------------------------------------------------------------------------------
s3c2410_defconfig (arm, gcc-10) — PASS, 0 errors, 2 warnings, 0 section mismatches

Warnings:
net/ipv4/inet_hashtables.c:608:68: warning: suggest parentheses around ‘+’ in operand of ‘&’ [-Wparentheses]
drivers/tty/serial/samsung.c:1776:34: warning: array ‘s3c24xx_uart_dt_match’ assumed to have one element

--------------------------------------------------------------------------------
s3c6400_defconfig (arm, gcc-10) — PASS, 0 errors, 2 warnings, 0 section mismatches

Warnings:
drivers/mmc/host/sdhci-s3c.c:429:34: warning: array ‘sdhci_s3c_dt_match’ assumed to have one element
drivers/tty/serial/samsung.c:1776:34: warning: array ‘s3c24xx_uart_dt_match’ assumed to have one element

--------------------------------------------------------------------------------
s5pv210_defconfig (arm, gcc-10) — PASS, 0 errors, 0 warnings, 0 section mismatches

--------------------------------------------------------------------------------
sama5_defconfig (arm, gcc-10) — PASS, 0 errors, 1 warning, 0 section mismatches

Warnings:
net/ipv4/inet_hashtables.c:608:68: warning: suggest parentheses around ‘+’ in operand of ‘&’ [-Wparentheses]

--------------------------------------------------------------------------------
sb1250_swarm_defconfig (mips, gcc-10) — PASS, 0 errors, 1 warning, 0 section mismatches

Warnings:
net/ipv4/inet_hashtables.c:608:68: warning: suggest parentheses around ‘+’ in operand of ‘&’ [-Wparentheses]

--------------------------------------------------------------------------------
sead3_defconfig (mips, gcc-10) — PASS, 0 errors, 1 warning, 0 section mismatches

Warnings:
net/ipv4/inet_hashtables.c:608:68: warning: suggest parentheses around ‘+’ in operand of ‘&’ [-Wparentheses]

--------------------------------------------------------------------------------
sead3micro_defconfig (mips, gcc-10) — PASS, 0 errors, 1 warning, 0 section mismatches

Warnings:
net/ipv4/inet_hashtables.c:608:68: warning: suggest parentheses around ‘+’ in operand of ‘&’ [-Wparentheses]

--------------------------------------------------------------------------------
shannon_defconfig (arm, gcc-10) — PASS, 0 errors, 1 warning, 0 section mismatches

Warnings:
net/ipv4/inet_hashtables.c:608:68: warning: suggest parentheses around ‘+’ in operand of ‘&’ [-Wparentheses]

--------------------------------------------------------------------------------
shmobile_defconfig (arm, gcc-10) — PASS, 0 errors, 1 warning, 0 section mismatches

Warnings:
net/ipv4/inet_hashtables.c:608:68: warning: suggest parentheses around ‘+’ in operand of ‘&’ [-Wparentheses]

--------------------------------------------------------------------------------
simpad_defconfig (arm, gcc-10) — PASS, 0 errors, 1 warning, 0 section mismatches

Warnings:
net/ipv4/inet_hashtables.c:608:68: warning: suggest parentheses around ‘+’ in operand of ‘&’ [-Wparentheses]

--------------------------------------------------------------------------------
socfpga_defconfig (arm, gcc-10) — PASS, 0 errors, 1 warning, 0 section mismatches

Warnings:
net/ipv4/inet_hashtables.c:608:68: warning: suggest parentheses around ‘+’ in operand of ‘&’ [-Wparentheses]

--------------------------------------------------------------------------------
spear13xx_defconfig (arm, gcc-10) — PASS, 0 errors, 1 warning, 0 section mismatches

Warnings:
net/ipv4/inet_hashtables.c:608:68: warning: suggest parentheses around ‘+’ in operand of ‘&’ [-Wparentheses]

--------------------------------------------------------------------------------
spear3xx_defconfig (arm, gcc-10) — PASS, 0 errors, 0 warnings, 0 section mismatches

--------------------------------------------------------------------------------
spear6xx_defconfig (arm, gcc-10) — PASS, 0 errors, 0 warnings, 0 section mismatches

--------------------------------------------------------------------------------
spitz_defconfig (arm, gcc-10) — PASS, 0 errors, 1 warning, 0 section mismatches

Warnings:
net/ipv4/inet_hashtables.c:608:68: warning: suggest parentheses around ‘+’ in operand of ‘&’ [-Wparentheses]

--------------------------------------------------------------------------------
stm32_defconfig (arm, gcc-10) — PASS, 0 errors, 0 warnings, 0 section mismatches

--------------------------------------------------------------------------------
sunxi_defconfig (arm, gcc-10) — PASS, 0 errors, 1 warning, 0 section mismatches

Warnings:
net/ipv4/inet_hashtables.c:608:68: warning: suggest parentheses around ‘+’ in operand of ‘&’ [-Wparentheses]

--------------------------------------------------------------------------------
tb0219_defconfig (mips, gcc-10) — PASS, 0 errors, 1 warning, 0 section mismatches

Warnings:
net/ipv4/inet_hashtables.c:608:68: warning: suggest parentheses around ‘+’ in operand of ‘&’ [-Wparentheses]

--------------------------------------------------------------------------------
tb0226_defconfig (mips, gcc-10) — PASS, 0 errors, 1 warning, 0 section mismatches

Warnings:
net/ipv4/inet_hashtables.c:608:68: warning: suggest parentheses around ‘+’ in operand of ‘&’ [-Wparentheses]

--------------------------------------------------------------------------------
tb0287_defconfig (mips, gcc-10) — PASS, 0 errors, 1 warning, 0 section mismatches

Warnings:
net/ipv4/inet_hashtables.c:608:68: warning: suggest parentheses around ‘+’ in operand of ‘&’ [-Wparentheses]

--------------------------------------------------------------------------------
tct_hammer_defconfig (arm, gcc-10) — PASS, 0 errors, 0 warnings, 0 section mismatches

--------------------------------------------------------------------------------
tegra_defconfig (arm, gcc-10) — PASS, 0 errors, 1 warning, 0 section mismatches

Warnings:
net/ipv4/inet_hashtables.c:608:68: warning: suggest parentheses around ‘+’ in operand of ‘&’ [-Wparentheses]

--------------------------------------------------------------------------------
tinyconfig (mips, gcc-10) — PASS, 0 errors, 0 warnings, 0 section mismatches

--------------------------------------------------------------------------------
tinyconfig (arc, gcc-10) — PASS, 0 errors, 0 warnings, 0 section mismatches

--------------------------------------------------------------------------------
tinyconfig (arm, gcc-10) — PASS, 0 errors, 0 warnings, 0 section mismatches

--------------------------------------------------------------------------------
tinyconfig (i386, gcc-10) — PASS, 0 errors, 0 warnings, 0 section mismatches

--------------------------------------------------------------------------------
tinyconfig (x86_64, gcc-10) — PASS, 0 errors, 3 warnings, 0 section mismatches

Warnings:
arch/x86/entry/entry_64.S:487: Warning: no instruction mnemonic suffix given and no register operands; using default for `btr'
arch/x86/entry/entry_64.S:1642: Warning: no instruction mnemonic suffix given and no register operands; using default for `sysret'
arch/x86/kernel/process.c:456: Warning: no instruction mnemonic suffix given and no register operands; using default for `btr'

--------------------------------------------------------------------------------
u300_defconfig (arm, gcc-10) — PASS, 0 errors, 0 warnings, 0 section mismatches

--------------------------------------------------------------------------------
u8500_defconfig (arm, gcc-10) — PASS, 0 errors, 1 warning, 0 section mismatches

Warnings:
net/ipv4/inet_hashtables.c:608:68: warning: suggest parentheses around ‘+’ in operand of ‘&’ [-Wparentheses]

--------------------------------------------------------------------------------
vdk_hs38_defconfig (arc, gcc-10) — PASS, 0 errors, 1 warning, 0 section mismatches

Warnings:
net/ipv4/inet_hashtables.c:608:68: warning: suggest parentheses around '+' in operand of '&' [-Wparentheses]

--------------------------------------------------------------------------------
vdk_hs38_smp_defconfig (arc, gcc-10) — PASS, 0 errors, 1 warning, 0 section mismatches

Warnings:
net/ipv4/inet_hashtables.c:608:68: warning: suggest parentheses around '+' in operand of '&' [-Wparentheses]

--------------------------------------------------------------------------------
versatile_defconfig (arm, gcc-10) — PASS, 0 errors, 1 warning, 0 section mismatches

Warnings:
net/ipv4/inet_hashtables.c:608:68: warning: suggest parentheses around ‘+’ in operand of ‘&’ [-Wparentheses]

--------------------------------------------------------------------------------
vexpress_defconfig (arm, gcc-10) — PASS, 0 errors, 1 warning, 0 section mismatches

Warnings:
net/ipv4/inet_hashtables.c:608:68: warning: suggest parentheses around ‘+’ in operand of ‘&’ [-Wparentheses]

--------------------------------------------------------------------------------
vf610m4_defconfig (arm, gcc-10) — PASS, 0 errors, 0 warnings, 0 section mismatches

--------------------------------------------------------------------------------
viper_defconfig (arm, gcc-10) — PASS, 0 errors, 1 warning, 0 section mismatches

Warnings:
net/ipv4/inet_hashtables.c:608:68: warning: suggest parentheses around ‘+’ in operand of ‘&’ [-Wparentheses]

--------------------------------------------------------------------------------
vt8500_v6_v7_defconfig (arm, gcc-10) — PASS, 0 errors, 1 warning, 0 section mismatches

Warnings:
net/ipv4/inet_hashtables.c:608:68: warning: suggest parentheses around ‘+’ in operand of ‘&’ [-Wparentheses]

--------------------------------------------------------------------------------
workpad_defconfig (mips, gcc-10) — PASS, 0 errors, 1 warning, 0 section mismatches

Warnings:
net/ipv4/inet_hashtables.c:608:68: warning: suggest parentheses around ‘+’ in operand of ‘&’ [-Wparentheses]

--------------------------------------------------------------------------------
x86_64_defconfig (x86_64, gcc-10) — PASS, 0 errors, 9 warnings, 0 section mismatches

Warnings:
arch/x86/entry/entry_64.S:487: Warning: no instruction mnemonic suffix given and no register operands; using default for `btr'
arch/x86/entry/entry_64.S:1642: Warning: no instruction mnemonic suffix given and no register operands; using default for `sysret'
arch/x86/kernel/process.c:456: Warning: no instruction mnemonic suffix given and no register operands; using default for `btr'
arch/x86/kernel/process.c:456: Warning: no instruction mnemonic suffix given and no register operands; using default for `btr'
net/ipv4/inet_hashtables.c:608:68: warning: suggest parentheses around ‘+’ in operand of ‘&’ [-Wparentheses]
WARNING: vmlinux.o (.discard.nospec): unexpected non-allocatable section.
WARNING: vmlinux.o (.discard.retpoline_safe): unexpected non-allocatable section.
ld: arch/x86/boot/compressed/head_64.o: warning: relocation in read-only section `.head.text'
ld: warning: creating DT_TEXTREL in a PIE

--------------------------------------------------------------------------------
x86_64_defconfig+x86-chromebook (x86_64, gcc-10) — PASS, 0 errors, 9 warnings, 0 section mismatches

Warnings:
arch/x86/entry/entry_64.S:487: Warning: no instruction mnemonic suffix given and no register operands; using default for `btr'
arch/x86/entry/entry_64.S:1642: Warning: no instruction mnemonic suffix given and no register operands; using default for `sysret'
arch/x86/kernel/process.c:456: Warning: no instruction mnemonic suffix given and no register operands; using default for `btr'
arch/x86/kernel/process.c:456: Warning: no instruction mnemonic suffix given and no register operands; using default for `btr'
net/ipv4/inet_hashtables.c:608:68: warning: suggest parentheses around ‘+’ in operand of ‘&’ [-Wparentheses]
WARNING: vmlinux.o (.discard.nospec): unexpected non-allocatable section.
WARNING: vmlinux.o (.discard.retpoline_safe): unexpected non-allocatable section.
ld: arch/x86/boot/compressed/head_64.o: warning: relocation in read-only section `.head.text'
ld: warning: creating DT_TEXTREL in a PIE

--------------------------------------------------------------------------------
xcep_defconfig (arm, gcc-10) — PASS, 0 errors, 1 warning, 0 section mismatches

Warnings:
net/ipv4/inet_hashtables.c:608:68: warning: suggest parentheses around ‘+’ in operand of ‘&’ [-Wparentheses]

--------------------------------------------------------------------------------
xilfpga_defconfig (mips, gcc-10) — PASS, 0 errors, 0 warnings, 0 section mismatches

--------------------------------------------------------------------------------
xway_defconfig (mips, gcc-10) — PASS, 0 errors, 1 warning, 0 section mismatches

Warnings:
net/ipv4/inet_hashtables.c:608:68: warning: suggest parentheses around ‘+’ in operand of ‘&’ [-Wparentheses]

--------------------------------------------------------------------------------
zeus_defconfig (arm, gcc-10) — PASS, 0 errors, 1 warning, 0 section mismatches

Warnings:
net/ipv4/inet_hashtables.c:608:68: warning: suggest parentheses around ‘+’ in operand of ‘&’ [-Wparentheses]

--------------------------------------------------------------------------------
zx_defconfig (arm, gcc-10) — PASS, 0 errors, 0 warnings, 0 section mismatches

---
For more info write to <info@...>


[PATCH 5.10.y-cip 13/13] arm64: dts: renesas: rzg2l-smarc: Move gpios property of vccq_sdhi1 from common dtsi

Biju Das
 

commit f40846e7c9f50bfbba96d566c63cbdb57b817249 upstream.

On RZ/G2{L,LC} SoM module, gpio for power selection is connected to
P39_1 whereas on RZ/G2UL it is connected to P6_1. So move gpios property
of vccq_sdhi1 regulator from common dtsi to soc specific dtsi.

Signed-off-by: Biju Das <biju.das.jz@...>
Link: https://lore.kernel.org/r/20220401175427.19078-1-biju.das.jz@bp.renesas.com
Signed-off-by: Geert Uytterhoeven <geert+renesas@...>
Signed-off-by: Biju Das <biju.das.jz@...>
---
arch/arm64/boot/dts/renesas/rz-smarc-common.dtsi | 1 -
arch/arm64/boot/dts/renesas/rzg2l-smarc.dtsi | 4 ++++
arch/arm64/boot/dts/renesas/rzg2lc-smarc.dtsi | 4 ++++
3 files changed, 8 insertions(+), 1 deletion(-)

diff --git a/arch/arm64/boot/dts/renesas/rz-smarc-common.dtsi b/arch/arm64/boot/dts/renesas/rz-smarc-common.dtsi
index 8dd1c69a6749..0e61b85efb43 100644
--- a/arch/arm64/boot/dts/renesas/rz-smarc-common.dtsi
+++ b/arch/arm64/boot/dts/renesas/rz-smarc-common.dtsi
@@ -74,7 +74,6 @@ vccq_sdhi1: regulator-vccq-sdhi1 {
regulator-name = "SDHI1 VccQ";
regulator-min-microvolt = <1800000>;
regulator-max-microvolt = <3300000>;
- gpios = <&pinctrl RZG2L_GPIO(39, 1) GPIO_ACTIVE_HIGH>;
gpios-states = <1>;
states = <3300000 1>, <1800000 0>;
};
diff --git a/arch/arm64/boot/dts/renesas/rzg2l-smarc.dtsi b/arch/arm64/boot/dts/renesas/rzg2l-smarc.dtsi
index c934cd3633a4..aadc41515093 100644
--- a/arch/arm64/boot/dts/renesas/rzg2l-smarc.dtsi
+++ b/arch/arm64/boot/dts/renesas/rzg2l-smarc.dtsi
@@ -48,3 +48,7 @@ &scif2 {
status = "okay";
};
#endif
+
+&vccq_sdhi1 {
+ gpios = <&pinctrl RZG2L_GPIO(39, 1) GPIO_ACTIVE_HIGH>;
+};
diff --git a/arch/arm64/boot/dts/renesas/rzg2lc-smarc.dtsi b/arch/arm64/boot/dts/renesas/rzg2lc-smarc.dtsi
index 856c949796ff..74a844ea7537 100644
--- a/arch/arm64/boot/dts/renesas/rzg2lc-smarc.dtsi
+++ b/arch/arm64/boot/dts/renesas/rzg2lc-smarc.dtsi
@@ -98,3 +98,7 @@ &spi1 {
status = "disabled";
};
#endif
+
+&vccq_sdhi1 {
+ gpios = <&pinctrl RZG2L_GPIO(39, 1) GPIO_ACTIVE_HIGH>;
+};
--
2.25.1


[PATCH 5.10.y-cip 12/13] arm64: dts: renesas: rzg2lc-smarc: Enable RSPI1 on carrier board

Biju Das
 

commit 061ba41c7449a9cf4bbf2b6930eb0ded69e5eead upstream.

RSPI1 (SPI1) interface is available on PMOD0 connector (J1) on the
carrier board. This patch adds pinmux and spi1 nodes to the carrier
board dtsi file and drops deleting pinctl* properties from DTS file.

RSPI1 interface is tested by setting the macro SW_RSPI_CAN to 0.

Signed-off-by: Biju Das <biju.das.jz@...>
Reviewed-by: Lad Prabhakar <prabhakar.mahadev-lad.rj@...>
Link: https://lore.kernel.org/r/20220401145702.17954-1-biju.das.jz@bp.renesas.com
Signed-off-by: Geert Uytterhoeven <geert+renesas@...>
Signed-off-by: Biju Das <biju.das.jz@...>
---
arch/arm64/boot/dts/renesas/r9a07g044c2-smarc.dts | 6 ------
arch/arm64/boot/dts/renesas/rzg2lc-smarc-pinfunction.dtsi | 7 +++++++
arch/arm64/boot/dts/renesas/rzg2lc-smarc.dtsi | 8 ++++++++
3 files changed, 15 insertions(+), 6 deletions(-)

diff --git a/arch/arm64/boot/dts/renesas/r9a07g044c2-smarc.dts b/arch/arm64/boot/dts/renesas/r9a07g044c2-smarc.dts
index 74a2f2bade10..fc34058002e2 100644
--- a/arch/arm64/boot/dts/renesas/r9a07g044c2-smarc.dts
+++ b/arch/arm64/boot/dts/renesas/r9a07g044c2-smarc.dts
@@ -13,9 +13,3 @@ / {
model = "Renesas SMARC EVK based on r9a07g044c2";
compatible = "renesas,smarc-evk", "renesas,r9a07g044c2", "renesas,r9a07g044";
};
-
-&spi1 {
- /delete-property/ pinctrl-0;
- /delete-property/ pinctrl-names;
- status = "disabled";
-};
diff --git a/arch/arm64/boot/dts/renesas/rzg2lc-smarc-pinfunction.dtsi b/arch/arm64/boot/dts/renesas/rzg2lc-smarc-pinfunction.dtsi
index d275a55333e3..a78a8def363e 100644
--- a/arch/arm64/boot/dts/renesas/rzg2lc-smarc-pinfunction.dtsi
+++ b/arch/arm64/boot/dts/renesas/rzg2lc-smarc-pinfunction.dtsi
@@ -106,6 +106,13 @@ sound_clk_pins: sound_clk {
input-enable;
};

+ spi1_pins: spi1 {
+ pinmux = <RZG2L_PORT_PINMUX(44, 0, 1)>, /* CK */
+ <RZG2L_PORT_PINMUX(44, 1, 1)>, /* MOSI */
+ <RZG2L_PORT_PINMUX(44, 2, 1)>, /* MISO */
+ <RZG2L_PORT_PINMUX(44, 3, 1)>; /* SSL */
+ };
+
ssi0_pins: ssi0 {
pinmux = <RZG2L_PORT_PINMUX(45, 0, 1)>, /* BCK */
<RZG2L_PORT_PINMUX(45, 1, 1)>, /* RCK */
diff --git a/arch/arm64/boot/dts/renesas/rzg2lc-smarc.dtsi b/arch/arm64/boot/dts/renesas/rzg2lc-smarc.dtsi
index f73b4acb8f9e..856c949796ff 100644
--- a/arch/arm64/boot/dts/renesas/rzg2lc-smarc.dtsi
+++ b/arch/arm64/boot/dts/renesas/rzg2lc-smarc.dtsi
@@ -90,3 +90,11 @@ &scif1 {
status = "okay";
};
#endif
+
+#if (SW_RSPI_CAN)
+&spi1 {
+ /delete-property/ pinctrl-0;
+ /delete-property/ pinctrl-names;
+ status = "disabled";
+};
+#endif
--
2.25.1


[PATCH 5.10.y-cip 11/13] arm64: dts: renesas: rzg2lc-smarc-som: Enable OSTM

Biju Das
 

commit a081c4fe98f6662fbddb1597a6203be669641af1 upstream.

Enable OSTM{1, 2} interfaces on RZ/G2LC SMARC EVK.
OSTM0 is reserved for TF-A.

Signed-off-by: Biju Das <biju.das.jz@...>
Reviewed-by: Lad Prabhakar <prabhakar.mahadev-lad.rj@...>
Link: https://lore.kernel.org/r/20220307192436.13237-3-biju.das.jz@bp.renesas.com
Signed-off-by: Geert Uytterhoeven <geert+renesas@...>
Signed-off-by: Biju Das <biju.das.jz@...>
---
arch/arm64/boot/dts/renesas/rzg2lc-smarc-som.dtsi | 8 ++++++++
1 file changed, 8 insertions(+)

diff --git a/arch/arm64/boot/dts/renesas/rzg2lc-smarc-som.dtsi b/arch/arm64/boot/dts/renesas/rzg2lc-smarc-som.dtsi
index 80c9a1146cb7..05b117ac414c 100644
--- a/arch/arm64/boot/dts/renesas/rzg2lc-smarc-som.dtsi
+++ b/arch/arm64/boot/dts/renesas/rzg2lc-smarc-som.dtsi
@@ -84,6 +84,14 @@ &extal_clk {
clock-frequency = <24000000>;
};

+&ostm1 {
+ status = "okay";
+};
+
+&ostm2 {
+ status = "okay";
+};
+
&pinctrl {
eth0_pins: eth0 {
pinmux = <RZG2L_PORT_PINMUX(28, 1, 1)>, /* ET0_LINKSTA */
--
2.25.1


[PATCH 5.10.y-cip 10/13] arm64: dts: renesas: rzg2lc-smarc-som: Enable serial NOR flash

Biju Das
 

commit 018d7b93477fbb04ba7b4bc4c355793d644e45da upstream.

Enable mt25qu512a flash connected to QSPI0.

Signed-off-by: Biju Das <biju.das.jz@...>
Reviewed-by: Lad Prabhakar <prabhakar.mahadev-lad.rj@...>
Link: https://lore.kernel.org/r/20220307192436.13237-2-biju.das.jz@bp.renesas.com
Signed-off-by: Geert Uytterhoeven <geert+renesas@...>
Signed-off-by: Biju Das <biju.das.jz@...>
---
.../boot/dts/renesas/rzg2lc-smarc-som.dtsi | 40 +++++++++++++++++++
1 file changed, 40 insertions(+)

diff --git a/arch/arm64/boot/dts/renesas/rzg2lc-smarc-som.dtsi b/arch/arm64/boot/dts/renesas/rzg2lc-smarc-som.dtsi
index 88a7938017aa..80c9a1146cb7 100644
--- a/arch/arm64/boot/dts/renesas/rzg2lc-smarc-som.dtsi
+++ b/arch/arm64/boot/dts/renesas/rzg2lc-smarc-som.dtsi
@@ -110,6 +110,18 @@ gpio-sd0-pwr-en-hog {
line-name = "gpio_sd0_pwr_en";
};

+ qspi0_pins: qspi0 {
+ qspi0-data {
+ pins = "QSPI0_IO0", "QSPI0_IO1", "QSPI0_IO2", "QSPI0_IO3";
+ power-source = <1800>;
+ };
+
+ qspi0-ctrl {
+ pins = "QSPI0_SPCLK", "QSPI0_SSL", "QSPI_RESET#";
+ power-source = <1800>;
+ };
+ };
+
/*
* SD0 device selection is XOR between GPIO_SD0_DEV_SEL and SW1[2]
* The below switch logic can be used to select the device between
@@ -175,6 +187,34 @@ sd0_mux_uhs {
};
};

+&sbc {
+ pinctrl-0 = <&qspi0_pins>;
+ pinctrl-names = "default";
+ status = "okay";
+
+ flash@0 {
+ compatible = "micron,mt25qu512a", "jedec,spi-nor";
+ reg = <0>;
+ m25p,fast-read;
+ spi-max-frequency = <50000000>;
+ spi-rx-bus-width = <4>;
+
+ partitions {
+ compatible = "fixed-partitions";
+ #address-cells = <1>;
+ #size-cells = <1>;
+
+ boot@0 {
+ reg = <0x00000000 0x2000000>;
+ read-only;
+ };
+ user@2000000 {
+ reg = <0x2000000 0x2000000>;
+ };
+ };
+ };
+};
+
#if (!SW_SD0_DEV_SEL)
&sdhi0 {
pinctrl-0 = <&sdhi0_pins>;
--
2.25.1


[PATCH 5.10.y-cip 09/13] arm64: dts: renesas: rzg2lc-smarc: Enable Audio

Biju Das
 

commit 4eb6a6bb8ef31491c217167ecce2c0a26fd4f34e upstream.

Enable Audio on RZ/G2LC SMARC EVK by deleting ssi0 entries from
board DT and adding pincontrol entries to the soc-pinctrl dtsi,
so that entries from common dtsi kick in and make audio functionality
operational.

Signed-off-by: Biju Das <biju.das.jz@...>
Reviewed-by: Lad Prabhakar <prabhakar.mahadev-lad.rj@...>
Link: https://lore.kernel.org/r/20220303164155.7706-5-biju.das.jz@bp.renesas.com
Signed-off-by: Geert Uytterhoeven <geert+renesas@...>
Signed-off-by: Biju Das <biju.das.jz@...>
---
arch/arm64/boot/dts/renesas/r9a07g044c2-smarc.dts | 6 ------
arch/arm64/boot/dts/renesas/rzg2lc-smarc-pinfunction.dtsi | 7 +++++++
2 files changed, 7 insertions(+), 6 deletions(-)

diff --git a/arch/arm64/boot/dts/renesas/r9a07g044c2-smarc.dts b/arch/arm64/boot/dts/renesas/r9a07g044c2-smarc.dts
index 52b834205126..74a2f2bade10 100644
--- a/arch/arm64/boot/dts/renesas/r9a07g044c2-smarc.dts
+++ b/arch/arm64/boot/dts/renesas/r9a07g044c2-smarc.dts
@@ -19,9 +19,3 @@ &spi1 {
/delete-property/ pinctrl-names;
status = "disabled";
};
-
-&ssi0 {
- /delete-property/ pinctrl-0;
- /delete-property/ pinctrl-names;
- status = "disabled";
-};
diff --git a/arch/arm64/boot/dts/renesas/rzg2lc-smarc-pinfunction.dtsi b/arch/arm64/boot/dts/renesas/rzg2lc-smarc-pinfunction.dtsi
index 1322e5bcd456..d275a55333e3 100644
--- a/arch/arm64/boot/dts/renesas/rzg2lc-smarc-pinfunction.dtsi
+++ b/arch/arm64/boot/dts/renesas/rzg2lc-smarc-pinfunction.dtsi
@@ -106,6 +106,13 @@ sound_clk_pins: sound_clk {
input-enable;
};

+ ssi0_pins: ssi0 {
+ pinmux = <RZG2L_PORT_PINMUX(45, 0, 1)>, /* BCK */
+ <RZG2L_PORT_PINMUX(45, 1, 1)>, /* RCK */
+ <RZG2L_PORT_PINMUX(45, 2, 1)>, /* TXD */
+ <RZG2L_PORT_PINMUX(45, 3, 1)>; /* RXD */
+ };
+
usb0_pins: usb0 {
pinmux = <RZG2L_PORT_PINMUX(4, 0, 1)>, /* VBUS */
<RZG2L_PORT_PINMUX(5, 0, 1)>, /* OVC */
--
2.25.1


[PATCH 5.10.y-cip 08/13] arm64: dts: renesas: rzg2lc-smarc: Enable i2c{0,1,2}

Biju Das
 

commit 4fa1edc83b2b2b467ed47bd682c7beab81a38ef5 upstream.

Enable i2c{0,1} on RZ/G2LC SMARC EVK by deleting respective
entries from board dts and adding pincontrol entries to the
soc-pinctrl dtsi. Also enable i2c2 by adding to soc dtsi.

Signed-off-by: Biju Das <biju.das.jz@...>
Reviewed-by: Lad Prabhakar <prabhakar.mahadev-lad.rj@...>
Link: https://lore.kernel.org/r/20220303164155.7706-4-biju.das.jz@bp.renesas.com
Signed-off-by: Geert Uytterhoeven <geert+renesas@...>
Signed-off-by: Biju Das <biju.das.jz@...>
---
arch/arm64/boot/dts/renesas/r9a07g044c2-smarc.dts | 12 ------------
.../dts/renesas/rzg2lc-smarc-pinfunction.dtsi | 15 +++++++++++++++
arch/arm64/boot/dts/renesas/rzg2lc-smarc.dtsi | 6 +++++-
3 files changed, 20 insertions(+), 13 deletions(-)

diff --git a/arch/arm64/boot/dts/renesas/r9a07g044c2-smarc.dts b/arch/arm64/boot/dts/renesas/r9a07g044c2-smarc.dts
index dc39b05e9256..52b834205126 100644
--- a/arch/arm64/boot/dts/renesas/r9a07g044c2-smarc.dts
+++ b/arch/arm64/boot/dts/renesas/r9a07g044c2-smarc.dts
@@ -14,18 +14,6 @@ / {
compatible = "renesas,smarc-evk", "renesas,r9a07g044c2", "renesas,r9a07g044";
};

-&i2c0 {
- /delete-property/ pinctrl-0;
- /delete-property/ pinctrl-names;
- status = "disabled";
-};
-
-&i2c1 {
- /delete-property/ pinctrl-0;
- /delete-property/ pinctrl-names;
- status = "disabled";
-};
-
&spi1 {
/delete-property/ pinctrl-0;
/delete-property/ pinctrl-names;
diff --git a/arch/arm64/boot/dts/renesas/rzg2lc-smarc-pinfunction.dtsi b/arch/arm64/boot/dts/renesas/rzg2lc-smarc-pinfunction.dtsi
index 53759c3ddecb..1322e5bcd456 100644
--- a/arch/arm64/boot/dts/renesas/rzg2lc-smarc-pinfunction.dtsi
+++ b/arch/arm64/boot/dts/renesas/rzg2lc-smarc-pinfunction.dtsi
@@ -35,6 +35,21 @@ can1_pins: can1 {
};
#endif

+ i2c0_pins: i2c0 {
+ pins = "RIIC0_SDA", "RIIC0_SCL";
+ input-enable;
+ };
+
+ i2c1_pins: i2c1 {
+ pins = "RIIC1_SDA", "RIIC1_SCL";
+ input-enable;
+ };
+
+ i2c2_pins: i2c2 {
+ pinmux = <RZG2L_PORT_PINMUX(42, 3, 1)>, /* SDA */
+ <RZG2L_PORT_PINMUX(42, 4, 1)>; /* SCL */
+ };
+
scif0_pins: scif0 {
pinmux = <RZG2L_PORT_PINMUX(38, 0, 1)>, /* TxD */
<RZG2L_PORT_PINMUX(38, 1, 1)>; /* RxD */
diff --git a/arch/arm64/boot/dts/renesas/rzg2lc-smarc.dtsi b/arch/arm64/boot/dts/renesas/rzg2lc-smarc.dtsi
index 55d3b73f84e7..f73b4acb8f9e 100644
--- a/arch/arm64/boot/dts/renesas/rzg2lc-smarc.dtsi
+++ b/arch/arm64/boot/dts/renesas/rzg2lc-smarc.dtsi
@@ -61,7 +61,11 @@ &canfd {
#endif

&i2c2 {
- status = "disabled";
+ pinctrl-0 = <&i2c2_pins>;
+ pinctrl-names = "default";
+ clock-frequency = <400000>;
+
+ status = "okay";

wm8978: codec@1a {
compatible = "wlf,wm8978";
--
2.25.1


[PATCH 5.10.y-cip 07/13] arm64: dts: renesas: rzg2l-smarc: Move out i2c3 and Audio codec from common dtsi

Biju Das
 

commit 0a7c1c888a0c0276837f2cd7190683474a136506 upstream.

On RZ/G2L SoM module, the Audio codec is connected to i2c3 bus whereas on
RZ/G2LC, it is connected to i2c2 bus. So move out i2c3 and wm8978 nodes
from common dtsi to soc specific dtsi.

While at it add wm8978 node to RZ/G2LC SoC specific dtsi to fix the
build error.

Signed-off-by: Biju Das <biju.das.jz@...>
Reviewed-by: Lad Prabhakar <prabhakar.mahadev-lad.rj@...>
Link: https://lore.kernel.org/r/20220303164155.7706-3-biju.das.jz@bp.renesas.com
Signed-off-by: Geert Uytterhoeven <geert+renesas@...>
Signed-off-by: Biju Das <biju.das.jz@...>
---
arch/arm64/boot/dts/renesas/r9a07g044c2-smarc.dts | 6 ------
arch/arm64/boot/dts/renesas/rz-smarc-common.dtsi | 15 ---------------
arch/arm64/boot/dts/renesas/rzg2l-smarc.dtsi | 15 +++++++++++++++
arch/arm64/boot/dts/renesas/rzg2lc-smarc.dtsi | 11 +++++++++++
4 files changed, 26 insertions(+), 21 deletions(-)

diff --git a/arch/arm64/boot/dts/renesas/r9a07g044c2-smarc.dts b/arch/arm64/boot/dts/renesas/r9a07g044c2-smarc.dts
index d5254b16b0b3..dc39b05e9256 100644
--- a/arch/arm64/boot/dts/renesas/r9a07g044c2-smarc.dts
+++ b/arch/arm64/boot/dts/renesas/r9a07g044c2-smarc.dts
@@ -26,12 +26,6 @@ &i2c1 {
status = "disabled";
};

-&i2c3 {
- /delete-property/ pinctrl-0;
- /delete-property/ pinctrl-names;
- status = "disabled";
-};
-
&spi1 {
/delete-property/ pinctrl-0;
/delete-property/ pinctrl-names;
diff --git a/arch/arm64/boot/dts/renesas/rz-smarc-common.dtsi b/arch/arm64/boot/dts/renesas/rz-smarc-common.dtsi
index 588117aafaca..8dd1c69a6749 100644
--- a/arch/arm64/boot/dts/renesas/rz-smarc-common.dtsi
+++ b/arch/arm64/boot/dts/renesas/rz-smarc-common.dtsi
@@ -26,7 +26,6 @@ aliases {
serial0 = &scif0;
i2c0 = &i2c0;
i2c1 = &i2c1;
- i2c3 = &i2c3;
};

chosen {
@@ -131,20 +130,6 @@ &i2c1 {
status = "okay";
};

-&i2c3 {
- pinctrl-0 = <&i2c3_pins>;
- pinctrl-names = "default";
- clock-frequency = <400000>;
-
- status = "okay";
-
- wm8978: codec@1a {
- compatible = "wlf,wm8978";
- #sound-dai-cells = <0>;
- reg = <0x1a>;
- };
-};
-
&ohci0 {
dr_mode = "otg";
status = "okay";
diff --git a/arch/arm64/boot/dts/renesas/rzg2l-smarc.dtsi b/arch/arm64/boot/dts/renesas/rzg2l-smarc.dtsi
index 33ddfd18bd56..c934cd3633a4 100644
--- a/arch/arm64/boot/dts/renesas/rzg2l-smarc.dtsi
+++ b/arch/arm64/boot/dts/renesas/rzg2l-smarc.dtsi
@@ -14,6 +14,21 @@
/ {
aliases {
serial1 = &scif2;
+ i2c3 = &i2c3;
+ };
+};
+
+&i2c3 {
+ pinctrl-0 = <&i2c3_pins>;
+ pinctrl-names = "default";
+ clock-frequency = <400000>;
+
+ status = "okay";
+
+ wm8978: codec@1a {
+ compatible = "wlf,wm8978";
+ #sound-dai-cells = <0>;
+ reg = <0x1a>;
};
};

diff --git a/arch/arm64/boot/dts/renesas/rzg2lc-smarc.dtsi b/arch/arm64/boot/dts/renesas/rzg2lc-smarc.dtsi
index df7631fe5fac..55d3b73f84e7 100644
--- a/arch/arm64/boot/dts/renesas/rzg2lc-smarc.dtsi
+++ b/arch/arm64/boot/dts/renesas/rzg2lc-smarc.dtsi
@@ -43,6 +43,7 @@
/ {
aliases {
serial1 = &scif1;
+ i2c2 = &i2c2;
};
};

@@ -59,6 +60,16 @@ &canfd {
};
#endif

+&i2c2 {
+ status = "disabled";
+
+ wm8978: codec@1a {
+ compatible = "wlf,wm8978";
+ #sound-dai-cells = <0>;
+ reg = <0x1a>;
+ };
+};
+
/*
* To enable SCIF1 (SER0) on PMOD1 (CN7), On connector board
* SW1 should be at position 2->3 so that SER0_CTS# line is activated
--
2.25.1


[PATCH 5.10.y-cip 06/13] arm64: dts: renesas: rzg2lc-smarc-pinfunction: Sort the nodes

Biju Das
 

commit a2b642d89e4beeddbfbd7be6108db2b7aaef78b6 upstream.

Sort the pinctrl nodes alphabetically.

Signed-off-by: Biju Das <biju.das.jz@...>
Reviewed-by: Lad Prabhakar <prabhakar.mahadev-lad.rj@...>
Link: https://lore.kernel.org/r/20220303164155.7706-2-biju.das.jz@bp.renesas.com
Signed-off-by: Geert Uytterhoeven <geert+renesas@...>
Signed-off-by: Biju Das <biju.das.jz@...>
---
.../dts/renesas/rzg2lc-smarc-pinfunction.dtsi | 24 +++++++++----------
1 file changed, 12 insertions(+), 12 deletions(-)

diff --git a/arch/arm64/boot/dts/renesas/rzg2lc-smarc-pinfunction.dtsi b/arch/arm64/boot/dts/renesas/rzg2lc-smarc-pinfunction.dtsi
index 5f5ec21e655c..53759c3ddecb 100644
--- a/arch/arm64/boot/dts/renesas/rzg2lc-smarc-pinfunction.dtsi
+++ b/arch/arm64/boot/dts/renesas/rzg2lc-smarc-pinfunction.dtsi
@@ -12,11 +12,6 @@ &pinctrl {
pinctrl-0 = <&sound_clk_pins>;
pinctrl-names = "default";

- scif0_pins: scif0 {
- pinmux = <RZG2L_PORT_PINMUX(38, 0, 1)>, /* TxD */
- <RZG2L_PORT_PINMUX(38, 1, 1)>; /* RxD */
- };
-
#if SW_SCIF_CAN
/* SW8 should be at position 2->1 */
can1_pins: can1 {
@@ -25,13 +20,6 @@ can1_pins: can1 {
};
#endif

- scif1_pins: scif1 {
- pinmux = <RZG2L_PORT_PINMUX(40, 0, 1)>, /* TxD */
- <RZG2L_PORT_PINMUX(40, 1, 1)>, /* RxD */
- <RZG2L_PORT_PINMUX(41, 0, 1)>, /* CTS# */
- <RZG2L_PORT_PINMUX(41, 1, 1)>; /* RTS# */
- };
-
#if SW_RSPI_CAN
/* SW8 should be at position 2->3 so that GPIO9_CAN1_STB line is activated */
can1-stb-hog {
@@ -47,6 +35,18 @@ can1_pins: can1 {
};
#endif

+ scif0_pins: scif0 {
+ pinmux = <RZG2L_PORT_PINMUX(38, 0, 1)>, /* TxD */
+ <RZG2L_PORT_PINMUX(38, 1, 1)>; /* RxD */
+ };
+
+ scif1_pins: scif1 {
+ pinmux = <RZG2L_PORT_PINMUX(40, 0, 1)>, /* TxD */
+ <RZG2L_PORT_PINMUX(40, 1, 1)>, /* RxD */
+ <RZG2L_PORT_PINMUX(41, 0, 1)>, /* CTS# */
+ <RZG2L_PORT_PINMUX(41, 1, 1)>; /* RTS# */
+ };
+
sd1-pwr-en-hog {
gpio-hog;
gpios = <RZG2L_GPIO(39, 2) GPIO_ACTIVE_HIGH>;
--
2.25.1


[PATCH 5.10.y-cip 05/13] arm64: dts: renesas: r9a07g044c2-smarc: Enable usb2.0

Biju Das
 

commit 1889f4798c443dfd4993ba9bbbf4ed7bf801d94b upstream.

Enable usb2.0 host/device functionality on RZ/G2LC SMARC EVK
by deleting phyrst, usb2_phy{0,1}, ehci/ohci{0,1} and hsusb
entries from board DT, so that entries from common dtsi kick
in and make USB2.0 functionality operational.

Signed-off-by: Biju Das <biju.das.jz@...>
Reviewed-by: Lad Prabhakar <prabhakar.mahadev-lad.rj@...>
Link: https://lore.kernel.org/r/20220302074043.21525-1-biju.das.jz@bp.renesas.com
Signed-off-by: Geert Uytterhoeven <geert+renesas@...>
Signed-off-by: Biju Das <biju.das.jz@...>
---
.../boot/dts/renesas/r9a07g044c2-smarc.dts | 46 -------------------
.../dts/renesas/rzg2lc-smarc-pinfunction.dtsi | 11 +++++
2 files changed, 11 insertions(+), 46 deletions(-)

diff --git a/arch/arm64/boot/dts/renesas/r9a07g044c2-smarc.dts b/arch/arm64/boot/dts/renesas/r9a07g044c2-smarc.dts
index 5a5cea82a5d9..d5254b16b0b3 100644
--- a/arch/arm64/boot/dts/renesas/r9a07g044c2-smarc.dts
+++ b/arch/arm64/boot/dts/renesas/r9a07g044c2-smarc.dts
@@ -14,24 +14,6 @@ / {
compatible = "renesas,smarc-evk", "renesas,r9a07g044c2", "renesas,r9a07g044";
};

-&ehci0 {
- /delete-property/ pinctrl-0;
- /delete-property/ pinctrl-names;
- status = "disabled";
-};
-
-&ehci1 {
- /delete-property/ pinctrl-0;
- /delete-property/ pinctrl-names;
- status = "disabled";
-};
-
-&hsusb {
- /delete-property/ pinctrl-0;
- /delete-property/ pinctrl-names;
- status = "disabled";
-};
-
&i2c0 {
/delete-property/ pinctrl-0;
/delete-property/ pinctrl-names;
@@ -50,22 +32,6 @@ &i2c3 {
status = "disabled";
};

-&ohci0 {
- /delete-property/ pinctrl-0;
- /delete-property/ pinctrl-names;
- status = "disabled";
-};
-
-&ohci1 {
- /delete-property/ pinctrl-0;
- /delete-property/ pinctrl-names;
- status = "disabled";
-};
-
-&phyrst {
- status = "disabled";
-};
-
&spi1 {
/delete-property/ pinctrl-0;
/delete-property/ pinctrl-names;
@@ -77,15 +43,3 @@ &ssi0 {
/delete-property/ pinctrl-names;
status = "disabled";
};
-
-&usb2_phy0 {
- /delete-property/ pinctrl-0;
- /delete-property/ pinctrl-names;
- status = "disabled";
-};
-
-&usb2_phy1 {
- /delete-property/ pinctrl-0;
- /delete-property/ pinctrl-names;
- status = "disabled";
-};
diff --git a/arch/arm64/boot/dts/renesas/rzg2lc-smarc-pinfunction.dtsi b/arch/arm64/boot/dts/renesas/rzg2lc-smarc-pinfunction.dtsi
index 37ff2091582e..5f5ec21e655c 100644
--- a/arch/arm64/boot/dts/renesas/rzg2lc-smarc-pinfunction.dtsi
+++ b/arch/arm64/boot/dts/renesas/rzg2lc-smarc-pinfunction.dtsi
@@ -90,5 +90,16 @@ sound_clk_pins: sound_clk {
pins = "AUDIO_CLK1", "AUDIO_CLK2";
input-enable;
};
+
+ usb0_pins: usb0 {
+ pinmux = <RZG2L_PORT_PINMUX(4, 0, 1)>, /* VBUS */
+ <RZG2L_PORT_PINMUX(5, 0, 1)>, /* OVC */
+ <RZG2L_PORT_PINMUX(5, 1, 1)>; /* OTG_ID */
+ };
+
+ usb1_pins: usb1 {
+ pinmux = <RZG2L_PORT_PINMUX(42, 0, 1)>, /* VBUS */
+ <RZG2L_PORT_PINMUX(42, 1, 1)>; /* OVC */
+ };
};

--
2.25.1


[PATCH 5.10.y-cip 04/13] arm64: dts: renesas: Align GPIO hog names with dtschema

Biju Das
 

From: Geert Uytterhoeven <geert+renesas@...>

commit 48d8ee5b831ec8b6dbe3b4313fed0adcd752e20b upstream.

Dtschema expects GPIO hogs to end with a "hog" suffix.
Also, the convention for node names is to use hyphens, not underscores.

Signed-off-by: Geert Uytterhoeven <geert+renesas@...>
Link: https://lore.kernel.org/r/baee4b9980576ffbab24122fce7147c9cbc2ea59.1645705998.git.geert+renesas@glider.be
Signed-off-by: Biju Das <biju.das.jz@...>
---
arch/arm64/boot/dts/renesas/beacon-renesom-som.dtsi | 2 +-
arch/arm64/boot/dts/renesas/hihope-common.dtsi | 2 +-
arch/arm64/boot/dts/renesas/hihope-rzg2-ex-lvds.dtsi | 2 +-
arch/arm64/boot/dts/renesas/r8a774c0-ek874-idk-2121wr.dts | 2 +-
arch/arm64/boot/dts/renesas/r9a07g054l2-smarc.dts | 4 ++--
arch/arm64/boot/dts/renesas/rzg2l-smarc-pinfunction.dtsi | 4 ++--
arch/arm64/boot/dts/renesas/rzg2lc-smarc-pinfunction.dtsi | 2 +-
7 files changed, 9 insertions(+), 9 deletions(-)

diff --git a/arch/arm64/boot/dts/renesas/beacon-renesom-som.dtsi b/arch/arm64/boot/dts/renesas/beacon-renesom-som.dtsi
index 929c7910c68d..b6b6d085600a 100644
--- a/arch/arm64/boot/dts/renesas/beacon-renesom-som.dtsi
+++ b/arch/arm64/boot/dts/renesas/beacon-renesom-som.dtsi
@@ -77,7 +77,7 @@ &extalr_clk {
};

&gpio6 {
- usb_hub_reset {
+ usb-hub-reset-hog {
gpio-hog;
gpios = <10 GPIO_ACTIVE_HIGH>;
output-high;
diff --git a/arch/arm64/boot/dts/renesas/hihope-common.dtsi b/arch/arm64/boot/dts/renesas/hihope-common.dtsi
index e8bf6f0c4c40..18f01dbb25f5 100644
--- a/arch/arm64/boot/dts/renesas/hihope-common.dtsi
+++ b/arch/arm64/boot/dts/renesas/hihope-common.dtsi
@@ -140,7 +140,7 @@ &extalr_clk {
};

&gpio6 {
- usb1-reset {
+ usb1-reset-hog {
gpio-hog;
gpios = <10 GPIO_ACTIVE_LOW>;
output-low;
diff --git a/arch/arm64/boot/dts/renesas/hihope-rzg2-ex-lvds.dtsi b/arch/arm64/boot/dts/renesas/hihope-rzg2-ex-lvds.dtsi
index 40c5e8d6d841..d66d17e34694 100644
--- a/arch/arm64/boot/dts/renesas/hihope-rzg2-ex-lvds.dtsi
+++ b/arch/arm64/boot/dts/renesas/hihope-rzg2-ex-lvds.dtsi
@@ -20,7 +20,7 @@ &gpio1 {
* When GP1_20 is LOW LVDS0 is connected to the LVDS connector
* When GP1_20 is HIGH LVDS0 is connected to the LT8918L
*/
- lvds-connector-en-gpio {
+ lvds-connector-en-hog {
gpio-hog;
gpios = <20 GPIO_ACTIVE_HIGH>;
output-low;
diff --git a/arch/arm64/boot/dts/renesas/r8a774c0-ek874-idk-2121wr.dts b/arch/arm64/boot/dts/renesas/r8a774c0-ek874-idk-2121wr.dts
index a7b27d09f6c2..c1812d1ef06a 100644
--- a/arch/arm64/boot/dts/renesas/r8a774c0-ek874-idk-2121wr.dts
+++ b/arch/arm64/boot/dts/renesas/r8a774c0-ek874-idk-2121wr.dts
@@ -68,7 +68,7 @@ &gpio0 {
* When GP0_17 is low LVDS[01] are connected to the LVDS connector
* When GP0_17 is high LVDS[01] are connected to the LT8918L
*/
- lvds-connector-en-gpio{
+ lvds-connector-en-hog {
gpio-hog;
gpios = <17 GPIO_ACTIVE_HIGH>;
output-low;
diff --git a/arch/arm64/boot/dts/renesas/r9a07g054l2-smarc.dts b/arch/arm64/boot/dts/renesas/r9a07g054l2-smarc.dts
index 49d141db53f7..fc334b4c2aa4 100644
--- a/arch/arm64/boot/dts/renesas/r9a07g054l2-smarc.dts
+++ b/arch/arm64/boot/dts/renesas/r9a07g054l2-smarc.dts
@@ -18,8 +18,8 @@ / {
};

&pinctrl {
- /delete-node/ can0-stb;
- /delete-node/ can1-stb;
+ /delete-node/ can0-stb-hog;
+ /delete-node/ can1-stb-hog;
/delete-node/ gpio-sd0-pwr-en-hog;
/delete-node/ sd0-dev-sel-hog;
/delete-node/ sd1-pwr-en-hog;
diff --git a/arch/arm64/boot/dts/renesas/rzg2l-smarc-pinfunction.dtsi b/arch/arm64/boot/dts/renesas/rzg2l-smarc-pinfunction.dtsi
index 2ef217445f72..9085d8c76ce1 100644
--- a/arch/arm64/boot/dts/renesas/rzg2l-smarc-pinfunction.dtsi
+++ b/arch/arm64/boot/dts/renesas/rzg2l-smarc-pinfunction.dtsi
@@ -18,7 +18,7 @@ can0_pins: can0 {
};

/* SW7 should be at position 2->3 so that GPIO8_CAN0_STB line is activated */
- can0-stb {
+ can0-stb-hog {
gpio-hog;
gpios = <RZG2L_GPIO(42, 2) GPIO_ACTIVE_HIGH>;
output-low;
@@ -31,7 +31,7 @@ can1_pins: can1 {
};

/* SW8 should be at position 2->3 so that GPIO9_CAN1_STB line is activated */
- can1-stb {
+ can1-stb-hog {
gpio-hog;
gpios = <RZG2L_GPIO(42, 3) GPIO_ACTIVE_HIGH>;
output-low;
diff --git a/arch/arm64/boot/dts/renesas/rzg2lc-smarc-pinfunction.dtsi b/arch/arm64/boot/dts/renesas/rzg2lc-smarc-pinfunction.dtsi
index bff56d696936..37ff2091582e 100644
--- a/arch/arm64/boot/dts/renesas/rzg2lc-smarc-pinfunction.dtsi
+++ b/arch/arm64/boot/dts/renesas/rzg2lc-smarc-pinfunction.dtsi
@@ -34,7 +34,7 @@ scif1_pins: scif1 {

#if SW_RSPI_CAN
/* SW8 should be at position 2->3 so that GPIO9_CAN1_STB line is activated */
- can1-stb {
+ can1-stb-hog {
gpio-hog;
gpios = <RZG2L_GPIO(44, 3) GPIO_ACTIVE_HIGH>;
output-low;
--
2.25.1


[PATCH 5.10.y-cip 03/13] arm64: dts: renesas: rzg2lc-smarc-som: Enable watchdog

Biju Das
 

commit d05e409e4a66f62e863b140bd1c784f2d93f2562 upstream.

Enable watchdog{0, 1, 2} interfaces on RZ/G2LC SMARC EVK.

Signed-off-by: Biju Das <biju.das.jz@...>
Link: https://lore.kernel.org/r/20220223165813.24833-1-biju.das.jz@bp.renesas.com
Signed-off-by: Geert Uytterhoeven <geert+renesas@...>
Signed-off-by: Biju Das <biju.das.jz@...>
---
arch/arm64/boot/dts/renesas/rzg2lc-smarc-som.dtsi | 14 ++++++++++++++
1 file changed, 14 insertions(+)

diff --git a/arch/arm64/boot/dts/renesas/rzg2lc-smarc-som.dtsi b/arch/arm64/boot/dts/renesas/rzg2lc-smarc-som.dtsi
index 90cb7ec45751..88a7938017aa 100644
--- a/arch/arm64/boot/dts/renesas/rzg2lc-smarc-som.dtsi
+++ b/arch/arm64/boot/dts/renesas/rzg2lc-smarc-som.dtsi
@@ -206,3 +206,17 @@ &sdhi0 {
};
#endif

+&wdt0 {
+ status = "okay";
+ timeout-sec = <60>;
+};
+
+&wdt1 {
+ status = "okay";
+ timeout-sec = <60>;
+};
+
+&wdt2 {
+ status = "okay";
+ timeout-sec = <60>;
+};
--
2.25.1


[PATCH 5.10.y-cip 02/13] arm64: dts: renesas: rzg2lc-smarc: Use SW_SD0_DEV_SEL macro for eMMC/SDHI device selection

Biju Das
 

commit 5c65ad12785205d5c57bd92e19d0296f93c19e33 upstream.

This patch replaces EMMC/SDHI macros with SW_SD0_DEV_SEL DIP-Switch
macro for eMMC/SDHI device selection.

Signed-off-by: Biju Das <biju.das.jz@...>
Link: https://lore.kernel.org/r/20220204143132.3608-1-biju.das.jz@bp.renesas.com
Signed-off-by: Geert Uytterhoeven <geert+renesas@...>
Signed-off-by: Biju Das <biju.das.jz@...>
---
arch/arm64/boot/dts/renesas/rzg2lc-smarc-som.dtsi | 14 ++------------
arch/arm64/boot/dts/renesas/rzg2lc-smarc.dtsi | 2 ++
2 files changed, 4 insertions(+), 12 deletions(-)

diff --git a/arch/arm64/boot/dts/renesas/rzg2lc-smarc-som.dtsi b/arch/arm64/boot/dts/renesas/rzg2lc-smarc-som.dtsi
index 6ebda3724f2c..90cb7ec45751 100644
--- a/arch/arm64/boot/dts/renesas/rzg2lc-smarc-som.dtsi
+++ b/arch/arm64/boot/dts/renesas/rzg2lc-smarc-som.dtsi
@@ -8,16 +8,6 @@
#include <dt-bindings/gpio/gpio.h>
#include <dt-bindings/pinctrl/rzg2l-pinctrl.h>

-/* SW1[2] should be at OFF position to enable 64 GB eMMC */
-#define EMMC 1
-
-/*
- * To enable uSD card on CN3,
- * SW1[2] should be at ON position.
- * Disable eMMC by setting "#define EMMC 0" above.
- */
-#define SDHI (!EMMC)
-
/ {
aliases {
ethernet0 = &eth0;
@@ -185,7 +175,7 @@ sd0_mux_uhs {
};
};

-#if SDHI
+#if (!SW_SD0_DEV_SEL)
&sdhi0 {
pinctrl-0 = <&sdhi0_pins>;
pinctrl-1 = <&sdhi0_pins_uhs>;
@@ -200,7 +190,7 @@ &sdhi0 {
};
#endif

-#if EMMC
+#if SW_SD0_DEV_SEL
&sdhi0 {
pinctrl-0 = <&sdhi0_emmc_pins>;
pinctrl-1 = <&sdhi0_emmc_pins>;
diff --git a/arch/arm64/boot/dts/renesas/rzg2lc-smarc.dtsi b/arch/arm64/boot/dts/renesas/rzg2lc-smarc.dtsi
index 28f21c287ba3..df7631fe5fac 100644
--- a/arch/arm64/boot/dts/renesas/rzg2lc-smarc.dtsi
+++ b/arch/arm64/boot/dts/renesas/rzg2lc-smarc.dtsi
@@ -18,6 +18,8 @@
* Please change below macros according to SW1 setting
*/

+#define SW_SD0_DEV_SEL 1
+
#define SW_SCIF_CAN 0
#if (SW_SCIF_CAN)
/* Due to HW routing, SW_RSPI_CAN is always 0 when SW_SCIF_CAN is set to 1 */
--
2.25.1

1081 - 1100 of 10169