Date   

cip-gitlab/ci/pavel/linux-test baseline-nfs: 26 runs, 14 regressions (v4.4-st20-96-g74ff989472f09) #kernelci

kernelci.org bot <bot@...>
 

cip-gitlab/ci/pavel/linux-test baseline-nfs: 26 runs, 14 regressions (v4.4-st20-96-g74ff989472f09)

Regressions Summary
-------------------

platform | arch | lab | compiler | defconfig | regressions
-----------------------------+--------+---------------+----------+------------------------------+------------
asus-C433TA-AJ0005-rammus | x86_64 | lab-collabora | gcc-10 | x86_64_defcon...6-chromebook | 1
asus-C436FA-Flip-hatch | x86_64 | lab-collabora | gcc-10 | x86_64_defcon...6-chromebook | 1
asus-C523NA-A20057-coral | x86_64 | lab-collabora | gcc-10 | x86_64_defcon...6-chromebook | 1
asus-cx9400-volteer | x86_64 | lab-collabora | gcc-10 | x86_64_defcon...6-chromebook | 1
beaglebone-black | arm | lab-broonie | gcc-10 | multi_v7_defconfig | 1
beaglebone-black | arm | lab-cip | gcc-10 | multi_v7_defconfig | 1
beaglebone-black | arm | lab-broonie | gcc-10 | omap2plus_defconfig | 1
beaglebone-black | arm | lab-cip | gcc-10 | omap2plus_defconfig | 1
cubietruck | arm | lab-baylibre | gcc-10 | sunxi_defconfig | 1
hp-11A-G6-EE-grunt | x86_64 | lab-collabora | gcc-10 | x86_64_defcon...6-chromebook | 1
hp-x360-12b-c...4020-octopus | x86_64 | lab-collabora | gcc-10 | x86_64_defcon...6-chromebook | 1
hp-x360-14-G1-sona | x86_64 | lab-collabora | gcc-10 | x86_64_defcon...6-chromebook | 1
juno-uboot | arm64 | lab-broonie | gcc-10 | defconfig | 1
rk3288-veyron-jaq | arm | lab-collabora | gcc-10 | multi_v7_defconfig | 1

Details: https://kernelci.org/test/job/cip-gitlab/branch/ci%2Fpavel%2Flinux-test/kernel/v4.4-st20-96-g74ff989472f09/plan/baseline-nfs/

Test: baseline-nfs
Tree: cip-gitlab
Branch: ci/pavel/linux-test
Describe: v4.4-st20-96-g74ff989472f09
URL: https://gitlab.com/cip-project/cip-kernel/linux-cip.git
SHA: 74ff989472f092eb06514e780a28645e8310d183


Test Regressions
----------------


platform | arch | lab | compiler | defconfig | regressions
-----------------------------+--------+---------------+----------+------------------------------+------------
asus-C433TA-AJ0005-rammus | x86_64 | lab-collabora | gcc-10 | x86_64_defcon...6-chromebook | 1

Details: https://kernelci.org/test/plan/id/62f621ba6d473a5c31daf05e

Results: 0 PASS, 1 FAIL, 0 SKIP
Full config: x86_64_defconfig+x86-chromebook
Compiler: gcc-10 (gcc (Debian 10.2.1-6) 10.2.1 20210110)
Plain log: https://storage.kernelci.org//cip-gitlab/ci-pavel-linux-test/v4.4-st20-96-g74ff989472f09/x86_64/x86_64_defconfig+x86-chromebook/gcc-10/lab-collabora/baseline-nfs-asus-C433TA-AJ0005-rammus.txt
HTML log: https://storage.kernelci.org//cip-gitlab/ci-pavel-linux-test/v4.4-st20-96-g74ff989472f09/x86_64/x86_64_defconfig+x86-chromebook/gcc-10/lab-collabora/baseline-nfs-asus-C433TA-AJ0005-rammus.html
Rootfs: http://storage.kernelci.org/images/rootfs/debian/bullseye/20220805.0/amd64/initrd.cpio.gz


* baseline-nfs.login: https://kernelci.org/test/case/id/62f621ba6d473a5c31daf05f
failing since 8 days (last pass: v5.10.131-cip13-24-ga6f4ea41fe167, first fail: v4.4.302-cip70-rt40)



platform | arch | lab | compiler | defconfig | regressions
-----------------------------+--------+---------------+----------+------------------------------+------------
asus-C436FA-Flip-hatch | x86_64 | lab-collabora | gcc-10 | x86_64_defcon...6-chromebook | 1

Details: https://kernelci.org/test/plan/id/62f622bfa154d2e8dedaf064

Results: 0 PASS, 1 FAIL, 0 SKIP
Full config: x86_64_defconfig+x86-chromebook
Compiler: gcc-10 (gcc (Debian 10.2.1-6) 10.2.1 20210110)
Plain log: https://storage.kernelci.org//cip-gitlab/ci-pavel-linux-test/v4.4-st20-96-g74ff989472f09/x86_64/x86_64_defconfig+x86-chromebook/gcc-10/lab-collabora/baseline-nfs-asus-C436FA-Flip-hatch.txt
HTML log: https://storage.kernelci.org//cip-gitlab/ci-pavel-linux-test/v4.4-st20-96-g74ff989472f09/x86_64/x86_64_defconfig+x86-chromebook/gcc-10/lab-collabora/baseline-nfs-asus-C436FA-Flip-hatch.html
Rootfs: http://storage.kernelci.org/images/rootfs/debian/bullseye/20220805.0/amd64/initrd.cpio.gz


* baseline-nfs.login: https://kernelci.org/test/case/id/62f622c0a154d2e8dedaf065
failing since 8 days (last pass: v5.10.131-cip13-24-ga6f4ea41fe167, first fail: v4.4.302-cip70-rt40)



platform | arch | lab | compiler | defconfig | regressions
-----------------------------+--------+---------------+----------+------------------------------+------------
asus-C523NA-A20057-coral | x86_64 | lab-collabora | gcc-10 | x86_64_defcon...6-chromebook | 1

Details: https://kernelci.org/test/plan/id/62f621ba038fd170ffdaf080

Results: 0 PASS, 1 FAIL, 0 SKIP
Full config: x86_64_defconfig+x86-chromebook
Compiler: gcc-10 (gcc (Debian 10.2.1-6) 10.2.1 20210110)
Plain log: https://storage.kernelci.org//cip-gitlab/ci-pavel-linux-test/v4.4-st20-96-g74ff989472f09/x86_64/x86_64_defconfig+x86-chromebook/gcc-10/lab-collabora/baseline-nfs-asus-C523NA-A20057-coral.txt
HTML log: https://storage.kernelci.org//cip-gitlab/ci-pavel-linux-test/v4.4-st20-96-g74ff989472f09/x86_64/x86_64_defconfig+x86-chromebook/gcc-10/lab-collabora/baseline-nfs-asus-C523NA-A20057-coral.html
Rootfs: http://storage.kernelci.org/images/rootfs/debian/bullseye/20220805.0/amd64/initrd.cpio.gz


* baseline-nfs.login: https://kernelci.org/test/case/id/62f621ba038fd170ffdaf081
failing since 8 days (last pass: v5.10.131-cip13-24-ga6f4ea41fe167, first fail: v4.4.302-cip70-rt40)



platform | arch | lab | compiler | defconfig | regressions
-----------------------------+--------+---------------+----------+------------------------------+------------
asus-cx9400-volteer | x86_64 | lab-collabora | gcc-10 | x86_64_defcon...6-chromebook | 1

Details: https://kernelci.org/test/plan/id/62f622c453d9cd9a0bdaf056

Results: 0 PASS, 1 FAIL, 0 SKIP
Full config: x86_64_defconfig+x86-chromebook
Compiler: gcc-10 (gcc (Debian 10.2.1-6) 10.2.1 20210110)
Plain log: https://storage.kernelci.org//cip-gitlab/ci-pavel-linux-test/v4.4-st20-96-g74ff989472f09/x86_64/x86_64_defconfig+x86-chromebook/gcc-10/lab-collabora/baseline-nfs-asus-cx9400-volteer.txt
HTML log: https://storage.kernelci.org//cip-gitlab/ci-pavel-linux-test/v4.4-st20-96-g74ff989472f09/x86_64/x86_64_defconfig+x86-chromebook/gcc-10/lab-collabora/baseline-nfs-asus-cx9400-volteer.html
Rootfs: http://storage.kernelci.org/images/rootfs/debian/bullseye/20220805.0/amd64/initrd.cpio.gz


* baseline-nfs.login: https://kernelci.org/test/case/id/62f622c453d9cd9a0bdaf057
failing since 8 days (last pass: v5.10.131-cip13-24-ga6f4ea41fe167, first fail: v4.4.302-cip70-rt40)



platform | arch | lab | compiler | defconfig | regressions
-----------------------------+--------+---------------+----------+------------------------------+------------
beaglebone-black | arm | lab-broonie | gcc-10 | multi_v7_defconfig | 1

Details: https://kernelci.org/test/plan/id/62f62249d2d3b3a0ccdaf0d5

Results: 3 PASS, 1 FAIL, 1 SKIP
Full config: multi_v7_defconfig
Compiler: gcc-10 (arm-linux-gnueabihf-gcc (Debian 10.2.1-6) 10.2.1 20210110)
Plain log: https://storage.kernelci.org//cip-gitlab/ci-pavel-linux-test/v4.4-st20-96-g74ff989472f09/arm/multi_v7_defconfig/gcc-10/lab-broonie/baseline-nfs-beaglebone-black.txt
HTML log: https://storage.kernelci.org//cip-gitlab/ci-pavel-linux-test/v4.4-st20-96-g74ff989472f09/arm/multi_v7_defconfig/gcc-10/lab-broonie/baseline-nfs-beaglebone-black.html
Rootfs: http://storage.kernelci.org/images/rootfs/debian/bullseye/20220805.0/armhf/initrd.cpio.gz


* baseline-nfs.dmesg.crit: https://kernelci.org/test/case/id/62f62249d2d3b3a0ccdaf0dc
failing since 8 days (last pass: v5.10.131-cip13-24-ga6f4ea41fe167, first fail: v4.4.302-cip70-rt40)
1 lines

2022-08-12T09:49:35.417079 / #
2022-08-12T09:49:35.424225
2022-08-12T09:49:40.443433 / # export NFS_ROOTFS='/var/lib/lava/dispatcher/tmp/409903/extract-nfsrootfs-fj04_e4n'
2022-08-12T09:49:40.454527 export NFS_ROOTFS='/var/lib/lava/dispatcher/tmp/409903/extract-nfsrootfs-fj04_e4n'
2022-08-12T09:49:42.750116 / # export NFS_SERVER_IP='192.168.56.123'
2022-08-12T09:49:42.761200 export NFS_SERVER_IP='192.168.56.123'
2022-08-12T09:49:42.866302 / # #
2022-08-12T09:49:42.873504 #
2022-08-12T09:49:42.976201 / # export SHELL=/bin/sh
2022-08-12T09:49:42.983402 export SHELL=/bin/sh
... (13 line(s) more)



platform | arch | lab | compiler | defconfig | regressions
-----------------------------+--------+---------------+----------+------------------------------+------------
beaglebone-black | arm | lab-cip | gcc-10 | multi_v7_defconfig | 1

Details: https://kernelci.org/test/plan/id/62f62362f075de92efdaf057

Results: 3 PASS, 1 FAIL, 1 SKIP
Full config: multi_v7_defconfig
Compiler: gcc-10 (arm-linux-gnueabihf-gcc (Debian 10.2.1-6) 10.2.1 20210110)
Plain log: https://storage.kernelci.org//cip-gitlab/ci-pavel-linux-test/v4.4-st20-96-g74ff989472f09/arm/multi_v7_defconfig/gcc-10/lab-cip/baseline-nfs-beaglebone-black.txt
HTML log: https://storage.kernelci.org//cip-gitlab/ci-pavel-linux-test/v4.4-st20-96-g74ff989472f09/arm/multi_v7_defconfig/gcc-10/lab-cip/baseline-nfs-beaglebone-black.html
Rootfs: http://storage.kernelci.org/images/rootfs/debian/bullseye/20220805.0/armhf/initrd.cpio.gz


* baseline-nfs.dmesg.crit: https://kernelci.org/test/case/id/62f62362f075de92efdaf05c
failing since 8 days (last pass: v5.10.131-cip13-24-ga6f4ea41fe167, first fail: v4.4.302-cip70-rt40)
1 lines

2022-08-12T09:54:26.228756 / #
2022-08-12T09:54:26.236648
2022-08-12T09:54:31.254680 / # export NFS_ROOTFS='/var/lib/lava/dispatcher/tmp/728056/extract-nfsrootfs-tr_3qe4j'
2022-08-12T09:54:31.265715 export NFS_ROOTFS='/var/lib/lava/dispatcher/tmp/728056/extract-nfsrootfs-tr_3qe4j'
2022-08-12T09:54:33.315810 / # export NFS_SERVER_IP='172.16.3.3'
2022-08-12T09:54:33.326657 export NFS_SERVER_IP='172.16.3.3'
2022-08-12T09:54:33.431656 / # #
2022-08-12T09:54:33.439743 #
2022-08-12T09:54:33.542067 / # export SHELL=/bin/sh
2022-08-12T09:54:33.550444 export SHELL=/bin/sh
... (13 line(s) more)



platform | arch | lab | compiler | defconfig | regressions
-----------------------------+--------+---------------+----------+------------------------------+------------
beaglebone-black | arm | lab-broonie | gcc-10 | omap2plus_defconfig | 1

Details: https://kernelci.org/test/plan/id/62f62429aba515596adaf080

Results: 3 PASS, 1 FAIL, 1 SKIP
Full config: omap2plus_defconfig
Compiler: gcc-10 (arm-linux-gnueabihf-gcc (Debian 10.2.1-6) 10.2.1 20210110)
Plain log: https://storage.kernelci.org//cip-gitlab/ci-pavel-linux-test/v4.4-st20-96-g74ff989472f09/arm/omap2plus_defconfig/gcc-10/lab-broonie/baseline-nfs-beaglebone-black.txt
HTML log: https://storage.kernelci.org//cip-gitlab/ci-pavel-linux-test/v4.4-st20-96-g74ff989472f09/arm/omap2plus_defconfig/gcc-10/lab-broonie/baseline-nfs-beaglebone-black.html
Rootfs: http://storage.kernelci.org/images/rootfs/debian/bullseye/20220805.0/armhf/initrd.cpio.gz


* baseline-nfs.dmesg.crit: https://kernelci.org/test/case/id/62f62429aba515596adaf087
failing since 8 days (last pass: v5.10.131-cip13, first fail: v4.4.302-cip70-rt40)
1 lines

2022-08-12T09:57:36.143155 / #
2022-08-12T09:57:36.149747
2022-08-12T09:57:41.185560 / # export NFS_ROOTFS='/var/lib/lava/dispatcher/tmp/409947/extract-nfsrootfs-b1_ep8y9'
2022-08-12T09:57:41.196710 export NFS_ROOTFS='/var/lib/lava/dispatcher/tmp/409947/extract-nfsrootfs-b1_ep8y9'
2022-08-12T09:57:43.499712 / # export NFS_SERVER_IP='192.168.56.123'
2022-08-12T09:57:43.510854 export NFS_SERVER_IP='192.168.56.123'
2022-08-12T09:57:43.621814 / # #
2022-08-12T09:57:43.626859 #
2022-08-12T09:57:43.740814 / # export SHELL=/bin/sh
2022-08-12T09:57:43.746504 export SHELL=/bin/sh
... (13 line(s) more)



platform | arch | lab | compiler | defconfig | regressions
-----------------------------+--------+---------------+----------+------------------------------+------------
beaglebone-black | arm | lab-cip | gcc-10 | omap2plus_defconfig | 1

Details: https://kernelci.org/test/plan/id/62f62709916de78755daf064

Results: 3 PASS, 1 FAIL, 1 SKIP
Full config: omap2plus_defconfig
Compiler: gcc-10 (arm-linux-gnueabihf-gcc (Debian 10.2.1-6) 10.2.1 20210110)
Plain log: https://storage.kernelci.org//cip-gitlab/ci-pavel-linux-test/v4.4-st20-96-g74ff989472f09/arm/omap2plus_defconfig/gcc-10/lab-cip/baseline-nfs-beaglebone-black.txt
HTML log: https://storage.kernelci.org//cip-gitlab/ci-pavel-linux-test/v4.4-st20-96-g74ff989472f09/arm/omap2plus_defconfig/gcc-10/lab-cip/baseline-nfs-beaglebone-black.html
Rootfs: http://storage.kernelci.org/images/rootfs/debian/bullseye/20220805.0/armhf/initrd.cpio.gz


* baseline-nfs.dmesg.crit: https://kernelci.org/test/case/id/62f62709916de78755daf069
failing since 8 days (last pass: v5.10.131-cip13, first fail: v4.4.302-cip70-rt40)
1 lines

2022-08-12T10:09:59.380531 / #
2022-08-12T10:09:59.384298
2022-08-12T10:10:04.423469 / # export NFS_ROOTFS='/var/lib/lava/dispatcher/tmp/728070/extract-nfsrootfs-h59xvjh2'
2022-08-12T10:10:04.434174 export NFS_ROOTFS='/var/lib/lava/dispatcher/tmp/728070/extract-nfsrootfs-h59xvjh2'
2022-08-12T10:10:06.604462 / # export NFS_SERVER_IP='192.168.11.5'
2022-08-12T10:10:06.615162 export NFS_SERVER_IP='192.168.11.5'
2022-08-12T10:10:06.722612 / # #
2022-08-12T10:10:06.725259 #
2022-08-12T10:10:06.838169 / # export SHELL=/bin/sh
2022-08-12T10:10:06.840833 export SHELL=/bin/sh
... (13 line(s) more)



platform | arch | lab | compiler | defconfig | regressions
-----------------------------+--------+---------------+----------+------------------------------+------------
cubietruck | arm | lab-baylibre | gcc-10 | sunxi_defconfig | 1

Details: https://kernelci.org/test/plan/id/62f62890563665eca7daf064

Results: 0 PASS, 1 FAIL, 0 SKIP
Full config: sunxi_defconfig
Compiler: gcc-10 (arm-linux-gnueabihf-gcc (Debian 10.2.1-6) 10.2.1 20210110)
Plain log: https://storage.kernelci.org//cip-gitlab/ci-pavel-linux-test/v4.4-st20-96-g74ff989472f09/arm/sunxi_defconfig/gcc-10/lab-baylibre/baseline-nfs-cubietruck.txt
HTML log: https://storage.kernelci.org//cip-gitlab/ci-pavel-linux-test/v4.4-st20-96-g74ff989472f09/arm/sunxi_defconfig/gcc-10/lab-baylibre/baseline-nfs-cubietruck.html
Rootfs: http://storage.kernelci.org/images/rootfs/debian/bullseye/20220805.0/armhf/initrd.cpio.gz


* baseline-nfs.login: https://kernelci.org/test/case/id/62f62890563665eca7daf065
new failure (last pass: v4.4-st20-74-gc99f2b257bde3)



platform | arch | lab | compiler | defconfig | regressions
-----------------------------+--------+---------------+----------+------------------------------+------------
hp-11A-G6-EE-grunt | x86_64 | lab-collabora | gcc-10 | x86_64_defcon...6-chromebook | 1

Details: https://kernelci.org/test/plan/id/62f62224d04fa8f232daf084

Results: 0 PASS, 1 FAIL, 0 SKIP
Full config: x86_64_defconfig+x86-chromebook
Compiler: gcc-10 (gcc (Debian 10.2.1-6) 10.2.1 20210110)
Plain log: https://storage.kernelci.org//cip-gitlab/ci-pavel-linux-test/v4.4-st20-96-g74ff989472f09/x86_64/x86_64_defconfig+x86-chromebook/gcc-10/lab-collabora/baseline-nfs-hp-11A-G6-EE-grunt.txt
HTML log: https://storage.kernelci.org//cip-gitlab/ci-pavel-linux-test/v4.4-st20-96-g74ff989472f09/x86_64/x86_64_defconfig+x86-chromebook/gcc-10/lab-collabora/baseline-nfs-hp-11A-G6-EE-grunt.html
Rootfs: http://storage.kernelci.org/images/rootfs/debian/bullseye/20220805.0/amd64/initrd.cpio.gz


* baseline-nfs.login: https://kernelci.org/test/case/id/62f62224d04fa8f232daf085
failing since 8 days (last pass: v5.10.131-cip13-24-ga6f4ea41fe167, first fail: v4.4.302-cip70-rt40)



platform | arch | lab | compiler | defconfig | regressions
-----------------------------+--------+---------------+----------+------------------------------+------------
hp-x360-12b-c...4020-octopus | x86_64 | lab-collabora | gcc-10 | x86_64_defcon...6-chromebook | 1

Details: https://kernelci.org/test/plan/id/62f62410d3265e0010daf07e

Results: 0 PASS, 1 FAIL, 0 SKIP
Full config: x86_64_defconfig+x86-chromebook
Compiler: gcc-10 (gcc (Debian 10.2.1-6) 10.2.1 20210110)
Plain log: https://storage.kernelci.org//cip-gitlab/ci-pavel-linux-test/v4.4-st20-96-g74ff989472f09/x86_64/x86_64_defconfig+x86-chromebook/gcc-10/lab-collabora/baseline-nfs-hp-x360-12b-ca0010nr-n4020-octopus.txt
HTML log: https://storage.kernelci.org//cip-gitlab/ci-pavel-linux-test/v4.4-st20-96-g74ff989472f09/x86_64/x86_64_defconfig+x86-chromebook/gcc-10/lab-collabora/baseline-nfs-hp-x360-12b-ca0010nr-n4020-octopus.html
Rootfs: http://storage.kernelci.org/images/rootfs/debian/bullseye/20220805.0/amd64/initrd.cpio.gz


* baseline-nfs.login: https://kernelci.org/test/case/id/62f62410d3265e0010daf07f
failing since 8 days (last pass: v5.10.131-cip13-24-ga6f4ea41fe167, first fail: v4.4.302-cip70-rt40)



platform | arch | lab | compiler | defconfig | regressions
-----------------------------+--------+---------------+----------+------------------------------+------------
hp-x360-14-G1-sona | x86_64 | lab-collabora | gcc-10 | x86_64_defcon...6-chromebook | 1

Details: https://kernelci.org/test/plan/id/62f6288c22ccf0df82daf096

Results: 0 PASS, 1 FAIL, 0 SKIP
Full config: x86_64_defconfig+x86-chromebook
Compiler: gcc-10 (gcc (Debian 10.2.1-6) 10.2.1 20210110)
Plain log: https://storage.kernelci.org//cip-gitlab/ci-pavel-linux-test/v4.4-st20-96-g74ff989472f09/x86_64/x86_64_defconfig+x86-chromebook/gcc-10/lab-collabora/baseline-nfs-hp-x360-14-G1-sona.txt
HTML log: https://storage.kernelci.org//cip-gitlab/ci-pavel-linux-test/v4.4-st20-96-g74ff989472f09/x86_64/x86_64_defconfig+x86-chromebook/gcc-10/lab-collabora/baseline-nfs-hp-x360-14-G1-sona.html
Rootfs: http://storage.kernelci.org/images/rootfs/debian/bullseye/20220805.0/amd64/initrd.cpio.gz


* baseline-nfs.login: https://kernelci.org/test/case/id/62f6288c22ccf0df82daf097
new failure (last pass: v4.4-st20-74-gc99f2b257bde3)



platform | arch | lab | compiler | defconfig | regressions
-----------------------------+--------+---------------+----------+------------------------------+------------
juno-uboot | arm64 | lab-broonie | gcc-10 | defconfig | 1

Details: https://kernelci.org/test/plan/id/62f62382f075de92efdaf0a2

Results: 0 PASS, 1 FAIL, 0 SKIP
Full config: defconfig
Compiler: gcc-10 (aarch64-linux-gnu-gcc (Debian 10.2.1-6) 10.2.1 20210110)
Plain log: https://storage.kernelci.org//cip-gitlab/ci-pavel-linux-test/v4.4-st20-96-g74ff989472f09/arm64/defconfig/gcc-10/lab-broonie/baseline-nfs-juno-uboot.txt
HTML log: https://storage.kernelci.org//cip-gitlab/ci-pavel-linux-test/v4.4-st20-96-g74ff989472f09/arm64/defconfig/gcc-10/lab-broonie/baseline-nfs-juno-uboot.html
Rootfs: http://storage.kernelci.org/images/rootfs/debian/bullseye/20220805.0/arm64/initrd.cpio.gz


* baseline-nfs.login: https://kernelci.org/test/case/id/62f62382f075de92efdaf0a3
failing since 8 days (last pass: v5.10.131-cip13-24-ga6f4ea41fe167, first fail: v4.4.302-cip70-rt40)



platform | arch | lab | compiler | defconfig | regressions
-----------------------------+--------+---------------+----------+------------------------------+------------
rk3288-veyron-jaq | arm | lab-collabora | gcc-10 | multi_v7_defconfig | 1

Details: https://kernelci.org/test/plan/id/62f62191b5be3c77a1daf07c

Results: 0 PASS, 1 FAIL, 0 SKIP
Full config: multi_v7_defconfig
Compiler: gcc-10 (arm-linux-gnueabihf-gcc (Debian 10.2.1-6) 10.2.1 20210110)
Plain log: https://storage.kernelci.org//cip-gitlab/ci-pavel-linux-test/v4.4-st20-96-g74ff989472f09/arm/multi_v7_defconfig/gcc-10/lab-collabora/baseline-nfs-rk3288-veyron-jaq.txt
HTML log: https://storage.kernelci.org//cip-gitlab/ci-pavel-linux-test/v4.4-st20-96-g74ff989472f09/arm/multi_v7_defconfig/gcc-10/lab-collabora/baseline-nfs-rk3288-veyron-jaq.html
Rootfs: http://storage.kernelci.org/images/rootfs/debian/bullseye/20220805.0/armhf/initrd.cpio.gz


* baseline-nfs.login: https://kernelci.org/test/case/id/62f62191b5be3c77a1daf07d
failing since 8 days (last pass: v5.10.131-cip13-24-ga6f4ea41fe167, first fail: v4.4.302-cip70-rt40)


cip-gitlab/ci/pavel/linux-test baseline-cip-nfs: 6 runs, 5 regressions (v4.4-st20-96-g74ff989472f09) #kernelci

kernelci.org bot <bot@...>
 

cip-gitlab/ci/pavel/linux-test baseline-cip-nfs: 6 runs, 5 regressions (v4.4-st20-96-g74ff989472f09)

Regressions Summary
-------------------

platform | arch | lab | compiler | defconfig | regressions
-----------------------------+--------+---------------+----------+------------------------------+------------
beaglebone-black | arm | lab-broonie | gcc-10 | multi_v7_defconfig | 1
beaglebone-black | arm | lab-cip | gcc-10 | multi_v7_defconfig | 1
beaglebone-black | arm | lab-cip | gcc-10 | omap2plus_defconfig | 1
hp-11A-G6-EE-grunt | x86_64 | lab-collabora | gcc-10 | x86_64_defcon...6-chromebook | 1
hp-x360-12b-c...4020-octopus | x86_64 | lab-collabora | gcc-10 | x86_64_defcon...6-chromebook | 1

Details: https://kernelci.org/test/job/cip-gitlab/branch/ci%2Fpavel%2Flinux-test/kernel/v4.4-st20-96-g74ff989472f09/plan/baseline-cip-nfs/

Test: baseline-cip-nfs
Tree: cip-gitlab
Branch: ci/pavel/linux-test
Describe: v4.4-st20-96-g74ff989472f09
URL: https://gitlab.com/cip-project/cip-kernel/linux-cip.git
SHA: 74ff989472f092eb06514e780a28645e8310d183


Test Regressions
----------------


platform | arch | lab | compiler | defconfig | regressions
-----------------------------+--------+---------------+----------+------------------------------+------------
beaglebone-black | arm | lab-broonie | gcc-10 | multi_v7_defconfig | 1

Details: https://kernelci.org/test/plan/id/62f622fd427b3c9c18daf056

Results: 0 PASS, 1 FAIL, 0 SKIP
Full config: multi_v7_defconfig
Compiler: gcc-10 (arm-linux-gnueabihf-gcc (Debian 10.2.1-6) 10.2.1 20210110)
Plain log: https://storage.kernelci.org//cip-gitlab/ci-pavel-linux-test/v4.4-st20-96-g74ff989472f09/arm/multi_v7_defconfig/gcc-10/lab-broonie/baseline-cip-nfs-beaglebone-black.txt
HTML log: https://storage.kernelci.org//cip-gitlab/ci-pavel-linux-test/v4.4-st20-96-g74ff989472f09/arm/multi_v7_defconfig/gcc-10/lab-broonie/baseline-cip-nfs-beaglebone-black.html
Rootfs: https://storage.kernelci.org/images/rootfs/cip/20211105/qemu-arm/cip-core-image-kernelci-cip-core-buster-qemu-arm-initrd.img.gz


* baseline-cip-nfs.login: https://kernelci.org/test/case/id/62f622fd427b3c9c18daf057
new failure (last pass: v4.4-st20-74-gc99f2b257bde3)



platform | arch | lab | compiler | defconfig | regressions
-----------------------------+--------+---------------+----------+------------------------------+------------
beaglebone-black | arm | lab-cip | gcc-10 | multi_v7_defconfig | 1

Details: https://kernelci.org/test/plan/id/62f6252ddb6de29eb8daf08b

Results: 3 PASS, 1 FAIL, 0 SKIP
Full config: multi_v7_defconfig
Compiler: gcc-10 (arm-linux-gnueabihf-gcc (Debian 10.2.1-6) 10.2.1 20210110)
Plain log: https://storage.kernelci.org//cip-gitlab/ci-pavel-linux-test/v4.4-st20-96-g74ff989472f09/arm/multi_v7_defconfig/gcc-10/lab-cip/baseline-cip-nfs-beaglebone-black.txt
HTML log: https://storage.kernelci.org//cip-gitlab/ci-pavel-linux-test/v4.4-st20-96-g74ff989472f09/arm/multi_v7_defconfig/gcc-10/lab-cip/baseline-cip-nfs-beaglebone-black.html
Rootfs: https://storage.kernelci.org/images/rootfs/cip/20211105/qemu-arm/cip-core-image-kernelci-cip-core-buster-qemu-arm-initrd.img.gz


* baseline-cip-nfs.dmesg.crit: https://kernelci.org/test/case/id/62f6252ddb6de29eb8daf08e
failing since 8 days (last pass: v5.10.131-cip13-24-ga6f4ea41fe167, first fail: v4.4.302-cip70-rt40)
1 lines

2022-08-12T10:01:58.902598 / #
2022-08-12T10:01:58.910195
2022-08-12T10:02:03.941379 / # export NFS_ROOTFS='/var/lib/lava/dispatcher/tmp/728061/extract-nfsrootfs-r_66nui7'
2022-08-12T10:02:03.952586 export NFS_ROOTFS='/var/lib/lava/dispatcher/tmp/728061/extract-nfsrootfs-</lib/lava/dispatcher/tmp/728061/extract-nfsrootfs-r _66nui7'
2022-08-12T10:02:06.009947 / # export NFS_SERVER_IP='172.16.3.3'
2022-08-12T10:02:06.020845 export NFS_SERVER_IP='172.16.3.3'
2022-08-12T10:02:06.133971 / # #
2022-08-12T10:02:06.140572 #
2022-08-12T10:02:06.256540 / # export SHELL=/bin/sh
2022-08-12T10:02:06.264062 export SHELL=/bin/sh
... (13 line(s) more)



platform | arch | lab | compiler | defconfig | regressions
-----------------------------+--------+---------------+----------+------------------------------+------------
beaglebone-black | arm | lab-cip | gcc-10 | omap2plus_defconfig | 1

Details: https://kernelci.org/test/plan/id/62f6266935ab83e922daf085

Results: 3 PASS, 1 FAIL, 0 SKIP
Full config: omap2plus_defconfig
Compiler: gcc-10 (arm-linux-gnueabihf-gcc (Debian 10.2.1-6) 10.2.1 20210110)
Plain log: https://storage.kernelci.org//cip-gitlab/ci-pavel-linux-test/v4.4-st20-96-g74ff989472f09/arm/omap2plus_defconfig/gcc-10/lab-cip/baseline-cip-nfs-beaglebone-black.txt
HTML log: https://storage.kernelci.org//cip-gitlab/ci-pavel-linux-test/v4.4-st20-96-g74ff989472f09/arm/omap2plus_defconfig/gcc-10/lab-cip/baseline-cip-nfs-beaglebone-black.html
Rootfs: https://storage.kernelci.org/images/rootfs/cip/20211105/qemu-arm/cip-core-image-kernelci-cip-core-buster-qemu-arm-initrd.img.gz


* baseline-cip-nfs.dmesg.crit: https://kernelci.org/test/case/id/62f6266935ab83e922daf088
failing since 8 days (last pass: v5.10.131-cip13, first fail: v4.4.302-cip70-rt40)
1 lines

2022-08-12T10:07:16.716345 / #
2022-08-12T10:07:16.720916
2022-08-12T10:07:21.746821 / # export NFS_ROOTFS='/var/lib/lava/dispatcher/tmp/728068/extract-nfsrootfs-ec918tls'
2022-08-12T10:07:21.757539 export NFS_ROOTFS='/var/lib/lava/dispatcher/tmp/728068/extract-nfsrootfs-</lib/lava/dispatcher/tmp/728068/extract-nfsrootfs-e c918tls'
2022-08-12T10:07:23.945716 / # export NFS_SERVER_IP='192.168.11.5'
2022-08-12T10:07:23.956389 export NFS_SERVER_IP='192.168.11.5'
2022-08-12T10:07:24.081555 / # #
2022-08-12T10:07:24.084851 #
2022-08-12T10:07:24.214689 / # export SHELL=/bin/sh
2022-08-12T10:07:24.217971 export SHELL=/bin/sh
... (13 line(s) more)



platform | arch | lab | compiler | defconfig | regressions
-----------------------------+--------+---------------+----------+------------------------------+------------
hp-11A-G6-EE-grunt | x86_64 | lab-collabora | gcc-10 | x86_64_defcon...6-chromebook | 1

Details: https://kernelci.org/test/plan/id/62f628de3266b84766daf080

Results: 0 PASS, 1 FAIL, 0 SKIP
Full config: x86_64_defconfig+x86-chromebook
Compiler: gcc-10 (gcc (Debian 10.2.1-6) 10.2.1 20210110)
Plain log: https://storage.kernelci.org//cip-gitlab/ci-pavel-linux-test/v4.4-st20-96-g74ff989472f09/x86_64/x86_64_defconfig+x86-chromebook/gcc-10/lab-collabora/baseline-cip-nfs-hp-11A-G6-EE-grunt.txt
HTML log: https://storage.kernelci.org//cip-gitlab/ci-pavel-linux-test/v4.4-st20-96-g74ff989472f09/x86_64/x86_64_defconfig+x86-chromebook/gcc-10/lab-collabora/baseline-cip-nfs-hp-11A-G6-EE-grunt.html
Rootfs: https://storage.kernelci.org/images/rootfs/cip/20211105/qemu-amd64/cip-core-image-kernelci-cip-core-buster-qemu-amd64-initrd.img.gz


* baseline-cip-nfs.login: https://kernelci.org/test/case/id/62f628de3266b84766daf081
failing since 8 days (last pass: v5.10.131-cip13-24-ga6f4ea41fe167, first fail: v4.4.302-cip70-rt40)



platform | arch | lab | compiler | defconfig | regressions
-----------------------------+--------+---------------+----------+------------------------------+------------
hp-x360-12b-c...4020-octopus | x86_64 | lab-collabora | gcc-10 | x86_64_defcon...6-chromebook | 1

Details: https://kernelci.org/test/plan/id/62f622c653d9cd9a0bdaf05a

Results: 0 PASS, 1 FAIL, 0 SKIP
Full config: x86_64_defconfig+x86-chromebook
Compiler: gcc-10 (gcc (Debian 10.2.1-6) 10.2.1 20210110)
Plain log: https://storage.kernelci.org//cip-gitlab/ci-pavel-linux-test/v4.4-st20-96-g74ff989472f09/x86_64/x86_64_defconfig+x86-chromebook/gcc-10/lab-collabora/baseline-cip-nfs-hp-x360-12b-ca0010nr-n4020-octopus.txt
HTML log: https://storage.kernelci.org//cip-gitlab/ci-pavel-linux-test/v4.4-st20-96-g74ff989472f09/x86_64/x86_64_defconfig+x86-chromebook/gcc-10/lab-collabora/baseline-cip-nfs-hp-x360-12b-ca0010nr-n4020-octopus.html
Rootfs: https://storage.kernelci.org/images/rootfs/cip/20211105/qemu-amd64/cip-core-image-kernelci-cip-core-buster-qemu-amd64-initrd.img.gz


* baseline-cip-nfs.login: https://kernelci.org/test/case/id/62f622c653d9cd9a0bdaf05b
failing since 8 days (last pass: v5.10.131-cip13-24-ga6f4ea41fe167, first fail: v4.4.302-cip70-rt40)


cip-gitlab/ci/pavel/linux-test build: 176 builds: 5 failed, 171 passed, 6 errors, 185 warnings (v4.4-st20-96-g74ff989472f09) #kernelci

kernelci.org bot <bot@...>
 

cip-gitlab/ci/pavel/linux-test build: 176 builds: 5 failed, 171 passed, 6 errors, 185 warnings (v4.4-st20-96-g74ff989472f09)

Full Build Summary: https://kernelci.org/build/cip-gitlab/branch/ci%2Fpavel%2Flinux-test/kernel/v4.4-st20-96-g74ff989472f09/

Tree: cip-gitlab
Branch: ci/pavel/linux-test
Git Describe: v4.4-st20-96-g74ff989472f09
Git Commit: 74ff989472f092eb06514e780a28645e8310d183
Git URL: https://gitlab.com/cip-project/cip-kernel/linux-cip.git
Built: 6 unique architectures

Build Failures Detected:

arm:
rpc_defconfig: (gcc-10) FAIL

mips:
fuloong2e_defconfig: (gcc-10) FAIL
ip27_defconfig: (gcc-10) FAIL
ip28_defconfig: (gcc-10) FAIL
lemote2f_defconfig: (gcc-10) FAIL

Errors and Warnings Detected:

arc:
axs103_defconfig (gcc-10): 1 warning
nsim_hs_defconfig (gcc-10): 1 warning
nsimosci_hs_defconfig (gcc-10): 1 warning
nsimosci_hs_smp_defconfig (gcc-10): 1 warning
vdk_hs38_defconfig (gcc-10): 1 warning

arm64:
defconfig (gcc-10): 2 warnings
defconfig+arm64-chromebook (gcc-10): 2 warnings

arm:
acs5k_defconfig (gcc-10): 1 warning
acs5k_tiny_defconfig (gcc-10): 1 warning
am200epdkit_defconfig (gcc-10): 1 warning
assabet_defconfig (gcc-10): 1 warning
at91_dt_defconfig (gcc-10): 1 warning
axm55xx_defconfig (gcc-10): 1 warning
badge4_defconfig (gcc-10): 1 warning
bcm2835_defconfig (gcc-10): 1 warning
cerfcube_defconfig (gcc-10): 1 warning
clps711x_defconfig (gcc-10): 2 warnings
cm_x2xx_defconfig (gcc-10): 1 warning
colibri_pxa270_defconfig (gcc-10): 1 warning
colibri_pxa300_defconfig (gcc-10): 1 warning
collie_defconfig (gcc-10): 1 warning
corgi_defconfig (gcc-10): 1 warning
davinci_all_defconfig (gcc-10): 2 warnings
ebsa110_defconfig (gcc-10): 1 warning
efm32_defconfig (gcc-10): 1 warning
em_x270_defconfig (gcc-10): 1 warning
ep93xx_defconfig (gcc-10): 1 warning
eseries_pxa_defconfig (gcc-10): 1 warning
exynos_defconfig (gcc-10): 1 warning
ezx_defconfig (gcc-10): 1 warning
footbridge_defconfig (gcc-10): 1 warning
h3600_defconfig (gcc-10): 1 warning
h5000_defconfig (gcc-10): 1 warning
hackkit_defconfig (gcc-10): 1 warning
hisi_defconfig (gcc-10): 1 warning
imote2_defconfig (gcc-10): 1 warning
imx_v6_v7_defconfig (gcc-10): 1 warning
integrator_defconfig (gcc-10): 1 warning
iop13xx_defconfig (gcc-10): 1 warning
iop32x_defconfig (gcc-10): 1 warning
iop33x_defconfig (gcc-10): 1 warning
ixp4xx_defconfig (gcc-10): 1 warning
jornada720_defconfig (gcc-10): 1 warning
keystone_defconfig (gcc-10): 1 warning
ks8695_defconfig (gcc-10): 1 warning
lart_defconfig (gcc-10): 1 warning
lpc18xx_defconfig (gcc-10): 1 warning
lpc32xx_defconfig (gcc-10): 2 warnings
lpd270_defconfig (gcc-10): 1 warning
lubbock_defconfig (gcc-10): 1 warning
magician_defconfig (gcc-10): 1 warning
mainstone_defconfig (gcc-10): 1 warning
mini2440_defconfig (gcc-10): 2 warnings
mmp2_defconfig (gcc-10): 1 warning
multi_v5_defconfig (gcc-10): 1 warning
multi_v7_defconfig (gcc-10): 1 warning
mv78xx0_defconfig (gcc-10): 1 warning
mvebu_v5_defconfig (gcc-10): 1 warning
mvebu_v7_defconfig (gcc-10): 1 warning
mxs_defconfig (gcc-10): 2 warnings
neponset_defconfig (gcc-10): 1 warning
netwinder_defconfig (gcc-10): 1 warning
nhk8815_defconfig (gcc-10): 1 warning
omap1_defconfig (gcc-10): 2 warnings
omap2plus_defconfig (gcc-10): 1 warning
orion5x_defconfig (gcc-10): 1 warning
palmz72_defconfig (gcc-10): 1 warning
pcm027_defconfig (gcc-10): 1 warning
pleb_defconfig (gcc-10): 1 warning
pxa255-idp_defconfig (gcc-10): 1 warning
pxa3xx_defconfig (gcc-10): 1 warning
pxa910_defconfig (gcc-10): 1 warning
qcom_defconfig (gcc-10): 1 warning
raumfeld_defconfig (gcc-10): 1 warning
realview-smp_defconfig (gcc-10): 1 warning
realview_defconfig (gcc-10): 1 warning
rpc_defconfig (gcc-10): 2 errors
s3c2410_defconfig (gcc-10): 2 warnings
s3c6400_defconfig (gcc-10): 2 warnings
sama5_defconfig (gcc-10): 1 warning
shannon_defconfig (gcc-10): 1 warning
shmobile_defconfig (gcc-10): 1 warning
simpad_defconfig (gcc-10): 1 warning
socfpga_defconfig (gcc-10): 1 warning
spear13xx_defconfig (gcc-10): 1 warning
spitz_defconfig (gcc-10): 1 warning
sunxi_defconfig (gcc-10): 1 warning
tegra_defconfig (gcc-10): 1 warning
trizeps4_defconfig (gcc-10): 1 warning
u8500_defconfig (gcc-10): 1 warning
versatile_defconfig (gcc-10): 1 warning
vexpress_defconfig (gcc-10): 1 warning
viper_defconfig (gcc-10): 1 warning
vt8500_v6_v7_defconfig (gcc-10): 1 warning
xcep_defconfig (gcc-10): 1 warning
zeus_defconfig (gcc-10): 1 warning

i386:
i386_defconfig (gcc-10): 5 warnings

mips:
ar7_defconfig (gcc-10): 1 warning
ath79_defconfig (gcc-10): 1 warning
bcm47xx_defconfig (gcc-10): 1 warning
bcm63xx_defconfig (gcc-10): 1 warning
bigsur_defconfig (gcc-10): 1 warning
bmips_be_defconfig (gcc-10): 1 warning
bmips_stb_defconfig (gcc-10): 1 warning
capcella_defconfig (gcc-10): 1 warning
cavium_octeon_defconfig (gcc-10): 1 warning
ci20_defconfig (gcc-10): 1 warning
cobalt_defconfig (gcc-10): 1 warning
db1xxx_defconfig (gcc-10): 1 warning
decstation_defconfig (gcc-10): 1 warning
fuloong2e_defconfig (gcc-10): 2 errors
ip22_defconfig (gcc-10): 2 warnings
ip32_defconfig (gcc-10): 1 warning
jazz_defconfig (gcc-10): 1 warning
jmr3927_defconfig (gcc-10): 1 warning
lasat_defconfig (gcc-10): 1 warning
lemote2f_defconfig (gcc-10): 2 errors
loongson3_defconfig (gcc-10): 1 warning
ls1b_defconfig (gcc-10): 1 warning
malta_defconfig (gcc-10): 1 warning
malta_kvm_defconfig (gcc-10): 1 warning
malta_kvm_guest_defconfig (gcc-10): 1 warning
maltaaprp_defconfig (gcc-10): 1 warning
maltasmvp_defconfig (gcc-10): 1 warning
maltaup_defconfig (gcc-10): 1 warning
maltaup_xpa_defconfig (gcc-10): 1 warning
markeins_defconfig (gcc-10): 1 warning
mips_paravirt_defconfig (gcc-10): 1 warning
mpc30x_defconfig (gcc-10): 1 warning
mtx1_defconfig (gcc-10): 4 warnings
nlm_xlp_defconfig (gcc-10): 1 warning
nlm_xlr_defconfig (gcc-10): 1 warning
pnx8335_stb225_defconfig (gcc-10): 1 warning
qi_lb60_defconfig (gcc-10): 1 warning
rbtx49xx_defconfig (gcc-10): 1 warning
rm200_defconfig (gcc-10): 1 warning
rt305x_defconfig (gcc-10): 1 warning
sb1250_swarm_defconfig (gcc-10): 1 warning
sead3_defconfig (gcc-10): 1 warning
sead3micro_defconfig (gcc-10): 1 warning
tb0219_defconfig (gcc-10): 1 warning
tb0226_defconfig (gcc-10): 1 warning
tb0287_defconfig (gcc-10): 1 warning
workpad_defconfig (gcc-10): 1 warning
xway_defconfig (gcc-10): 1 warning

x86_64:
allnoconfig (gcc-10): 4 warnings
tinyconfig (gcc-10): 3 warnings
x86_64_defconfig (gcc-10): 9 warnings
x86_64_defconfig+x86-chromebook (gcc-10): 9 warnings

Errors summary:

4 cc1: error: ‘-mloongson-mmi’ must be used with ‘-mhard-float’
1 arm-linux-gnueabihf-gcc: error: unrecognized -march target: armv3
1 arm-linux-gnueabihf-gcc: error: missing argument to ‘-march=’

Warnings summary:

138 net/ipv4/inet_hashtables.c:608:68: warning: suggest parentheses around ‘+’ in operand of ‘&’ [-Wparentheses]
7 arch/x86/kernel/process.c:456: Warning: no instruction mnemonic suffix given and no register operands; using default for `btr'
5 net/ipv4/inet_hashtables.c:608:68: warning: suggest parentheses around '+' in operand of '&' [-Wparentheses]
4 arch/x86/entry/entry_64.S:487: Warning: no instruction mnemonic suffix given and no register operands; using default for `btr'
4 arch/x86/entry/entry_64.S:1642: Warning: no instruction mnemonic suffix given and no register operands; using default for `sysret'
3 ld: warning: creating DT_TEXTREL in a PIE
3 drivers/tty/serial/samsung.c:1776:34: warning: array ‘s3c24xx_uart_dt_match’ assumed to have one element
3 WARNING: vmlinux.o (.discard.retpoline_safe): unexpected non-allocatable section.
3 WARNING: vmlinux.o (.discard.nospec): unexpected non-allocatable section.
2 sound/pci/echoaudio/echoaudio_dsp.c:647:9: warning: iteration 1073741824 invokes undefined behavior [-Waggressive-loop-optimizations]
2 ld: arch/x86/boot/compressed/head_64.o: warning: relocation in read-only section `.head.text'
2 drivers/net/ethernet/apm/xgene/xgene_enet_main.c:32:36: warning: array ‘xgene_enet_acpi_match’ assumed to have one element
1 sound/pci/echoaudio/echoaudio_dsp.c:658:9: warning: iteration 1073741824 invokes undefined behavior [-Waggressive-loop-optimizations]
1 ld: arch/x86/boot/compressed/head_32.o: warning: relocation in read-only section `.head.text'
1 drivers/net/ethernet/seeq/sgiseeq.c:804:26: warning: passing argument 5 of ‘dma_free_attrs’ makes pointer from integer without a cast [-Wint-conversion]
1 drivers/mmc/host/sdhci-s3c.c:429:34: warning: array ‘sdhci_s3c_dt_match’ assumed to have one element
1 drivers/gpio/gpio-omap.c:1161:34: warning: array ‘omap_gpio_match’ assumed to have one element
1 arch/arm/mach-mxs/mach-mxs.c:285:26: warning: duplicate ‘const’ declaration specifier [-Wduplicate-decl-specifier]
1 arch/arm/mach-lpc32xx/phy3250.c:215:36: warning: duplicate ‘const’ declaration specifier [-Wduplicate-decl-specifier]
1 arch/arm/mach-davinci/da8xx-dt.c:23:34: warning: duplicate ‘const’ declaration specifier [-Wduplicate-decl-specifier]
1 arch/arm/mach-clps711x/board-autcpu12.c:163:26: warning: duplicate ‘const’ declaration specifier [-Wduplicate-decl-specifier]

================================================================================

Detailed per-defconfig build reports:

--------------------------------------------------------------------------------
acs5k_defconfig (arm, gcc-10) — PASS, 0 errors, 1 warning, 0 section mismatches

Warnings:
net/ipv4/inet_hashtables.c:608:68: warning: suggest parentheses around ‘+’ in operand of ‘&’ [-Wparentheses]

--------------------------------------------------------------------------------
acs5k_tiny_defconfig (arm, gcc-10) — PASS, 0 errors, 1 warning, 0 section mismatches

Warnings:
net/ipv4/inet_hashtables.c:608:68: warning: suggest parentheses around ‘+’ in operand of ‘&’ [-Wparentheses]

--------------------------------------------------------------------------------
allnoconfig (arc, gcc-10) — PASS, 0 errors, 0 warnings, 0 section mismatches

--------------------------------------------------------------------------------
allnoconfig (x86_64, gcc-10) — PASS, 0 errors, 4 warnings, 0 section mismatches

Warnings:
arch/x86/entry/entry_64.S:487: Warning: no instruction mnemonic suffix given and no register operands; using default for `btr'
arch/x86/entry/entry_64.S:1642: Warning: no instruction mnemonic suffix given and no register operands; using default for `sysret'
arch/x86/kernel/process.c:456: Warning: no instruction mnemonic suffix given and no register operands; using default for `btr'
arch/x86/kernel/process.c:456: Warning: no instruction mnemonic suffix given and no register operands; using default for `btr'

--------------------------------------------------------------------------------
allnoconfig (i386, gcc-10) — PASS, 0 errors, 0 warnings, 0 section mismatches

--------------------------------------------------------------------------------
allnoconfig (mips, gcc-10) — PASS, 0 errors, 0 warnings, 0 section mismatches

--------------------------------------------------------------------------------
allnoconfig (arm, gcc-10) — PASS, 0 errors, 0 warnings, 0 section mismatches

--------------------------------------------------------------------------------
am200epdkit_defconfig (arm, gcc-10) — PASS, 0 errors, 1 warning, 0 section mismatches

Warnings:
net/ipv4/inet_hashtables.c:608:68: warning: suggest parentheses around ‘+’ in operand of ‘&’ [-Wparentheses]

--------------------------------------------------------------------------------
ar7_defconfig (mips, gcc-10) — PASS, 0 errors, 1 warning, 0 section mismatches

Warnings:
net/ipv4/inet_hashtables.c:608:68: warning: suggest parentheses around ‘+’ in operand of ‘&’ [-Wparentheses]

--------------------------------------------------------------------------------
assabet_defconfig (arm, gcc-10) — PASS, 0 errors, 1 warning, 0 section mismatches

Warnings:
net/ipv4/inet_hashtables.c:608:68: warning: suggest parentheses around ‘+’ in operand of ‘&’ [-Wparentheses]

--------------------------------------------------------------------------------
at91_dt_defconfig (arm, gcc-10) — PASS, 0 errors, 1 warning, 0 section mismatches

Warnings:
net/ipv4/inet_hashtables.c:608:68: warning: suggest parentheses around ‘+’ in operand of ‘&’ [-Wparentheses]

--------------------------------------------------------------------------------
ath79_defconfig (mips, gcc-10) — PASS, 0 errors, 1 warning, 0 section mismatches

Warnings:
net/ipv4/inet_hashtables.c:608:68: warning: suggest parentheses around ‘+’ in operand of ‘&’ [-Wparentheses]

--------------------------------------------------------------------------------
axm55xx_defconfig (arm, gcc-10) — PASS, 0 errors, 1 warning, 0 section mismatches

Warnings:
net/ipv4/inet_hashtables.c:608:68: warning: suggest parentheses around ‘+’ in operand of ‘&’ [-Wparentheses]

--------------------------------------------------------------------------------
axs103_defconfig (arc, gcc-10) — PASS, 0 errors, 1 warning, 0 section mismatches

Warnings:
net/ipv4/inet_hashtables.c:608:68: warning: suggest parentheses around '+' in operand of '&' [-Wparentheses]

--------------------------------------------------------------------------------
badge4_defconfig (arm, gcc-10) — PASS, 0 errors, 1 warning, 0 section mismatches

Warnings:
net/ipv4/inet_hashtables.c:608:68: warning: suggest parentheses around ‘+’ in operand of ‘&’ [-Wparentheses]

--------------------------------------------------------------------------------
bcm2835_defconfig (arm, gcc-10) — PASS, 0 errors, 1 warning, 0 section mismatches

Warnings:
net/ipv4/inet_hashtables.c:608:68: warning: suggest parentheses around ‘+’ in operand of ‘&’ [-Wparentheses]

--------------------------------------------------------------------------------
bcm47xx_defconfig (mips, gcc-10) — PASS, 0 errors, 1 warning, 0 section mismatches

Warnings:
net/ipv4/inet_hashtables.c:608:68: warning: suggest parentheses around ‘+’ in operand of ‘&’ [-Wparentheses]

--------------------------------------------------------------------------------
bcm63xx_defconfig (mips, gcc-10) — PASS, 0 errors, 1 warning, 0 section mismatches

Warnings:
net/ipv4/inet_hashtables.c:608:68: warning: suggest parentheses around ‘+’ in operand of ‘&’ [-Wparentheses]

--------------------------------------------------------------------------------
bigsur_defconfig (mips, gcc-10) — PASS, 0 errors, 1 warning, 0 section mismatches

Warnings:
net/ipv4/inet_hashtables.c:608:68: warning: suggest parentheses around ‘+’ in operand of ‘&’ [-Wparentheses]

--------------------------------------------------------------------------------
bmips_be_defconfig (mips, gcc-10) — PASS, 0 errors, 1 warning, 0 section mismatches

Warnings:
net/ipv4/inet_hashtables.c:608:68: warning: suggest parentheses around ‘+’ in operand of ‘&’ [-Wparentheses]

--------------------------------------------------------------------------------
bmips_stb_defconfig (mips, gcc-10) — PASS, 0 errors, 1 warning, 0 section mismatches

Warnings:
net/ipv4/inet_hashtables.c:608:68: warning: suggest parentheses around ‘+’ in operand of ‘&’ [-Wparentheses]

--------------------------------------------------------------------------------
capcella_defconfig (mips, gcc-10) — PASS, 0 errors, 1 warning, 0 section mismatches

Warnings:
net/ipv4/inet_hashtables.c:608:68: warning: suggest parentheses around ‘+’ in operand of ‘&’ [-Wparentheses]

--------------------------------------------------------------------------------
cavium_octeon_defconfig (mips, gcc-10) — PASS, 0 errors, 1 warning, 0 section mismatches

Warnings:
net/ipv4/inet_hashtables.c:608:68: warning: suggest parentheses around ‘+’ in operand of ‘&’ [-Wparentheses]

--------------------------------------------------------------------------------
cerfcube_defconfig (arm, gcc-10) — PASS, 0 errors, 1 warning, 0 section mismatches

Warnings:
net/ipv4/inet_hashtables.c:608:68: warning: suggest parentheses around ‘+’ in operand of ‘&’ [-Wparentheses]

--------------------------------------------------------------------------------
ci20_defconfig (mips, gcc-10) — PASS, 0 errors, 1 warning, 0 section mismatches

Warnings:
net/ipv4/inet_hashtables.c:608:68: warning: suggest parentheses around ‘+’ in operand of ‘&’ [-Wparentheses]

--------------------------------------------------------------------------------
clps711x_defconfig (arm, gcc-10) — PASS, 0 errors, 2 warnings, 0 section mismatches

Warnings:
arch/arm/mach-clps711x/board-autcpu12.c:163:26: warning: duplicate ‘const’ declaration specifier [-Wduplicate-decl-specifier]
net/ipv4/inet_hashtables.c:608:68: warning: suggest parentheses around ‘+’ in operand of ‘&’ [-Wparentheses]

--------------------------------------------------------------------------------
cm_x2xx_defconfig (arm, gcc-10) — PASS, 0 errors, 1 warning, 0 section mismatches

Warnings:
net/ipv4/inet_hashtables.c:608:68: warning: suggest parentheses around ‘+’ in operand of ‘&’ [-Wparentheses]

--------------------------------------------------------------------------------
cobalt_defconfig (mips, gcc-10) — PASS, 0 errors, 1 warning, 0 section mismatches

Warnings:
net/ipv4/inet_hashtables.c:608:68: warning: suggest parentheses around ‘+’ in operand of ‘&’ [-Wparentheses]

--------------------------------------------------------------------------------
colibri_pxa270_defconfig (arm, gcc-10) — PASS, 0 errors, 1 warning, 0 section mismatches

Warnings:
net/ipv4/inet_hashtables.c:608:68: warning: suggest parentheses around ‘+’ in operand of ‘&’ [-Wparentheses]

--------------------------------------------------------------------------------
colibri_pxa300_defconfig (arm, gcc-10) — PASS, 0 errors, 1 warning, 0 section mismatches

Warnings:
net/ipv4/inet_hashtables.c:608:68: warning: suggest parentheses around ‘+’ in operand of ‘&’ [-Wparentheses]

--------------------------------------------------------------------------------
collie_defconfig (arm, gcc-10) — PASS, 0 errors, 1 warning, 0 section mismatches

Warnings:
net/ipv4/inet_hashtables.c:608:68: warning: suggest parentheses around ‘+’ in operand of ‘&’ [-Wparentheses]

--------------------------------------------------------------------------------
corgi_defconfig (arm, gcc-10) — PASS, 0 errors, 1 warning, 0 section mismatches

Warnings:
net/ipv4/inet_hashtables.c:608:68: warning: suggest parentheses around ‘+’ in operand of ‘&’ [-Wparentheses]

--------------------------------------------------------------------------------
davinci_all_defconfig (arm, gcc-10) — PASS, 0 errors, 2 warnings, 0 section mismatches

Warnings:
arch/arm/mach-davinci/da8xx-dt.c:23:34: warning: duplicate ‘const’ declaration specifier [-Wduplicate-decl-specifier]
net/ipv4/inet_hashtables.c:608:68: warning: suggest parentheses around ‘+’ in operand of ‘&’ [-Wparentheses]

--------------------------------------------------------------------------------
db1xxx_defconfig (mips, gcc-10) — PASS, 0 errors, 1 warning, 0 section mismatches

Warnings:
net/ipv4/inet_hashtables.c:608:68: warning: suggest parentheses around ‘+’ in operand of ‘&’ [-Wparentheses]

--------------------------------------------------------------------------------
decstation_defconfig (mips, gcc-10) — PASS, 0 errors, 1 warning, 0 section mismatches

Warnings:
net/ipv4/inet_hashtables.c:608:68: warning: suggest parentheses around ‘+’ in operand of ‘&’ [-Wparentheses]

--------------------------------------------------------------------------------
defconfig (arm64, gcc-10) — PASS, 0 errors, 2 warnings, 0 section mismatches

Warnings:
net/ipv4/inet_hashtables.c:608:68: warning: suggest parentheses around ‘+’ in operand of ‘&’ [-Wparentheses]
drivers/net/ethernet/apm/xgene/xgene_enet_main.c:32:36: warning: array ‘xgene_enet_acpi_match’ assumed to have one element

--------------------------------------------------------------------------------
defconfig+arm64-chromebook (arm64, gcc-10) — PASS, 0 errors, 2 warnings, 0 section mismatches

Warnings:
net/ipv4/inet_hashtables.c:608:68: warning: suggest parentheses around ‘+’ in operand of ‘&’ [-Wparentheses]
drivers/net/ethernet/apm/xgene/xgene_enet_main.c:32:36: warning: array ‘xgene_enet_acpi_match’ assumed to have one element

--------------------------------------------------------------------------------
e55_defconfig (mips, gcc-10) — PASS, 0 errors, 0 warnings, 0 section mismatches

--------------------------------------------------------------------------------
ebsa110_defconfig (arm, gcc-10) — PASS, 0 errors, 1 warning, 0 section mismatches

Warnings:
net/ipv4/inet_hashtables.c:608:68: warning: suggest parentheses around ‘+’ in operand of ‘&’ [-Wparentheses]

--------------------------------------------------------------------------------
efm32_defconfig (arm, gcc-10) — PASS, 0 errors, 1 warning, 0 section mismatches

Warnings:
net/ipv4/inet_hashtables.c:608:68: warning: suggest parentheses around ‘+’ in operand of ‘&’ [-Wparentheses]

--------------------------------------------------------------------------------
em_x270_defconfig (arm, gcc-10) — PASS, 0 errors, 1 warning, 0 section mismatches

Warnings:
net/ipv4/inet_hashtables.c:608:68: warning: suggest parentheses around ‘+’ in operand of ‘&’ [-Wparentheses]

--------------------------------------------------------------------------------
ep93xx_defconfig (arm, gcc-10) — PASS, 0 errors, 1 warning, 0 section mismatches

Warnings:
net/ipv4/inet_hashtables.c:608:68: warning: suggest parentheses around ‘+’ in operand of ‘&’ [-Wparentheses]

--------------------------------------------------------------------------------
eseries_pxa_defconfig (arm, gcc-10) — PASS, 0 errors, 1 warning, 0 section mismatches

Warnings:
net/ipv4/inet_hashtables.c:608:68: warning: suggest parentheses around ‘+’ in operand of ‘&’ [-Wparentheses]

--------------------------------------------------------------------------------
exynos_defconfig (arm, gcc-10) — PASS, 0 errors, 1 warning, 0 section mismatches

Warnings:
net/ipv4/inet_hashtables.c:608:68: warning: suggest parentheses around ‘+’ in operand of ‘&’ [-Wparentheses]

--------------------------------------------------------------------------------
ezx_defconfig (arm, gcc-10) — PASS, 0 errors, 1 warning, 0 section mismatches

Warnings:
net/ipv4/inet_hashtables.c:608:68: warning: suggest parentheses around ‘+’ in operand of ‘&’ [-Wparentheses]

--------------------------------------------------------------------------------
footbridge_defconfig (arm, gcc-10) — PASS, 0 errors, 1 warning, 0 section mismatches

Warnings:
net/ipv4/inet_hashtables.c:608:68: warning: suggest parentheses around ‘+’ in operand of ‘&’ [-Wparentheses]

--------------------------------------------------------------------------------
fuloong2e_defconfig (mips, gcc-10) — FAIL, 2 errors, 0 warnings, 0 section mismatches

Errors:
cc1: error: ‘-mloongson-mmi’ must be used with ‘-mhard-float’
cc1: error: ‘-mloongson-mmi’ must be used with ‘-mhard-float’

--------------------------------------------------------------------------------
h3600_defconfig (arm, gcc-10) — PASS, 0 errors, 1 warning, 0 section mismatches

Warnings:
net/ipv4/inet_hashtables.c:608:68: warning: suggest parentheses around ‘+’ in operand of ‘&’ [-Wparentheses]

--------------------------------------------------------------------------------
h5000_defconfig (arm, gcc-10) — PASS, 0 errors, 1 warning, 0 section mismatches

Warnings:
net/ipv4/inet_hashtables.c:608:68: warning: suggest parentheses around ‘+’ in operand of ‘&’ [-Wparentheses]

--------------------------------------------------------------------------------
hackkit_defconfig (arm, gcc-10) — PASS, 0 errors, 1 warning, 0 section mismatches

Warnings:
net/ipv4/inet_hashtables.c:608:68: warning: suggest parentheses around ‘+’ in operand of ‘&’ [-Wparentheses]

--------------------------------------------------------------------------------
hisi_defconfig (arm, gcc-10) — PASS, 0 errors, 1 warning, 0 section mismatches

Warnings:
net/ipv4/inet_hashtables.c:608:68: warning: suggest parentheses around ‘+’ in operand of ‘&’ [-Wparentheses]

--------------------------------------------------------------------------------
i386_defconfig (i386, gcc-10) — PASS, 0 errors, 5 warnings, 0 section mismatches

Warnings:
net/ipv4/inet_hashtables.c:608:68: warning: suggest parentheses around ‘+’ in operand of ‘&’ [-Wparentheses]
WARNING: vmlinux.o (.discard.nospec): unexpected non-allocatable section.
WARNING: vmlinux.o (.discard.retpoline_safe): unexpected non-allocatable section.
ld: arch/x86/boot/compressed/head_32.o: warning: relocation in read-only section `.head.text'
ld: warning: creating DT_TEXTREL in a PIE

--------------------------------------------------------------------------------
imote2_defconfig (arm, gcc-10) — PASS, 0 errors, 1 warning, 0 section mismatches

Warnings:
net/ipv4/inet_hashtables.c:608:68: warning: suggest parentheses around ‘+’ in operand of ‘&’ [-Wparentheses]

--------------------------------------------------------------------------------
imx_v6_v7_defconfig (arm, gcc-10) — PASS, 0 errors, 1 warning, 0 section mismatches

Warnings:
net/ipv4/inet_hashtables.c:608:68: warning: suggest parentheses around ‘+’ in operand of ‘&’ [-Wparentheses]

--------------------------------------------------------------------------------
integrator_defconfig (arm, gcc-10) — PASS, 0 errors, 1 warning, 0 section mismatches

Warnings:
net/ipv4/inet_hashtables.c:608:68: warning: suggest parentheses around ‘+’ in operand of ‘&’ [-Wparentheses]

--------------------------------------------------------------------------------
iop13xx_defconfig (arm, gcc-10) — PASS, 0 errors, 1 warning, 0 section mismatches

Warnings:
net/ipv4/inet_hashtables.c:608:68: warning: suggest parentheses around ‘+’ in operand of ‘&’ [-Wparentheses]

--------------------------------------------------------------------------------
iop32x_defconfig (arm, gcc-10) — PASS, 0 errors, 1 warning, 0 section mismatches

Warnings:
net/ipv4/inet_hashtables.c:608:68: warning: suggest parentheses around ‘+’ in operand of ‘&’ [-Wparentheses]

--------------------------------------------------------------------------------
iop33x_defconfig (arm, gcc-10) — PASS, 0 errors, 1 warning, 0 section mismatches

Warnings:
net/ipv4/inet_hashtables.c:608:68: warning: suggest parentheses around ‘+’ in operand of ‘&’ [-Wparentheses]

--------------------------------------------------------------------------------
ip22_defconfig (mips, gcc-10) — PASS, 0 errors, 2 warnings, 0 section mismatches

Warnings:
drivers/net/ethernet/seeq/sgiseeq.c:804:26: warning: passing argument 5 of ‘dma_free_attrs’ makes pointer from integer without a cast [-Wint-conversion]
net/ipv4/inet_hashtables.c:608:68: warning: suggest parentheses around ‘+’ in operand of ‘&’ [-Wparentheses]

--------------------------------------------------------------------------------
ip27_defconfig (mips, gcc-10) — FAIL, 0 errors, 0 warnings, 0 section mismatches

--------------------------------------------------------------------------------
ip28_defconfig (mips, gcc-10) — FAIL, 0 errors, 0 warnings, 0 section mismatches

--------------------------------------------------------------------------------
ip32_defconfig (mips, gcc-10) — PASS, 0 errors, 1 warning, 0 section mismatches

Warnings:
net/ipv4/inet_hashtables.c:608:68: warning: suggest parentheses around ‘+’ in operand of ‘&’ [-Wparentheses]

--------------------------------------------------------------------------------
ixp4xx_defconfig (arm, gcc-10) — PASS, 0 errors, 1 warning, 0 section mismatches

Warnings:
net/ipv4/inet_hashtables.c:608:68: warning: suggest parentheses around ‘+’ in operand of ‘&’ [-Wparentheses]

--------------------------------------------------------------------------------
jazz_defconfig (mips, gcc-10) — PASS, 0 errors, 1 warning, 0 section mismatches

Warnings:
net/ipv4/inet_hashtables.c:608:68: warning: suggest parentheses around ‘+’ in operand of ‘&’ [-Wparentheses]

--------------------------------------------------------------------------------
jmr3927_defconfig (mips, gcc-10) — PASS, 0 errors, 1 warning, 0 section mismatches

Warnings:
net/ipv4/inet_hashtables.c:608:68: warning: suggest parentheses around ‘+’ in operand of ‘&’ [-Wparentheses]

--------------------------------------------------------------------------------
jornada720_defconfig (arm, gcc-10) — PASS, 0 errors, 1 warning, 0 section mismatches

Warnings:
net/ipv4/inet_hashtables.c:608:68: warning: suggest parentheses around ‘+’ in operand of ‘&’ [-Wparentheses]

--------------------------------------------------------------------------------
keystone_defconfig (arm, gcc-10) — PASS, 0 errors, 1 warning, 0 section mismatches

Warnings:
net/ipv4/inet_hashtables.c:608:68: warning: suggest parentheses around ‘+’ in operand of ‘&’ [-Wparentheses]

--------------------------------------------------------------------------------
ks8695_defconfig (arm, gcc-10) — PASS, 0 errors, 1 warning, 0 section mismatches

Warnings:
net/ipv4/inet_hashtables.c:608:68: warning: suggest parentheses around ‘+’ in operand of ‘&’ [-Wparentheses]

--------------------------------------------------------------------------------
lart_defconfig (arm, gcc-10) — PASS, 0 errors, 1 warning, 0 section mismatches

Warnings:
net/ipv4/inet_hashtables.c:608:68: warning: suggest parentheses around ‘+’ in operand of ‘&’ [-Wparentheses]

--------------------------------------------------------------------------------
lasat_defconfig (mips, gcc-10) — PASS, 0 errors, 1 warning, 0 section mismatches

Warnings:
net/ipv4/inet_hashtables.c:608:68: warning: suggest parentheses around ‘+’ in operand of ‘&’ [-Wparentheses]

--------------------------------------------------------------------------------
lemote2f_defconfig (mips, gcc-10) — FAIL, 2 errors, 0 warnings, 0 section mismatches

Errors:
cc1: error: ‘-mloongson-mmi’ must be used with ‘-mhard-float’
cc1: error: ‘-mloongson-mmi’ must be used with ‘-mhard-float’

--------------------------------------------------------------------------------
loongson3_defconfig (mips, gcc-10) — PASS, 0 errors, 1 warning, 0 section mismatches

Warnings:
net/ipv4/inet_hashtables.c:608:68: warning: suggest parentheses around ‘+’ in operand of ‘&’ [-Wparentheses]

--------------------------------------------------------------------------------
lpc18xx_defconfig (arm, gcc-10) — PASS, 0 errors, 1 warning, 0 section mismatches

Warnings:
net/ipv4/inet_hashtables.c:608:68: warning: suggest parentheses around ‘+’ in operand of ‘&’ [-Wparentheses]

--------------------------------------------------------------------------------
lpc32xx_defconfig (arm, gcc-10) — PASS, 0 errors, 2 warnings, 0 section mismatches

Warnings:
arch/arm/mach-lpc32xx/phy3250.c:215:36: warning: duplicate ‘const’ declaration specifier [-Wduplicate-decl-specifier]
net/ipv4/inet_hashtables.c:608:68: warning: suggest parentheses around ‘+’ in operand of ‘&’ [-Wparentheses]

--------------------------------------------------------------------------------
lpd270_defconfig (arm, gcc-10) — PASS, 0 errors, 1 warning, 0 section mismatches

Warnings:
net/ipv4/inet_hashtables.c:608:68: warning: suggest parentheses around ‘+’ in operand of ‘&’ [-Wparentheses]

--------------------------------------------------------------------------------
ls1b_defconfig (mips, gcc-10) — PASS, 0 errors, 1 warning, 0 section mismatches

Warnings:
net/ipv4/inet_hashtables.c:608:68: warning: suggest parentheses around ‘+’ in operand of ‘&’ [-Wparentheses]

--------------------------------------------------------------------------------
lubbock_defconfig (arm, gcc-10) — PASS, 0 errors, 1 warning, 0 section mismatches

Warnings:
net/ipv4/inet_hashtables.c:608:68: warning: suggest parentheses around ‘+’ in operand of ‘&’ [-Wparentheses]

--------------------------------------------------------------------------------
magician_defconfig (arm, gcc-10) — PASS, 0 errors, 1 warning, 0 section mismatches

Warnings:
net/ipv4/inet_hashtables.c:608:68: warning: suggest parentheses around ‘+’ in operand of ‘&’ [-Wparentheses]

--------------------------------------------------------------------------------
mainstone_defconfig (arm, gcc-10) — PASS, 0 errors, 1 warning, 0 section mismatches

Warnings:
net/ipv4/inet_hashtables.c:608:68: warning: suggest parentheses around ‘+’ in operand of ‘&’ [-Wparentheses]

--------------------------------------------------------------------------------
malta_defconfig (mips, gcc-10) — PASS, 0 errors, 1 warning, 0 section mismatches

Warnings:
net/ipv4/inet_hashtables.c:608:68: warning: suggest parentheses around ‘+’ in operand of ‘&’ [-Wparentheses]

--------------------------------------------------------------------------------
malta_kvm_defconfig (mips, gcc-10) — PASS, 0 errors, 1 warning, 0 section mismatches

Warnings:
net/ipv4/inet_hashtables.c:608:68: warning: suggest parentheses around ‘+’ in operand of ‘&’ [-Wparentheses]

--------------------------------------------------------------------------------
malta_kvm_guest_defconfig (mips, gcc-10) — PASS, 0 errors, 1 warning, 0 section mismatches

Warnings:
net/ipv4/inet_hashtables.c:608:68: warning: suggest parentheses around ‘+’ in operand of ‘&’ [-Wparentheses]

--------------------------------------------------------------------------------
maltaaprp_defconfig (mips, gcc-10) — PASS, 0 errors, 1 warning, 0 section mismatches

Warnings:
net/ipv4/inet_hashtables.c:608:68: warning: suggest parentheses around ‘+’ in operand of ‘&’ [-Wparentheses]

--------------------------------------------------------------------------------
maltasmvp_defconfig (mips, gcc-10) — PASS, 0 errors, 1 warning, 0 section mismatches

Warnings:
net/ipv4/inet_hashtables.c:608:68: warning: suggest parentheses around ‘+’ in operand of ‘&’ [-Wparentheses]

--------------------------------------------------------------------------------
maltaup_defconfig (mips, gcc-10) — PASS, 0 errors, 1 warning, 0 section mismatches

Warnings:
net/ipv4/inet_hashtables.c:608:68: warning: suggest parentheses around ‘+’ in operand of ‘&’ [-Wparentheses]

--------------------------------------------------------------------------------
maltaup_xpa_defconfig (mips, gcc-10) — PASS, 0 errors, 1 warning, 0 section mismatches

Warnings:
net/ipv4/inet_hashtables.c:608:68: warning: suggest parentheses around ‘+’ in operand of ‘&’ [-Wparentheses]

--------------------------------------------------------------------------------
markeins_defconfig (mips, gcc-10) — PASS, 0 errors, 1 warning, 0 section mismatches

Warnings:
net/ipv4/inet_hashtables.c:608:68: warning: suggest parentheses around ‘+’ in operand of ‘&’ [-Wparentheses]

--------------------------------------------------------------------------------
mini2440_defconfig (arm, gcc-10) — PASS, 0 errors, 2 warnings, 0 section mismatches

Warnings:
net/ipv4/inet_hashtables.c:608:68: warning: suggest parentheses around ‘+’ in operand of ‘&’ [-Wparentheses]
drivers/tty/serial/samsung.c:1776:34: warning: array ‘s3c24xx_uart_dt_match’ assumed to have one element

--------------------------------------------------------------------------------
mips_paravirt_defconfig (mips, gcc-10) — PASS, 0 errors, 1 warning, 0 section mismatches

Warnings:
net/ipv4/inet_hashtables.c:608:68: warning: suggest parentheses around ‘+’ in operand of ‘&’ [-Wparentheses]

--------------------------------------------------------------------------------
mmp2_defconfig (arm, gcc-10) — PASS, 0 errors, 1 warning, 0 section mismatches

Warnings:
net/ipv4/inet_hashtables.c:608:68: warning: suggest parentheses around ‘+’ in operand of ‘&’ [-Wparentheses]

--------------------------------------------------------------------------------
mpc30x_defconfig (mips, gcc-10) — PASS, 0 errors, 1 warning, 0 section mismatches

Warnings:
net/ipv4/inet_hashtables.c:608:68: warning: suggest parentheses around ‘+’ in operand of ‘&’ [-Wparentheses]

--------------------------------------------------------------------------------
mtx1_defconfig (mips, gcc-10) — PASS, 0 errors, 4 warnings, 0 section mismatches

Warnings:
net/ipv4/inet_hashtables.c:608:68: warning: suggest parentheses around ‘+’ in operand of ‘&’ [-Wparentheses]
sound/pci/echoaudio/echoaudio_dsp.c:647:9: warning: iteration 1073741824 invokes undefined behavior [-Waggressive-loop-optimizations]
sound/pci/echoaudio/echoaudio_dsp.c:658:9: warning: iteration 1073741824 invokes undefined behavior [-Waggressive-loop-optimizations]
sound/pci/echoaudio/echoaudio_dsp.c:647:9: warning: iteration 1073741824 invokes undefined behavior [-Waggressive-loop-optimizations]

--------------------------------------------------------------------------------
multi_v5_defconfig (arm, gcc-10) — PASS, 0 errors, 1 warning, 0 section mismatches

Warnings:
net/ipv4/inet_hashtables.c:608:68: warning: suggest parentheses around ‘+’ in operand of ‘&’ [-Wparentheses]

--------------------------------------------------------------------------------
multi_v7_defconfig (arm, gcc-10) — PASS, 0 errors, 1 warning, 0 section mismatches

Warnings:
net/ipv4/inet_hashtables.c:608:68: warning: suggest parentheses around ‘+’ in operand of ‘&’ [-Wparentheses]

--------------------------------------------------------------------------------
mv78xx0_defconfig (arm, gcc-10) — PASS, 0 errors, 1 warning, 0 section mismatches

Warnings:
net/ipv4/inet_hashtables.c:608:68: warning: suggest parentheses around ‘+’ in operand of ‘&’ [-Wparentheses]

--------------------------------------------------------------------------------
mvebu_v5_defconfig (arm, gcc-10) — PASS, 0 errors, 1 warning, 0 section mismatches

Warnings:
net/ipv4/inet_hashtables.c:608:68: warning: suggest parentheses around ‘+’ in operand of ‘&’ [-Wparentheses]

--------------------------------------------------------------------------------
mvebu_v7_defconfig (arm, gcc-10) — PASS, 0 errors, 1 warning, 0 section mismatches

Warnings:
net/ipv4/inet_hashtables.c:608:68: warning: suggest parentheses around ‘+’ in operand of ‘&’ [-Wparentheses]

--------------------------------------------------------------------------------
mxs_defconfig (arm, gcc-10) — PASS, 0 errors, 2 warnings, 0 section mismatches

Warnings:
arch/arm/mach-mxs/mach-mxs.c:285:26: warning: duplicate ‘const’ declaration specifier [-Wduplicate-decl-specifier]
net/ipv4/inet_hashtables.c:608:68: warning: suggest parentheses around ‘+’ in operand of ‘&’ [-Wparentheses]

--------------------------------------------------------------------------------
neponset_defconfig (arm, gcc-10) — PASS, 0 errors, 1 warning, 0 section mismatches

Warnings:
net/ipv4/inet_hashtables.c:608:68: warning: suggest parentheses around ‘+’ in operand of ‘&’ [-Wparentheses]

--------------------------------------------------------------------------------
netwinder_defconfig (arm, gcc-10) — PASS, 0 errors, 1 warning, 0 section mismatches

Warnings:
net/ipv4/inet_hashtables.c:608:68: warning: suggest parentheses around ‘+’ in operand of ‘&’ [-Wparentheses]

--------------------------------------------------------------------------------
nhk8815_defconfig (arm, gcc-10) — PASS, 0 errors, 1 warning, 0 section mismatches

Warnings:
net/ipv4/inet_hashtables.c:608:68: warning: suggest parentheses around ‘+’ in operand of ‘&’ [-Wparentheses]

--------------------------------------------------------------------------------
nlm_xlp_defconfig (mips, gcc-10) — PASS, 0 errors, 1 warning, 0 section mismatches

Warnings:
net/ipv4/inet_hashtables.c:608:68: warning: suggest parentheses around ‘+’ in operand of ‘&’ [-Wparentheses]

--------------------------------------------------------------------------------
nlm_xlr_defconfig (mips, gcc-10) — PASS, 0 errors, 1 warning, 0 section mismatches

Warnings:
net/ipv4/inet_hashtables.c:608:68: warning: suggest parentheses around ‘+’ in operand of ‘&’ [-Wparentheses]

--------------------------------------------------------------------------------
nsim_hs_defconfig (arc, gcc-10) — PASS, 0 errors, 1 warning, 0 section mismatches

Warnings:
net/ipv4/inet_hashtables.c:608:68: warning: suggest parentheses around '+' in operand of '&' [-Wparentheses]

--------------------------------------------------------------------------------
nsimosci_hs_defconfig (arc, gcc-10) — PASS, 0 errors, 1 warning, 0 section mismatches

Warnings:
net/ipv4/inet_hashtables.c:608:68: warning: suggest parentheses around '+' in operand of '&' [-Wparentheses]

--------------------------------------------------------------------------------
nsimosci_hs_smp_defconfig (arc, gcc-10) — PASS, 0 errors, 1 warning, 0 section mismatches

Warnings:
net/ipv4/inet_hashtables.c:608:68: warning: suggest parentheses around '+' in operand of '&' [-Wparentheses]

--------------------------------------------------------------------------------
nuc910_defconfig (arm, gcc-10) — PASS, 0 errors, 0 warnings, 0 section mismatches

--------------------------------------------------------------------------------
nuc950_defconfig (arm, gcc-10) — PASS, 0 errors, 0 warnings, 0 section mismatches

--------------------------------------------------------------------------------
nuc960_defconfig (arm, gcc-10) — PASS, 0 errors, 0 warnings, 0 section mismatches

--------------------------------------------------------------------------------
omap1_defconfig (arm, gcc-10) — PASS, 0 errors, 2 warnings, 0 section mismatches

Warnings:
drivers/gpio/gpio-omap.c:1161:34: warning: array ‘omap_gpio_match’ assumed to have one element
net/ipv4/inet_hashtables.c:608:68: warning: suggest parentheses around ‘+’ in operand of ‘&’ [-Wparentheses]

--------------------------------------------------------------------------------
omap2plus_defconfig (arm, gcc-10) — PASS, 0 errors, 1 warning, 0 section mismatches

Warnings:
net/ipv4/inet_hashtables.c:608:68: warning: suggest parentheses around ‘+’ in operand of ‘&’ [-Wparentheses]

--------------------------------------------------------------------------------
orion5x_defconfig (arm, gcc-10) — PASS, 0 errors, 1 warning, 0 section mismatches

Warnings:
net/ipv4/inet_hashtables.c:608:68: warning: suggest parentheses around ‘+’ in operand of ‘&’ [-Wparentheses]

--------------------------------------------------------------------------------
palmz72_defconfig (arm, gcc-10) — PASS, 0 errors, 1 warning, 0 section mismatches

Warnings:
net/ipv4/inet_hashtables.c:608:68: warning: suggest parentheses around ‘+’ in operand of ‘&’ [-Wparentheses]

--------------------------------------------------------------------------------
pcm027_defconfig (arm, gcc-10) — PASS, 0 errors, 1 warning, 0 section mismatches

Warnings:
net/ipv4/inet_hashtables.c:608:68: warning: suggest parentheses around ‘+’ in operand of ‘&’ [-Wparentheses]

--------------------------------------------------------------------------------
pleb_defconfig (arm, gcc-10) — PASS, 0 errors, 1 warning, 0 section mismatches

Warnings:
net/ipv4/inet_hashtables.c:608:68: warning: suggest parentheses around ‘+’ in operand of ‘&’ [-Wparentheses]

--------------------------------------------------------------------------------
pnx8335_stb225_defconfig (mips, gcc-10) — PASS, 0 errors, 1 warning, 0 section mismatches

Warnings:
net/ipv4/inet_hashtables.c:608:68: warning: suggest parentheses around ‘+’ in operand of ‘&’ [-Wparentheses]

--------------------------------------------------------------------------------
prima2_defconfig (arm, gcc-10) — PASS, 0 errors, 0 warnings, 0 section mismatches

--------------------------------------------------------------------------------
pxa255-idp_defconfig (arm, gcc-10) — PASS, 0 errors, 1 warning, 0 section mismatches

Warnings:
net/ipv4/inet_hashtables.c:608:68: warning: suggest parentheses around ‘+’ in operand of ‘&’ [-Wparentheses]

--------------------------------------------------------------------------------
pxa3xx_defconfig (arm, gcc-10) — PASS, 0 errors, 1 warning, 0 section mismatches

Warnings:
net/ipv4/inet_hashtables.c:608:68: warning: suggest parentheses around ‘+’ in operand of ‘&’ [-Wparentheses]

--------------------------------------------------------------------------------
pxa910_defconfig (arm, gcc-10) — PASS, 0 errors, 1 warning, 0 section mismatches

Warnings:
net/ipv4/inet_hashtables.c:608:68: warning: suggest parentheses around ‘+’ in operand of ‘&’ [-Wparentheses]

--------------------------------------------------------------------------------
qcom_defconfig (arm, gcc-10) — PASS, 0 errors, 1 warning, 0 section mismatches

Warnings:
net/ipv4/inet_hashtables.c:608:68: warning: suggest parentheses around ‘+’ in operand of ‘&’ [-Wparentheses]

--------------------------------------------------------------------------------
qi_lb60_defconfig (mips, gcc-10) — PASS, 0 errors, 1 warning, 0 section mismatches

Warnings:
net/ipv4/inet_hashtables.c:608:68: warning: suggest parentheses around ‘+’ in operand of ‘&’ [-Wparentheses]

--------------------------------------------------------------------------------
raumfeld_defconfig (arm, gcc-10) — PASS, 0 errors, 1 warning, 0 section mismatches

Warnings:
net/ipv4/inet_hashtables.c:608:68: warning: suggest parentheses around ‘+’ in operand of ‘&’ [-Wparentheses]

--------------------------------------------------------------------------------
rbtx49xx_defconfig (mips, gcc-10) — PASS, 0 errors, 1 warning, 0 section mismatches

Warnings:
net/ipv4/inet_hashtables.c:608:68: warning: suggest parentheses around ‘+’ in operand of ‘&’ [-Wparentheses]

--------------------------------------------------------------------------------
realview-smp_defconfig (arm, gcc-10) — PASS, 0 errors, 1 warning, 0 section mismatches

Warnings:
net/ipv4/inet_hashtables.c:608:68: warning: suggest parentheses around ‘+’ in operand of ‘&’ [-Wparentheses]

--------------------------------------------------------------------------------
realview_defconfig (arm, gcc-10) — PASS, 0 errors, 1 warning, 0 section mismatches

Warnings:
net/ipv4/inet_hashtables.c:608:68: warning: suggest parentheses around ‘+’ in operand of ‘&’ [-Wparentheses]

--------------------------------------------------------------------------------
rm200_defconfig (mips, gcc-10) — PASS, 0 errors, 1 warning, 0 section mismatches

Warnings:
net/ipv4/inet_hashtables.c:608:68: warning: suggest parentheses around ‘+’ in operand of ‘&’ [-Wparentheses]

--------------------------------------------------------------------------------
rpc_defconfig (arm, gcc-10) — FAIL, 2 errors, 0 warnings, 0 section mismatches

Errors:
arm-linux-gnueabihf-gcc: error: unrecognized -march target: armv3
arm-linux-gnueabihf-gcc: error: missing argument to ‘-march=’

--------------------------------------------------------------------------------
rt305x_defconfig (mips, gcc-10) — PASS, 0 errors, 1 warning, 0 section mismatches

Warnings:
net/ipv4/inet_hashtables.c:608:68: warning: suggest parentheses around ‘+’ in operand of ‘&’ [-Wparentheses]

--------------------------------------------------------------------------------
s3c2410_defconfig (arm, gcc-10) — PASS, 0 errors, 2 warnings, 0 section mismatches

Warnings:
net/ipv4/inet_hashtables.c:608:68: warning: suggest parentheses around ‘+’ in operand of ‘&’ [-Wparentheses]
drivers/tty/serial/samsung.c:1776:34: warning: array ‘s3c24xx_uart_dt_match’ assumed to have one element

--------------------------------------------------------------------------------
s3c6400_defconfig (arm, gcc-10) — PASS, 0 errors, 2 warnings, 0 section mismatches

Warnings:
drivers/mmc/host/sdhci-s3c.c:429:34: warning: array ‘sdhci_s3c_dt_match’ assumed to have one element
drivers/tty/serial/samsung.c:1776:34: warning: array ‘s3c24xx_uart_dt_match’ assumed to have one element

--------------------------------------------------------------------------------
s5pv210_defconfig (arm, gcc-10) — PASS, 0 errors, 0 warnings, 0 section mismatches

--------------------------------------------------------------------------------
sama5_defconfig (arm, gcc-10) — PASS, 0 errors, 1 warning, 0 section mismatches

Warnings:
net/ipv4/inet_hashtables.c:608:68: warning: suggest parentheses around ‘+’ in operand of ‘&’ [-Wparentheses]

--------------------------------------------------------------------------------
sb1250_swarm_defconfig (mips, gcc-10) — PASS, 0 errors, 1 warning, 0 section mismatches

Warnings:
net/ipv4/inet_hashtables.c:608:68: warning: suggest parentheses around ‘+’ in operand of ‘&’ [-Wparentheses]

--------------------------------------------------------------------------------
sead3_defconfig (mips, gcc-10) — PASS, 0 errors, 1 warning, 0 section mismatches

Warnings:
net/ipv4/inet_hashtables.c:608:68: warning: suggest parentheses around ‘+’ in operand of ‘&’ [-Wparentheses]

--------------------------------------------------------------------------------
sead3micro_defconfig (mips, gcc-10) — PASS, 0 errors, 1 warning, 0 section mismatches

Warnings:
net/ipv4/inet_hashtables.c:608:68: warning: suggest parentheses around ‘+’ in operand of ‘&’ [-Wparentheses]

--------------------------------------------------------------------------------
shannon_defconfig (arm, gcc-10) — PASS, 0 errors, 1 warning, 0 section mismatches

Warnings:
net/ipv4/inet_hashtables.c:608:68: warning: suggest parentheses around ‘+’ in operand of ‘&’ [-Wparentheses]

--------------------------------------------------------------------------------
shmobile_defconfig (arm, gcc-10) — PASS, 0 errors, 1 warning, 0 section mismatches

Warnings:
net/ipv4/inet_hashtables.c:608:68: warning: suggest parentheses around ‘+’ in operand of ‘&’ [-Wparentheses]

--------------------------------------------------------------------------------
simpad_defconfig (arm, gcc-10) — PASS, 0 errors, 1 warning, 0 section mismatches

Warnings:
net/ipv4/inet_hashtables.c:608:68: warning: suggest parentheses around ‘+’ in operand of ‘&’ [-Wparentheses]

--------------------------------------------------------------------------------
socfpga_defconfig (arm, gcc-10) — PASS, 0 errors, 1 warning, 0 section mismatches

Warnings:
net/ipv4/inet_hashtables.c:608:68: warning: suggest parentheses around ‘+’ in operand of ‘&’ [-Wparentheses]

--------------------------------------------------------------------------------
spear13xx_defconfig (arm, gcc-10) — PASS, 0 errors, 1 warning, 0 section mismatches

Warnings:
net/ipv4/inet_hashtables.c:608:68: warning: suggest parentheses around ‘+’ in operand of ‘&’ [-Wparentheses]

--------------------------------------------------------------------------------
spear3xx_defconfig (arm, gcc-10) — PASS, 0 errors, 0 warnings, 0 section mismatches

--------------------------------------------------------------------------------
spear6xx_defconfig (arm, gcc-10) — PASS, 0 errors, 0 warnings, 0 section mismatches

--------------------------------------------------------------------------------
spitz_defconfig (arm, gcc-10) — PASS, 0 errors, 1 warning, 0 section mismatches

Warnings:
net/ipv4/inet_hashtables.c:608:68: warning: suggest parentheses around ‘+’ in operand of ‘&’ [-Wparentheses]

--------------------------------------------------------------------------------
stm32_defconfig (arm, gcc-10) — PASS, 0 errors, 0 warnings, 0 section mismatches

--------------------------------------------------------------------------------
sunxi_defconfig (arm, gcc-10) — PASS, 0 errors, 1 warning, 0 section mismatches

Warnings:
net/ipv4/inet_hashtables.c:608:68: warning: suggest parentheses around ‘+’ in operand of ‘&’ [-Wparentheses]

--------------------------------------------------------------------------------
tb0219_defconfig (mips, gcc-10) — PASS, 0 errors, 1 warning, 0 section mismatches

Warnings:
net/ipv4/inet_hashtables.c:608:68: warning: suggest parentheses around ‘+’ in operand of ‘&’ [-Wparentheses]

--------------------------------------------------------------------------------
tb0226_defconfig (mips, gcc-10) — PASS, 0 errors, 1 warning, 0 section mismatches

Warnings:
net/ipv4/inet_hashtables.c:608:68: warning: suggest parentheses around ‘+’ in operand of ‘&’ [-Wparentheses]

--------------------------------------------------------------------------------
tb0287_defconfig (mips, gcc-10) — PASS, 0 errors, 1 warning, 0 section mismatches

Warnings:
net/ipv4/inet_hashtables.c:608:68: warning: suggest parentheses around ‘+’ in operand of ‘&’ [-Wparentheses]

--------------------------------------------------------------------------------
tct_hammer_defconfig (arm, gcc-10) — PASS, 0 errors, 0 warnings, 0 section mismatches

--------------------------------------------------------------------------------
tegra_defconfig (arm, gcc-10) — PASS, 0 errors, 1 warning, 0 section mismatches

Warnings:
net/ipv4/inet_hashtables.c:608:68: warning: suggest parentheses around ‘+’ in operand of ‘&’ [-Wparentheses]

--------------------------------------------------------------------------------
tinyconfig (arm, gcc-10) — PASS, 0 errors, 0 warnings, 0 section mismatches

--------------------------------------------------------------------------------
tinyconfig (mips, gcc-10) — PASS, 0 errors, 0 warnings, 0 section mismatches

--------------------------------------------------------------------------------
tinyconfig (arc, gcc-10) — PASS, 0 errors, 0 warnings, 0 section mismatches

--------------------------------------------------------------------------------
tinyconfig (x86_64, gcc-10) — PASS, 0 errors, 3 warnings, 0 section mismatches

Warnings:
arch/x86/entry/entry_64.S:487: Warning: no instruction mnemonic suffix given and no register operands; using default for `btr'
arch/x86/entry/entry_64.S:1642: Warning: no instruction mnemonic suffix given and no register operands; using default for `sysret'
arch/x86/kernel/process.c:456: Warning: no instruction mnemonic suffix given and no register operands; using default for `btr'

--------------------------------------------------------------------------------
tinyconfig (i386, gcc-10) — PASS, 0 errors, 0 warnings, 0 section mismatches

--------------------------------------------------------------------------------
trizeps4_defconfig (arm, gcc-10) — PASS, 0 errors, 1 warning, 0 section mismatches

Warnings:
net/ipv4/inet_hashtables.c:608:68: warning: suggest parentheses around ‘+’ in operand of ‘&’ [-Wparentheses]

--------------------------------------------------------------------------------
u300_defconfig (arm, gcc-10) — PASS, 0 errors, 0 warnings, 0 section mismatches

--------------------------------------------------------------------------------
u8500_defconfig (arm, gcc-10) — PASS, 0 errors, 1 warning, 0 section mismatches

Warnings:
net/ipv4/inet_hashtables.c:608:68: warning: suggest parentheses around ‘+’ in operand of ‘&’ [-Wparentheses]

--------------------------------------------------------------------------------
vdk_hs38_defconfig (arc, gcc-10) — PASS, 0 errors, 1 warning, 0 section mismatches

Warnings:
net/ipv4/inet_hashtables.c:608:68: warning: suggest parentheses around '+' in operand of '&' [-Wparentheses]

--------------------------------------------------------------------------------
versatile_defconfig (arm, gcc-10) — PASS, 0 errors, 1 warning, 0 section mismatches

Warnings:
net/ipv4/inet_hashtables.c:608:68: warning: suggest parentheses around ‘+’ in operand of ‘&’ [-Wparentheses]

--------------------------------------------------------------------------------
vexpress_defconfig (arm, gcc-10) — PASS, 0 errors, 1 warning, 0 section mismatches

Warnings:
net/ipv4/inet_hashtables.c:608:68: warning: suggest parentheses around ‘+’ in operand of ‘&’ [-Wparentheses]

--------------------------------------------------------------------------------
viper_defconfig (arm, gcc-10) — PASS, 0 errors, 1 warning, 0 section mismatches

Warnings:
net/ipv4/inet_hashtables.c:608:68: warning: suggest parentheses around ‘+’ in operand of ‘&’ [-Wparentheses]

--------------------------------------------------------------------------------
vt8500_v6_v7_defconfig (arm, gcc-10) — PASS, 0 errors, 1 warning, 0 section mismatches

Warnings:
net/ipv4/inet_hashtables.c:608:68: warning: suggest parentheses around ‘+’ in operand of ‘&’ [-Wparentheses]

--------------------------------------------------------------------------------
workpad_defconfig (mips, gcc-10) — PASS, 0 errors, 1 warning, 0 section mismatches

Warnings:
net/ipv4/inet_hashtables.c:608:68: warning: suggest parentheses around ‘+’ in operand of ‘&’ [-Wparentheses]

--------------------------------------------------------------------------------
x86_64_defconfig (x86_64, gcc-10) — PASS, 0 errors, 9 warnings, 0 section mismatches

Warnings:
arch/x86/entry/entry_64.S:487: Warning: no instruction mnemonic suffix given and no register operands; using default for `btr'
arch/x86/entry/entry_64.S:1642: Warning: no instruction mnemonic suffix given and no register operands; using default for `sysret'
arch/x86/kernel/process.c:456: Warning: no instruction mnemonic suffix given and no register operands; using default for `btr'
arch/x86/kernel/process.c:456: Warning: no instruction mnemonic suffix given and no register operands; using default for `btr'
net/ipv4/inet_hashtables.c:608:68: warning: suggest parentheses around ‘+’ in operand of ‘&’ [-Wparentheses]
WARNING: vmlinux.o (.discard.nospec): unexpected non-allocatable section.
WARNING: vmlinux.o (.discard.retpoline_safe): unexpected non-allocatable section.
ld: arch/x86/boot/compressed/head_64.o: warning: relocation in read-only section `.head.text'
ld: warning: creating DT_TEXTREL in a PIE

--------------------------------------------------------------------------------
x86_64_defconfig+x86-chromebook (x86_64, gcc-10) — PASS, 0 errors, 9 warnings, 0 section mismatches

Warnings:
arch/x86/entry/entry_64.S:487: Warning: no instruction mnemonic suffix given and no register operands; using default for `btr'
arch/x86/entry/entry_64.S:1642: Warning: no instruction mnemonic suffix given and no register operands; using default for `sysret'
arch/x86/kernel/process.c:456: Warning: no instruction mnemonic suffix given and no register operands; using default for `btr'
arch/x86/kernel/process.c:456: Warning: no instruction mnemonic suffix given and no register operands; using default for `btr'
net/ipv4/inet_hashtables.c:608:68: warning: suggest parentheses around ‘+’ in operand of ‘&’ [-Wparentheses]
WARNING: vmlinux.o (.discard.nospec): unexpected non-allocatable section.
WARNING: vmlinux.o (.discard.retpoline_safe): unexpected non-allocatable section.
ld: arch/x86/boot/compressed/head_64.o: warning: relocation in read-only section `.head.text'
ld: warning: creating DT_TEXTREL in a PIE

--------------------------------------------------------------------------------
xcep_defconfig (arm, gcc-10) — PASS, 0 errors, 1 warning, 0 section mismatches

Warnings:
net/ipv4/inet_hashtables.c:608:68: warning: suggest parentheses around ‘+’ in operand of ‘&’ [-Wparentheses]

--------------------------------------------------------------------------------
xilfpga_defconfig (mips, gcc-10) — PASS, 0 errors, 0 warnings, 0 section mismatches

--------------------------------------------------------------------------------
xway_defconfig (mips, gcc-10) — PASS, 0 errors, 1 warning, 0 section mismatches

Warnings:
net/ipv4/inet_hashtables.c:608:68: warning: suggest parentheses around ‘+’ in operand of ‘&’ [-Wparentheses]

--------------------------------------------------------------------------------
zeus_defconfig (arm, gcc-10) — PASS, 0 errors, 1 warning, 0 section mismatches

Warnings:
net/ipv4/inet_hashtables.c:608:68: warning: suggest parentheses around ‘+’ in operand of ‘&’ [-Wparentheses]

--------------------------------------------------------------------------------
zx_defconfig (arm, gcc-10) — PASS, 0 errors, 0 warnings, 0 section mismatches

---
For more info write to <info@...>


[PATCH 5.10.y-cip 11/11] spi: spi-rspi: Fix PIO fallback on RZ platforms

Lad Prabhakar
 

From: Biju Das <biju.das.jz@...>

commit b620aa3a7be346f04ae7789b165937615c6ee8d3 upstream.

RSPI IP on RZ/{A, G2L} SoC's has the same signal for both interrupt
and DMA transfer request. Setting DMARS register for DMA transfer
makes the signal to work as a DMA transfer request signal and
subsequent interrupt requests to the interrupt controller
are masked.

PIO fallback does not work as interrupt signal is disabled.

This patch fixes this issue by re-enabling the interrupts by
calling dmaengine_synchronize().

Signed-off-by: Biju Das <biju.das.jz@...>
Reviewed-by: Geert Uytterhoeven <geert+renesas@...>
Link: https://lore.kernel.org/r/20220721143449.879257-1-biju.das.jz@bp.renesas.com
Signed-off-by: Mark Brown <broonie@...>
Signed-off-by: Lad Prabhakar <prabhakar.mahadev-lad.rj@...>
---
drivers/spi/spi-rspi.c | 4 ++++
1 file changed, 4 insertions(+)

diff --git a/drivers/spi/spi-rspi.c b/drivers/spi/spi-rspi.c
index 7a014eeec2d0..411b1307b7fd 100644
--- a/drivers/spi/spi-rspi.c
+++ b/drivers/spi/spi-rspi.c
@@ -613,6 +613,10 @@ static int rspi_dma_transfer(struct rspi_data *rspi, struct sg_table *tx,
rspi->dma_callbacked, HZ);
if (ret > 0 && rspi->dma_callbacked) {
ret = 0;
+ if (tx)
+ dmaengine_synchronize(rspi->ctlr->dma_tx);
+ if (rx)
+ dmaengine_synchronize(rspi->ctlr->dma_rx);
} else {
if (!ret) {
dev_err(&rspi->ctlr->dev, "DMA timeout\n");
--
2.17.1


[PATCH 5.10.y-cip 10/11] spi: spi-rspi: Drop redeclaring ret variable in qspi_transfer_in()

Lad Prabhakar
 

commit 1d734f592e1a1d41af80e90001d109cec1c98fb4 upstream.

"ret" variable is already declared in qspi_transfer_in() at the
beginning of function, drop redeclaring ret in the if block, fixing
below:

spi-rspi.c: In function ‘qspi_transfer_in’:
spi-rspi.c:838:7: warning: declaration of ‘ret’ shadows a previous local
838 | int ret = rspi_dma_transfer(rspi, NULL, &xfer->rx_sg);
| ^~~
spi-rspi.c:835:6: note: shadowed declaration is here
835 | int ret;

Fixes: db30083813b55 ("spi: rspi: avoid uninitialized variable access")
Signed-off-by: Lad Prabhakar <prabhakar.mahadev-lad.rj@...>
Reviewed-by: Geert Uytterhoeven <geert+renesas@...>
Link: https://lore.kernel.org/r/20211118031041.2312-4-prabhakar.mahadev-lad.rj@bp.renesas.com
Signed-off-by: Mark Brown <broonie@...>
Signed-off-by: Lad Prabhakar <prabhakar.mahadev-lad.rj@...>
---
drivers/spi/spi-rspi.c | 2 +-
1 file changed, 1 insertion(+), 1 deletion(-)

diff --git a/drivers/spi/spi-rspi.c b/drivers/spi/spi-rspi.c
index e5efa0aab5a7..7a014eeec2d0 100644
--- a/drivers/spi/spi-rspi.c
+++ b/drivers/spi/spi-rspi.c
@@ -835,7 +835,7 @@ static int qspi_transfer_in(struct rspi_data *rspi, struct spi_transfer *xfer)
int ret;

if (rspi->ctlr->can_dma && __rspi_can_dma(rspi, xfer)) {
- int ret = rspi_dma_transfer(rspi, NULL, &xfer->rx_sg);
+ ret = rspi_dma_transfer(rspi, NULL, &xfer->rx_sg);
if (ret != -EAGAIN)
return ret;
}
--
2.17.1


[PATCH 5.10.y-cip 09/11] spi: rspi: drop unneeded MODULE_ALIAS

Lad Prabhakar
 

From: Krzysztof Kozlowski <krzysztof.kozlowski@...>

commit 98c29b35a7e3b1ef7e64a8dd05a4383ea2e2ac72 upstream.

The MODULE_DEVICE_TABLE already creates proper alias for platform
driver. Having another MODULE_ALIAS causes the alias to be duplicated.

Signed-off-by: Krzysztof Kozlowski <krzysztof.kozlowski@...>
Link: https://lore.kernel.org/r/20210916164423.134603-1-krzysztof.kozlowski@canonical.com
Signed-off-by: Mark Brown <broonie@...>
Signed-off-by: Lad Prabhakar <prabhakar.mahadev-lad.rj@...>
---
drivers/spi/spi-rspi.c | 1 -
1 file changed, 1 deletion(-)

diff --git a/drivers/spi/spi-rspi.c b/drivers/spi/spi-rspi.c
index 27b5a9cfc904..e5efa0aab5a7 100644
--- a/drivers/spi/spi-rspi.c
+++ b/drivers/spi/spi-rspi.c
@@ -1449,4 +1449,3 @@ module_platform_driver(rspi_driver);
MODULE_DESCRIPTION("Renesas RSPI bus driver");
MODULE_LICENSE("GPL v2");
MODULE_AUTHOR("Yoshihiro Shimoda");
-MODULE_ALIAS("platform:rspi");
--
2.17.1


[PATCH 5.10.y-cip 08/11] spi: spi-rspi: : use proper DMAENGINE API for termination

Lad Prabhakar
 

From: Wolfram Sang <wsa+renesas@...>

commit 29176edd6e7ad7333d0bb19a309b2104fa4f4341 upstream.

dmaengine_terminate_all() is deprecated in favor of explicitly saying if
it should be sync or async. Here, we want dmaengine_terminate_sync()
because there is no other synchronization code in the driver to handle
an async case.

Signed-off-by: Wolfram Sang <wsa+renesas@...>
Link: https://lore.kernel.org/r/20210623095843.3228-2-wsa+renesas@sang-engineering.com
Signed-off-by: Mark Brown <broonie@...>
Signed-off-by: Lad Prabhakar <prabhakar.mahadev-lad.rj@...>
---
drivers/spi/spi-rspi.c | 6 +++---
1 file changed, 3 insertions(+), 3 deletions(-)

diff --git a/drivers/spi/spi-rspi.c b/drivers/spi/spi-rspi.c
index 7ddb140b07ea..27b5a9cfc904 100644
--- a/drivers/spi/spi-rspi.c
+++ b/drivers/spi/spi-rspi.c
@@ -619,9 +619,9 @@ static int rspi_dma_transfer(struct rspi_data *rspi, struct sg_table *tx,
ret = -ETIMEDOUT;
}
if (tx)
- dmaengine_terminate_all(rspi->ctlr->dma_tx);
+ dmaengine_terminate_sync(rspi->ctlr->dma_tx);
if (rx)
- dmaengine_terminate_all(rspi->ctlr->dma_rx);
+ dmaengine_terminate_sync(rspi->ctlr->dma_rx);
}

rspi_disable_irq(rspi, irq_mask);
@@ -635,7 +635,7 @@ static int rspi_dma_transfer(struct rspi_data *rspi, struct sg_table *tx,

no_dma_tx:
if (rx)
- dmaengine_terminate_all(rspi->ctlr->dma_rx);
+ dmaengine_terminate_sync(rspi->ctlr->dma_rx);
no_dma_rx:
if (ret == -EAGAIN) {
dev_warn_once(&rspi->ctlr->dev,
--
2.17.1


[PATCH 5.10.y-cip 07/11] spi: rpc-if: Fix RPM imbalance in probe error path

Lad Prabhakar
 

From: Geert Uytterhoeven <geert+renesas@...>

commit 2f8cf5f642e80f8b6b0e660a9c86924a1f41cd80 upstream.

If rpcif_hw_init() fails, Runtime PM is left enabled.

Fixes: b04cc0d912eb80d3 ("memory: renesas-rpc-if: Add support for RZ/G2L")
Signed-off-by: Geert Uytterhoeven <geert+renesas@...>
Reviewed-by: Wolfram Sang <wsa+renesas@...>
Link: https://lore.kernel.org/r/1c78a1f447d019bb66b6e7787f520ae78821e2ae.1648562287.git.geert+renesas@glider.be
Signed-off-by: Mark Brown <broonie@...>
Signed-off-by: Lad Prabhakar <prabhakar.mahadev-lad.rj@...>
---
drivers/spi/spi-rpc-if.c | 8 ++++++--
1 file changed, 6 insertions(+), 2 deletions(-)

diff --git a/drivers/spi/spi-rpc-if.c b/drivers/spi/spi-rpc-if.c
index 651d92028306..0f8096d7d7b0 100644
--- a/drivers/spi/spi-rpc-if.c
+++ b/drivers/spi/spi-rpc-if.c
@@ -158,14 +158,18 @@ static int rpcif_spi_probe(struct platform_device *pdev)

error = rpcif_hw_init(rpc, false);
if (error)
- return error;
+ goto out_disable_rpm;

error = spi_register_controller(ctlr);
if (error) {
dev_err(&pdev->dev, "spi_register_controller failed\n");
- rpcif_disable_rpm(rpc);
+ goto out_disable_rpm;
}

+ return 0;
+
+out_disable_rpm:
+ rpcif_disable_rpm(rpc);
return error;
}

--
2.17.1


[PATCH 5.10.y-cip 06/11] memory: renesas-rpc-if: simplify platform_get_resource_byname()

Lad Prabhakar
 

From: Krzysztof Kozlowski <krzysztof.kozlowski@...>

commit 2ca47b33a7794ce92ae881d6d62affea953814cd upstream.

Use devm_platform_ioremap_resource_byname() instead of
platform_get_resource_byname() and devm_ioremap_resource().

Signed-off-by: Krzysztof Kozlowski <krzysztof.kozlowski@...>
Link: https://lore.kernel.org/r/20220419142859.380566-7-krzysztof.kozlowski@linaro.org
Signed-off-by: Lad Prabhakar <prabhakar.mahadev-lad.rj@...>
---
drivers/memory/renesas-rpc-if.c | 3 +--
1 file changed, 1 insertion(+), 2 deletions(-)

diff --git a/drivers/memory/renesas-rpc-if.c b/drivers/memory/renesas-rpc-if.c
index 54ed31b862d4..6a096a033651 100644
--- a/drivers/memory/renesas-rpc-if.c
+++ b/drivers/memory/renesas-rpc-if.c
@@ -260,8 +260,7 @@ int rpcif_sw_init(struct rpcif *rpc, struct device *dev)

rpc->dev = dev;

- res = platform_get_resource_byname(pdev, IORESOURCE_MEM, "regs");
- rpc->base = devm_ioremap_resource(&pdev->dev, res);
+ rpc->base = devm_platform_ioremap_resource_byname(pdev, "regs");
if (IS_ERR(rpc->base))
return PTR_ERR(rpc->base);

--
2.17.1


[PATCH 5.10.y-cip 05/11] memory: renesas-rpc-if: Simplify single/double data register access

Lad Prabhakar
 

From: Geert Uytterhoeven <geert+renesas@...>

commit 1f26a60b55aa654c73b5b9eb9eab8a7d687d429d upstream.

For manual write and read, factor out the common access to the first
data register by keeping track of the current data pointer.

Signed-off-by: Geert Uytterhoeven <geert+renesas@...>
Tested-by: Wolfram Sang <wsa+renesas@...>
Reviewed-by: Wolfram Sang <wsa+renesas@...>
Link: https://lore.kernel.org/r/c3b2a8d1a69f1b1e8d1a460148406cfb83e52eb4.1649857740.git.geert+renesas@glider.be
Signed-off-by: Krzysztof Kozlowski <krzysztof.kozlowski@...>
Signed-off-by: Lad Prabhakar <prabhakar.mahadev-lad.rj@...>
---
drivers/memory/renesas-rpc-if.c | 28 ++++++++--------------------
1 file changed, 8 insertions(+), 20 deletions(-)

diff --git a/drivers/memory/renesas-rpc-if.c b/drivers/memory/renesas-rpc-if.c
index 7163d93a6498..54ed31b862d4 100644
--- a/drivers/memory/renesas-rpc-if.c
+++ b/drivers/memory/renesas-rpc-if.c
@@ -489,7 +489,7 @@ int rpcif_manual_xfer(struct rpcif *rpc)
case RPCIF_DATA_OUT:
while (pos < rpc->xferlen) {
u32 bytes_left = rpc->xferlen - pos;
- u32 nbytes, data[2];
+ u32 nbytes, data[2], *p = data;

smcr = rpc->smcr | RPCIF_SMCR_SPIE;

@@ -503,15 +503,9 @@ int rpcif_manual_xfer(struct rpcif *rpc)
rpc->xfer_size = nbytes;

memcpy(data, rpc->buffer + pos, nbytes);
- if (nbytes == 8) {
- regmap_write(rpc->regmap, RPCIF_SMWDR1,
- data[0]);
- regmap_write(rpc->regmap, RPCIF_SMWDR0,
- data[1]);
- } else {
- regmap_write(rpc->regmap, RPCIF_SMWDR0,
- data[0]);
- }
+ if (nbytes == 8)
+ regmap_write(rpc->regmap, RPCIF_SMWDR1, *p++);
+ regmap_write(rpc->regmap, RPCIF_SMWDR0, *p);

regmap_write(rpc->regmap, RPCIF_SMCR, smcr);
ret = wait_msg_xfer_end(rpc);
@@ -553,7 +547,7 @@ int rpcif_manual_xfer(struct rpcif *rpc)
}
while (pos < rpc->xferlen) {
u32 bytes_left = rpc->xferlen - pos;
- u32 nbytes, data[2];
+ u32 nbytes, data[2], *p = data;

/* nbytes may only be 1, 2, 4, or 8 */
nbytes = bytes_left >= max ? max : (1 << ilog2(bytes_left));
@@ -570,15 +564,9 @@ int rpcif_manual_xfer(struct rpcif *rpc)
if (ret)
goto err_out;

- if (nbytes == 8) {
- regmap_read(rpc->regmap, RPCIF_SMRDR1,
- &data[0]);
- regmap_read(rpc->regmap, RPCIF_SMRDR0,
- &data[1]);
- } else {
- regmap_read(rpc->regmap, RPCIF_SMRDR0,
- &data[0]);
- }
+ if (nbytes == 8)
+ regmap_read(rpc->regmap, RPCIF_SMRDR1, p++);
+ regmap_read(rpc->regmap, RPCIF_SMRDR0, p);
memcpy(rpc->buffer + pos, data, nbytes);

pos += nbytes;
--
2.17.1


[PATCH 5.10.y-cip 04/11] memory: renesas-rpc-if: refactor MOIIO and IOFV macros

Lad Prabhakar
 

From: Wolfram Sang <wsa+renesas@...>

commit 3542de6a5b159fac0e7ca84d77a57ea99125d6b1 upstream.

Don't use _HIZ macros but also provide a val. This is more consistent
with the other macros and, thus, easier to read. Also shorter.

Signed-off-by: Wolfram Sang <wsa+renesas@...>
Link: https://lore.kernel.org/r/20211119110442.4946-1-wsa+renesas@sang-engineering.com
Signed-off-by: Krzysztof Kozlowski <krzysztof.kozlowski@...>
Signed-off-by: Lad Prabhakar <prabhakar.mahadev-lad.rj@...>
---
drivers/memory/renesas-rpc-if.c | 20 ++++++++------------
1 file changed, 8 insertions(+), 12 deletions(-)

diff --git a/drivers/memory/renesas-rpc-if.c b/drivers/memory/renesas-rpc-if.c
index b98eed3f3ab2..7163d93a6498 100644
--- a/drivers/memory/renesas-rpc-if.c
+++ b/drivers/memory/renesas-rpc-if.c
@@ -24,14 +24,13 @@
#define RPCIF_CMNCR_MOIIO2(val) (((val) & 0x3) << 20)
#define RPCIF_CMNCR_MOIIO1(val) (((val) & 0x3) << 18)
#define RPCIF_CMNCR_MOIIO0(val) (((val) & 0x3) << 16)
-#define RPCIF_CMNCR_MOIIO_HIZ (RPCIF_CMNCR_MOIIO0(3) | \
- RPCIF_CMNCR_MOIIO1(3) | \
- RPCIF_CMNCR_MOIIO2(3) | RPCIF_CMNCR_MOIIO3(3))
+#define RPCIF_CMNCR_MOIIO(val) (RPCIF_CMNCR_MOIIO0(val) | RPCIF_CMNCR_MOIIO1(val) | \
+ RPCIF_CMNCR_MOIIO2(val) | RPCIF_CMNCR_MOIIO3(val))
#define RPCIF_CMNCR_IO3FV(val) (((val) & 0x3) << 14) /* documented for RZ/G2L */
#define RPCIF_CMNCR_IO2FV(val) (((val) & 0x3) << 12) /* documented for RZ/G2L */
#define RPCIF_CMNCR_IO0FV(val) (((val) & 0x3) << 8)
-#define RPCIF_CMNCR_IOFV_HIZ (RPCIF_CMNCR_IO0FV(3) | RPCIF_CMNCR_IO2FV(3) | \
- RPCIF_CMNCR_IO3FV(3))
+#define RPCIF_CMNCR_IOFV(val) (RPCIF_CMNCR_IO0FV(val) | RPCIF_CMNCR_IO2FV(val) | \
+ RPCIF_CMNCR_IO3FV(val))
#define RPCIF_CMNCR_BSZ(val) (((val) & 0x3) << 0)

#define RPCIF_SSLDR 0x0004 /* R/W */
@@ -335,17 +334,14 @@ int rpcif_hw_init(struct rpcif *rpc, bool hyperflash)

if (rpc->type == RPCIF_RCAR_GEN3)
regmap_update_bits(rpc->regmap, RPCIF_CMNCR,
- RPCIF_CMNCR_MOIIO_HIZ | RPCIF_CMNCR_BSZ(3),
- RPCIF_CMNCR_MOIIO_HIZ |
+ RPCIF_CMNCR_MOIIO(3) | RPCIF_CMNCR_BSZ(3),
+ RPCIF_CMNCR_MOIIO(3) |
RPCIF_CMNCR_BSZ(hyperflash ? 1 : 0));
else
regmap_update_bits(rpc->regmap, RPCIF_CMNCR,
- RPCIF_CMNCR_MOIIO_HIZ | RPCIF_CMNCR_IOFV_HIZ |
+ RPCIF_CMNCR_MOIIO(3) | RPCIF_CMNCR_IOFV(3) |
RPCIF_CMNCR_BSZ(3),
- RPCIF_CMNCR_MOIIO3(1) | RPCIF_CMNCR_MOIIO2(1) |
- RPCIF_CMNCR_MOIIO1(1) | RPCIF_CMNCR_MOIIO0(1) |
- RPCIF_CMNCR_IO3FV(2) | RPCIF_CMNCR_IO2FV(2) |
- RPCIF_CMNCR_IO0FV(2) |
+ RPCIF_CMNCR_MOIIO(1) | RPCIF_CMNCR_IOFV(2) |
RPCIF_CMNCR_BSZ(hyperflash ? 1 : 0));

/* Set RCF after BSZ update */
--
2.17.1


[PATCH 5.10.y-cip 03/11] memory: renesas-rpc-if: avoid use of undocumented bits

Lad Prabhakar
 

From: Wolfram Sang <wsa+renesas@...>

commit 57ea9daad51f7707f61a602a743decf10cf9fea9 upstream.

Instead of writing fixed values with undocumented bits which happen to
be set on some SoCs, better switch to read-modify-write operations
changing only bits which are documented. This is way more future-proof
as we don't know yet how these bits may be on upcoming SoCs.

Signed-off-by: Wolfram Sang <wsa+renesas@...>
Tested-by: Lad Prabhakar <prabhakar.mahadev-lad.rj@...>
Reviewed-by: Lad Prabhakar <prabhakar.mahadev-lad.rj@...>
Link: https://lore.kernel.org/r/20211117093710.14430-1-wsa+renesas@sang-engineering.com
Signed-off-by: Krzysztof Kozlowski <krzysztof.kozlowski@...>
Signed-off-by: Lad Prabhakar <prabhakar.mahadev-lad.rj@...>
---
drivers/memory/renesas-rpc-if.c | 58 +++++++++++++--------------------
1 file changed, 22 insertions(+), 36 deletions(-)

diff --git a/drivers/memory/renesas-rpc-if.c b/drivers/memory/renesas-rpc-if.c
index 36c6042f6a07..b98eed3f3ab2 100644
--- a/drivers/memory/renesas-rpc-if.c
+++ b/drivers/memory/renesas-rpc-if.c
@@ -20,7 +20,6 @@

#define RPCIF_CMNCR 0x0000 /* R/W */
#define RPCIF_CMNCR_MD BIT(31)
-#define RPCIF_CMNCR_SFDE BIT(24) /* undocumented but must be set */
#define RPCIF_CMNCR_MOIIO3(val) (((val) & 0x3) << 22)
#define RPCIF_CMNCR_MOIIO2(val) (((val) & 0x3) << 20)
#define RPCIF_CMNCR_MOIIO1(val) (((val) & 0x3) << 18)
@@ -318,49 +317,36 @@ int rpcif_hw_init(struct rpcif *rpc, bool hyperflash)
rpcif_rzg2l_timing_adjust_sdr(rpc);
}

- /*
- * NOTE: The 0x260 are undocumented bits, but they must be set.
- * RPCIF_PHYCNT_STRTIM is strobe timing adjustment bits,
- * 0x0 : the delay is biggest,
- * 0x1 : the delay is 2nd biggest,
- * On H3 ES1.x, the value should be 0, while on others,
- * the value should be 7.
- */
- if (rpc->type == RPCIF_RCAR_GEN3) {
- regmap_write(rpc->regmap, RPCIF_PHYCNT, RPCIF_PHYCNT_STRTIM(7) |
- RPCIF_PHYCNT_PHYMEM(hyperflash ? 3 : 0) | 0x260);
- } else {
- regmap_read(rpc->regmap, RPCIF_PHYCNT, &dummy);
- dummy &= ~RPCIF_PHYCNT_PHYMEM_MASK;
- dummy |= RPCIF_PHYCNT_PHYMEM(hyperflash ? 3 : 0) | 0x260;
- regmap_write(rpc->regmap, RPCIF_PHYCNT, dummy);
- }
+ regmap_update_bits(rpc->regmap, RPCIF_PHYCNT, RPCIF_PHYCNT_PHYMEM_MASK,
+ RPCIF_PHYCNT_PHYMEM(hyperflash ? 3 : 0));
+
+ if (rpc->type == RPCIF_RCAR_GEN3)
+ regmap_update_bits(rpc->regmap, RPCIF_PHYCNT,
+ RPCIF_PHYCNT_STRTIM(7), RPCIF_PHYCNT_STRTIM(7));

- /*
- * NOTE: The 0x1511144 are undocumented bits, but they must be set
- * for RPCIF_PHYOFFSET1.
- * The 0x31 are undocumented bits, but they must be set
- * for RPCIF_PHYOFFSET2.
- */
- regmap_write(rpc->regmap, RPCIF_PHYOFFSET1, 0x1511144 |
- RPCIF_PHYOFFSET1_DDRTMG(3));
- regmap_write(rpc->regmap, RPCIF_PHYOFFSET2, 0x31 |
- RPCIF_PHYOFFSET2_OCTTMG(4));
+ regmap_update_bits(rpc->regmap, RPCIF_PHYOFFSET1, RPCIF_PHYOFFSET1_DDRTMG(3),
+ RPCIF_PHYOFFSET1_DDRTMG(3));
+ regmap_update_bits(rpc->regmap, RPCIF_PHYOFFSET2, RPCIF_PHYOFFSET2_OCTTMG(7),
+ RPCIF_PHYOFFSET2_OCTTMG(4));

if (hyperflash)
regmap_update_bits(rpc->regmap, RPCIF_PHYINT,
RPCIF_PHYINT_WPVAL, 0);

if (rpc->type == RPCIF_RCAR_GEN3)
- regmap_write(rpc->regmap, RPCIF_CMNCR, RPCIF_CMNCR_SFDE |
- RPCIF_CMNCR_MOIIO_HIZ | RPCIF_CMNCR_IOFV_HIZ |
- RPCIF_CMNCR_BSZ(hyperflash ? 1 : 0));
+ regmap_update_bits(rpc->regmap, RPCIF_CMNCR,
+ RPCIF_CMNCR_MOIIO_HIZ | RPCIF_CMNCR_BSZ(3),
+ RPCIF_CMNCR_MOIIO_HIZ |
+ RPCIF_CMNCR_BSZ(hyperflash ? 1 : 0));
else
- regmap_write(rpc->regmap, RPCIF_CMNCR, RPCIF_CMNCR_SFDE |
- RPCIF_CMNCR_MOIIO3(1) | RPCIF_CMNCR_MOIIO2(1) |
- RPCIF_CMNCR_MOIIO1(1) | RPCIF_CMNCR_MOIIO0(1) |
- RPCIF_CMNCR_IO3FV(2) | RPCIF_CMNCR_IO2FV(2) |
- RPCIF_CMNCR_IO0FV(2) | RPCIF_CMNCR_BSZ(hyperflash ? 1 : 0));
+ regmap_update_bits(rpc->regmap, RPCIF_CMNCR,
+ RPCIF_CMNCR_MOIIO_HIZ | RPCIF_CMNCR_IOFV_HIZ |
+ RPCIF_CMNCR_BSZ(3),
+ RPCIF_CMNCR_MOIIO3(1) | RPCIF_CMNCR_MOIIO2(1) |
+ RPCIF_CMNCR_MOIIO1(1) | RPCIF_CMNCR_MOIIO0(1) |
+ RPCIF_CMNCR_IO3FV(2) | RPCIF_CMNCR_IO2FV(2) |
+ RPCIF_CMNCR_IO0FV(2) |
+ RPCIF_CMNCR_BSZ(hyperflash ? 1 : 0));

/* Set RCF after BSZ update */
regmap_write(rpc->regmap, RPCIF_DRCR, RPCIF_DRCR_RCF);
--
2.17.1


[PATCH 5.10.y-cip 02/11] memory: renesas-rpc-if: simplify register update

Lad Prabhakar
 

From: Wolfram Sang <wsa+renesas@...>

commit 2db468d6fda4c33d26ba9dde7c72e081b2b86ad1 upstream.

No need to open code regmap_update_bits().

Signed-off-by: Wolfram Sang <wsa+renesas@...>
Tested-by: Lad Prabhakar <prabhakar.mahadev-lad.rj@...>
Link: https://lore.kernel.org/r/20211117102902.20062-1-wsa+renesas@sang-engineering.com
Signed-off-by: Krzysztof Kozlowski <krzysztof.kozlowski@...>
Signed-off-by: Lad Prabhakar <prabhakar.mahadev-lad.rj@...>
---
drivers/memory/renesas-rpc-if.c | 7 ++-----
1 file changed, 2 insertions(+), 5 deletions(-)

diff --git a/drivers/memory/renesas-rpc-if.c b/drivers/memory/renesas-rpc-if.c
index dc35f1460425..36c6042f6a07 100644
--- a/drivers/memory/renesas-rpc-if.c
+++ b/drivers/memory/renesas-rpc-if.c
@@ -290,17 +290,14 @@ EXPORT_SYMBOL(rpcif_sw_init);

static void rpcif_rzg2l_timing_adjust_sdr(struct rpcif *rpc)
{
- u32 data;
-
regmap_write(rpc->regmap, RPCIF_PHYWR, 0xa5390000);
regmap_write(rpc->regmap, RPCIF_PHYADD, 0x80000000);
regmap_write(rpc->regmap, RPCIF_PHYWR, 0x00008080);
regmap_write(rpc->regmap, RPCIF_PHYADD, 0x80000022);
regmap_write(rpc->regmap, RPCIF_PHYWR, 0x00008080);
regmap_write(rpc->regmap, RPCIF_PHYADD, 0x80000024);
-
- regmap_read(rpc->regmap, RPCIF_PHYCNT, &data);
- regmap_write(rpc->regmap, RPCIF_PHYCNT, data | RPCIF_PHYCNT_CKSEL(3));
+ regmap_update_bits(rpc->regmap, RPCIF_PHYCNT, RPCIF_PHYCNT_CKSEL(3),
+ RPCIF_PHYCNT_CKSEL(3));
regmap_write(rpc->regmap, RPCIF_PHYWR, 0x00000030);
regmap_write(rpc->regmap, RPCIF_PHYADD, 0x80000032);
}
--
2.17.1


[PATCH 5.10.y-cip 01/11] memory: renesas-rpc-if: Silence clang warning

Lad Prabhakar
 

commit 2602dc10f9d930bcc537467d13de4cfbfaa2126d upstream.

This patch silences the following clang warning:

| drivers/memory/renesas-rpc-if.c:253:14: warning: cast to smaller integer
| type 'enum rpcif_type' from 'const void *' [-Wvoid-pointer-to-enum-cast]
| rpc->type = (enum rpcif_type)of_device_get_match_data(dev);
| ^~~~~~~~~~~~~~~~~~~~~~~~~~~~~~~~~~~~~~~~~~~~~~

Fixes: b04cc0d912eb8 ("memory: renesas-rpc-if: Add support for RZ/G2L")
Reported-by: kernel test robot <lkp@...>
Signed-off-by: Lad Prabhakar <prabhakar.mahadev-lad.rj@...>
Reviewed-by: Geert Uytterhoeven <geert+renesas@...>
Link: https://lore.kernel.org/r/20211121180155.9062-1-prabhakar.mahadev-lad.rj@bp.renesas.com
[krzysztof: drop enum rpcif_type cast]
Signed-off-by: Krzysztof Kozlowski <krzysztof.kozlowski@...>
Signed-off-by: Lad Prabhakar <prabhakar.mahadev-lad.rj@...>
---
drivers/memory/renesas-rpc-if.c | 2 +-
1 file changed, 1 insertion(+), 1 deletion(-)

diff --git a/drivers/memory/renesas-rpc-if.c b/drivers/memory/renesas-rpc-if.c
index e27ef0edbcf9..dc35f1460425 100644
--- a/drivers/memory/renesas-rpc-if.c
+++ b/drivers/memory/renesas-rpc-if.c
@@ -281,7 +281,7 @@ int rpcif_sw_init(struct rpcif *rpc, struct device *dev)
return PTR_ERR(rpc->dirmap);
rpc->size = resource_size(res);

- rpc->type = (enum rpcif_type)of_device_get_match_data(dev);
+ rpc->type = (uintptr_t)of_device_get_match_data(dev);
rpc->rstc = devm_reset_control_get_exclusive(&pdev->dev, NULL);

return PTR_ERR_OR_ZERO(rpc->rstc);
--
2.17.1


[PATCH 5.10.y-cip 00/11] Renesas RPCI-IF and RSPI driver fixes and improvements

Lad Prabhakar
 

Hi All,

This patch series backports RPCI-IF and RSPI driver fixes and
improvements.

Note: All the patches have been cherry picked from v5.19 kernel.

Cheers,
Prabhakar

Biju Das (1):
spi: spi-rspi: Fix PIO fallback on RZ platforms

Geert Uytterhoeven (2):
memory: renesas-rpc-if: Simplify single/double data register access
spi: rpc-if: Fix RPM imbalance in probe error path

Krzysztof Kozlowski (2):
memory: renesas-rpc-if: simplify platform_get_resource_byname()
spi: rspi: drop unneeded MODULE_ALIAS

Lad Prabhakar (2):
memory: renesas-rpc-if: Silence clang warning
spi: spi-rspi: Drop redeclaring ret variable in qspi_transfer_in()

Wolfram Sang (4):
memory: renesas-rpc-if: simplify register update
memory: renesas-rpc-if: avoid use of undocumented bits
memory: renesas-rpc-if: refactor MOIIO and IOFV macros
spi: spi-rspi: : use proper DMAENGINE API for termination

drivers/memory/renesas-rpc-if.c | 104 +++++++++++---------------------
drivers/spi/spi-rpc-if.c | 8 ++-
drivers/spi/spi-rspi.c | 13 ++--
3 files changed, 49 insertions(+), 76 deletions(-)

--
2.17.1


[isar-cip-core][PATCH v5 3/3] kas: Remove efibootguard.yml

Quirin Gylstorff
 

From: Quirin Gylstorff <quirin.gylstorff@...>

A build with only the option `kas/efibootguard.yml` will not succeed.
Move the content to a include in the image directory and the adapt the kas
files.

Signed-off-by: Quirin Gylstorff <quirin.gylstorff@...>
---
kas/opt/ebg-secure-boot-snakeoil.yml | 7 +++--
kas/opt/ebg-swu.yml | 18 ++++++++++---
kas/opt/efibootguard.yml | 39 ----------------------------
recipes-core/images/efibootguard.inc | 18 +++++++++++++
4 files changed, 36 insertions(+), 46 deletions(-)
delete mode 100644 kas/opt/efibootguard.yml
create mode 100644 recipes-core/images/efibootguard.inc

diff --git a/kas/opt/ebg-secure-boot-snakeoil.yml b/kas/opt/ebg-secure-boot-snakeoil.yml
index 3202076..ff65e99 100644
--- a/kas/opt/ebg-secure-boot-snakeoil.yml
+++ b/kas/opt/ebg-secure-boot-snakeoil.yml
@@ -12,17 +12,16 @@
header:
version: 10
includes:
- - kas/opt/efibootguard.yml
+ - kas/opt/ebg-swu.yml

local_conf_header:
- image-options-swupdate: |
- CIP_IMAGE_OPTIONS_append = " swupdate.inc"
-
secure-boot-image: |
IMAGE_CLASSES += "verity"
IMAGE_FSTYPES = "wic"
WKS_FILE = "${MACHINE}-efibootguard-secureboot.wks.in"
INITRAMFS_INSTALL_append = " initramfs-verity-hook"
+ # abrootfs cannot be installed together with verity
+ INITRAMFS_INSTALL_remove = " initramfs-abrootfs-hook"

secure-boot: |
IMAGER_BUILD_DEPS += "ebg-secure-boot-signer"
diff --git a/kas/opt/ebg-swu.yml b/kas/opt/ebg-swu.yml
index 5e4e771..e0bbe2e 100644
--- a/kas/opt/ebg-swu.yml
+++ b/kas/opt/ebg-swu.yml
@@ -12,12 +12,24 @@
header:
version: 10
includes:
- - kas/opt/efibootguard.yml
- kas/opt/swupdate.yml

local_conf_header:
+ ebg_swu_bootloader: |
+ WKS_FILE ?= "${MACHINE}-efibootguard.wks.in"
+ SWUPDATE_BOOTLOADER = "efibootguard"
+ ebg_swu_image_options: |
+ CIP_IMAGE_OPTIONS_append = " efibootguard.inc image-uuid.inc"
initramfs: |
INITRAMFS_INSTALL_append = " initramfs-abrootfs-hook"
+ firmware-binaries: |
+ # Add ovmf binaries for qemu
+ IMAGER_BUILD_DEPS_append_qemu-amd64 += "ovmf-binaries"
+ # not needed for Debian 11 and later
+ OVERRIDES_append_qemu-amd64 = ":${BASE_DISTRO_CODENAME}"
+ DISTRO_APT_SOURCES_append_qemu-amd64_buster = " conf/distro/debian-buster-backports.list"
+ DISTRO_APT_PREFERENCES_append_qemu-amd64_buster = " conf/distro/preferences.ovmf-snakeoil.conf"
+ # Add U-Boot for qemu
+ IMAGER_BUILD_DEPS_append_qemu-arm64 += "u-boot-qemu-arm64"
+ IMAGER_BUILD_DEPS_append_qemu-arm += "u-boot-qemu-arm"

- image-option-uuid: |
- CIP_IMAGE_OPTIONS_append = " image-uuid.inc"
diff --git a/kas/opt/efibootguard.yml b/kas/opt/efibootguard.yml
deleted file mode 100644
index cee9c78..0000000
--- a/kas/opt/efibootguard.yml
+++ /dev/null
@@ -1,39 +0,0 @@
-#
-# CIP Core, generic profile
-#
-# Copyright (c) Siemens AG, 2020
-#
-# Authors:
-# Quirin Gylstorff <quirin.gylstorff@...>
-#
-# SPDX-License-Identifier: MIT
-#
-# This kas file adds efibootguard as the bootloader to the image
-
-header:
- version: 10
-
-local_conf_header:
- efibootguard: |
- IMAGE_INSTALL_append = " efibootguard"
-
- efibootguard-swupdate: |
- SWUPDATE_BOOTLOADER = "efibootguard"
-
- efibootguard-wic: |
- WIC_IMAGER_INSTALL_append = " efibootguard"
- WDOG_TIMEOUT ?= "60"
- WICVARS += "WDOG_TIMEOUT KERNEL_IMAGE INITRD_IMAGE DTB_FILES"
- IMAGE_FSTYPES ?= "wic"
- WKS_FILE ?= "${MACHINE}-efibootguard.wks.in"
-
- firmware-binaries: |
- # Add ovmf binaries for qemu
- IMAGER_BUILD_DEPS_append_qemu-amd64 += "ovmf-binaries"
- # not needed for Debian 11 and later
- OVERRIDES_append_qemu-amd64 = ":${BASE_DISTRO_CODENAME}"
- DISTRO_APT_SOURCES_append_qemu-amd64_buster = " conf/distro/debian-buster-backports.list"
- DISTRO_APT_PREFERENCES_append_qemu-amd64_buster = " conf/distro/preferences.ovmf-snakeoil.conf"
- # Add U-Boot for qemu
- IMAGER_BUILD_DEPS_append_qemu-arm64 += "u-boot-qemu-arm64"
- IMAGER_BUILD_DEPS_append_qemu-arm += "u-boot-qemu-arm"
diff --git a/recipes-core/images/efibootguard.inc b/recipes-core/images/efibootguard.inc
new file mode 100644
index 0000000..eace4fd
--- /dev/null
+++ b/recipes-core/images/efibootguard.inc
@@ -0,0 +1,18 @@
+#
+# CIP Core, generic profile
+#
+# Copyright (c) Siemens AG, 2020
+#
+# Authors:
+# Quirin Gylstorff <quirin.gylstorff@...>
+#
+# SPDX-License-Identifier: MIT
+#
+
+IMAGE_INSTALL_append = " efibootguard"
+
+WIC_IMAGER_INSTALL_append = " efibootguard"
+WDOG_TIMEOUT ?= "60"
+WICVARS += "WDOG_TIMEOUT KERNEL_IMAGE INITRD_IMAGE DTB_FILES"
+IMAGE_FSTYPES += "wic"
+
--
2.35.1


[isar-cip-core][PATCH v5 0/3] clean up kas/opt

Quirin Gylstorff
 

From: Quirin Gylstorff <quirin.gylstorff@...>

Remove the kas option for efibootguard as it cannot build a image.
Move the package installation for swupdate to the include.

Changes V2:
- Readd WICVARS(KERNEL_IMAGE INITRD_IMAGE DTB_FILES)
- Fix setting WKS_FILE for ebg_swu

Changes V3:
- Fix assignment of WKS_FILE
- use weak assignment in conf/distro/cip-core-common.inc

Changes V4:
- Move `firmware-binaries` to kas/opt/ebg-swu
- kas/opt/ebg-secure-boot-snakeoil now depends on ebg-swu
- add DEBIAN_CONFLICTS between initramfs-verity-hook and initramfs-abrootfs-hook
as the system stucks in a reboot loop if both are installed.

Changes V5:
- Fix set WKS_FILE in case by using default instead of weak assignment
- reoder patches
- rebase onto 29d3546 origin/next


Quirin Gylstorff (3):
initramfs-*-hook: Add DEBIAN_CONFLICTS
kas/opt/swupdate: Move the package installation to swupdate.inc
kas: Remove efibootguard.yml

kas/opt/ebg-secure-boot-snakeoil.yml | 11 ++----
kas/opt/ebg-swu.yml | 18 +++++++--
kas/opt/efibootguard.yml | 39 -------------------
kas/opt/swupdate.yml | 4 --
recipes-core/images/efibootguard.inc | 18 +++++++++
recipes-core/images/swupdate.inc | 3 ++
.../initramfs-abrootfs-hook_0.1.bb | 1 +
.../initramfs-verity-hook_0.1.bb | 1 +
8 files changed, 41 insertions(+), 54 deletions(-)
delete mode 100644 kas/opt/efibootguard.yml
create mode 100644 recipes-core/images/efibootguard.inc

--
2.35.1


[isar-cip-core][PATCH v5 2/3] kas/opt/swupdate: Move the package installation to swupdate.inc

Quirin Gylstorff
 

From: Quirin Gylstorff <quirin.gylstorff@...>

Signed-off-by: Quirin Gylstorff <quirin.gylstorff@...>
---
kas/opt/ebg-secure-boot-snakeoil.yml | 4 ----
kas/opt/swupdate.yml | 4 ----
recipes-core/images/swupdate.inc | 3 +++
3 files changed, 3 insertions(+), 8 deletions(-)

diff --git a/kas/opt/ebg-secure-boot-snakeoil.yml b/kas/opt/ebg-secure-boot-snakeoil.yml
index 2822cef..3202076 100644
--- a/kas/opt/ebg-secure-boot-snakeoil.yml
+++ b/kas/opt/ebg-secure-boot-snakeoil.yml
@@ -18,10 +18,6 @@ local_conf_header:
image-options-swupdate: |
CIP_IMAGE_OPTIONS_append = " swupdate.inc"

- swupdate: |
- IMAGE_INSTALL_append = " swupdate"
- IMAGE_INSTALL_append = " swupdate-handler-roundrobin"
-
secure-boot-image: |
IMAGE_CLASSES += "verity"
IMAGE_FSTYPES = "wic"
diff --git a/kas/opt/swupdate.yml b/kas/opt/swupdate.yml
index c2bd15c..8ba03c9 100644
--- a/kas/opt/swupdate.yml
+++ b/kas/opt/swupdate.yml
@@ -15,10 +15,6 @@ header:
version: 10

local_conf_header:
- swupdate: |
- IMAGE_INSTALL_append = " swupdate"
- IMAGE_INSTALL_append = " swupdate-handler-roundrobin"
-
image-option-swupdate: |
CIP_IMAGE_OPTIONS_append = " swupdate.inc"

diff --git a/recipes-core/images/swupdate.inc b/recipes-core/images/swupdate.inc
index e0252df..edc41a0 100644
--- a/recipes-core/images/swupdate.inc
+++ b/recipes-core/images/swupdate.inc
@@ -12,6 +12,9 @@
inherit swupdate
inherit read-only-rootfs

+IMAGE_INSTALL += " swupdate"
+IMAGE_INSTALL += " swupdate-handler-roundrobin"
+
ROOTFS_PARTITION_NAME = "${IMAGE_FULLNAME}.wic.p4.gz"

FILESEXTRAPATHS_prepend := "${THISDIR}/files:"
--
2.35.1


[isar-cip-core][PATCH v5 1/3] initramfs-*-hook: Add DEBIAN_CONFLICTS

Quirin Gylstorff
 

From: Quirin Gylstorff <quirin.gylstorff@...>

If both initramfs-abrootfs-hook and initramfs-verity-hook
are installed the system will enter a reboot loop.

Signed-off-by: Quirin Gylstorff <quirin.gylstorff@...>
---
.../initramfs-abrootfs-hook/initramfs-abrootfs-hook_0.1.bb | 1 +
.../initramfs-verity-hook/initramfs-verity-hook_0.1.bb | 1 +
2 files changed, 2 insertions(+)

diff --git a/recipes-initramfs/initramfs-abrootfs-hook/initramfs-abrootfs-hook_0.1.bb b/recipes-initramfs/initramfs-abrootfs-hook/initramfs-abrootfs-hook_0.1.bb
index 1693e85..8b1536f 100644
--- a/recipes-initramfs/initramfs-abrootfs-hook/initramfs-abrootfs-hook_0.1.bb
+++ b/recipes-initramfs/initramfs-abrootfs-hook/initramfs-abrootfs-hook_0.1.bb
@@ -13,6 +13,7 @@
inherit dpkg-raw

DEBIAN_DEPENDS = "initramfs-tools"
+DEBIAN_CONFLICTS = "initramfs-verity-hook"

SRC_URI += "file://abrootfs.hook \
file://abrootfs.script"
diff --git a/recipes-initramfs/initramfs-verity-hook/initramfs-verity-hook_0.1.bb b/recipes-initramfs/initramfs-verity-hook/initramfs-verity-hook_0.1.bb
index 60ee8da..5998908 100644
--- a/recipes-initramfs/initramfs-verity-hook/initramfs-verity-hook_0.1.bb
+++ b/recipes-initramfs/initramfs-verity-hook/initramfs-verity-hook_0.1.bb
@@ -23,6 +23,7 @@ TEMPLATE_FILES = "verity.script.tmpl"
TEMPLATE_VARS += "VERITY_BEHAVIOR_ON_CORRUPTION"

DEBIAN_DEPENDS = "initramfs-tools, cryptsetup"
+DEBIAN_CONFLICTS = "initramfs-abrootfs-hook"

VERITY_IMAGE_RECIPE ?= "cip-core-image"

--
2.35.1


Root filesystem for risc-v board

Pavel Machek
 

Hi!

So... how do you get root filesystem for RISC-V board? Ideally I'd
like to get something Debian based.

Best I could try is debootstrap for Debian testing:

sudo debootstrap --no-check-gpg --foreign --arch=riscv64 --keyring
/usr/share/keyrings/debian-ports-archive-keyring.gpg
--include=debian-ports-archive-keyring unstable /some/suitable/dir
http://deb.debian.org/debian-ports

Unfortunately, I can't get debootstrap --second-stage to work (I get
sigsegv in ldconfig, I guess testing may be too experimental?). Is it
possible to debootstrap stable or testing distributions?

I don't think CIP project provides binary images somewhere. What is
recommended way to get a root filesystem? Is there suitable
documentation I should follow?

Thanks and best regards,
Pavel
--
DENX Software Engineering GmbH, Managing Director: Wolfgang Denk
HRB 165235 Munich, Office: Kirchenstr.5, D-82194 Groebenzell, Germany

941 - 960 of 10124