Date   

cip-gitlab/ci/iwamatsu/linux-5.10.y-cip-rc ltp-timers: 8 runs, 8 regressions (v5.10.155-cip21-405-g26d566555c3de) #kernelci

kernelci.org bot <bot@...>
 

cip-gitlab/ci/iwamatsu/linux-5.10.y-cip-rc ltp-timers: 8 runs, 8 regressions (v5.10.155-cip21-405-g26d566555c3de)

Regressions Summary
-------------------

platform | arch | lab | compiler | defconfig | regressions
--------------------------+--------+---------------+----------+------------------------------+------------
asus-C433TA-AJ0005-rammus | x86_64 | lab-collabora | gcc-10 | x86_64_defcon...6-chromebook | 2
asus-C436FA-Flip-hatch | x86_64 | lab-collabora | gcc-10 | x86_64_defcon...6-chromebook | 2
asus-C523NA-A20057-coral | x86_64 | lab-collabora | gcc-10 | x86_64_defcon...6-chromebook | 2
rk3399-gru-kevin | arm64 | lab-collabora | gcc-10 | defconfig+arm64-chromebook | 2

Details: https://kernelci.org/test/job/cip-gitlab/branch/ci%2Fiwamatsu%2Flinux-5.10.y-cip-rc/kernel/v5.10.155-cip21-405-g26d566555c3de/plan/ltp-timers/

Test: ltp-timers
Tree: cip-gitlab
Branch: ci/iwamatsu/linux-5.10.y-cip-rc
Describe: v5.10.155-cip21-405-g26d566555c3de
URL: https://gitlab.com/cip-project/cip-kernel/linux-cip.git
SHA: 26d566555c3de5796328380cfeda5b2372f45010

Test suite revisions:
ltp-tests
URL: https://github.com/linux-test-project/ltp.git
SHA: e76de05a93390f5ec7fae2941d8f24d367c9b2b8


Test Regressions
----------------


platform | arch | lab | compiler | defconfig | regressions
--------------------------+--------+---------------+----------+------------------------------+------------
asus-C433TA-AJ0005-rammus | x86_64 | lab-collabora | gcc-10 | x86_64_defcon...6-chromebook | 2

Details: https://kernelci.org/test/plan/id/639205bfe2db3f98432abe09

Results: 32 PASS, 4 FAIL, 0 SKIP
Full config: x86_64_defconfig+x86-chromebook
Compiler: gcc-10 (gcc (Debian 10.2.1-6) 10.2.1 20210110)
Plain log: https://storage.kernelci.org//cip-gitlab/ci-iwamatsu-linux-5.10.y-cip-rc/v5.10.155-cip21-405-g26d566555c3de/x86_64/x86_64_defconfig+x86-chromebook/gcc-10/lab-collabora/ltp-timers-asus-C433TA-AJ0005-rammus.txt
HTML log: https://storage.kernelci.org//cip-gitlab/ci-iwamatsu-linux-5.10.y-cip-rc/v5.10.155-cip21-405-g26d566555c3de/x86_64/x86_64_defconfig+x86-chromebook/gcc-10/lab-collabora/ltp-timers-asus-C433TA-AJ0005-rammus.html
Rootfs: http://storage.kernelci.org/images/rootfs/debian/bullseye-ltp/20221202.0/amd64/initrd.cpio.gz


* ltp-timers.clock_settime: https://kernelci.org/test/case/id/639205bfe2db3f98432abe0e
failing since 42 days (last pass: v5.10.147-cip18-12-g7bc9523ecfb7f, first fail: v5.10.147-cip18-451-g87ba4bc77ca06)

* ltp-timers.clock_settime: https://kernelci.org/test/case/id/639205bfe2db3f98432abe0e
failing since 42 days (last pass: v5.10.147-cip18-12-g7bc9523ecfb7f, first fail: v5.10.147-cip18-451-g87ba4bc77ca06)



platform | arch | lab | compiler | defconfig | regressions
--------------------------+--------+---------------+----------+------------------------------+------------
asus-C436FA-Flip-hatch | x86_64 | lab-collabora | gcc-10 | x86_64_defcon...6-chromebook | 2

Details: https://kernelci.org/test/plan/id/639203c40032e28a9e2abd09

Results: 32 PASS, 4 FAIL, 0 SKIP
Full config: x86_64_defconfig+x86-chromebook
Compiler: gcc-10 (gcc (Debian 10.2.1-6) 10.2.1 20210110)
Plain log: https://storage.kernelci.org//cip-gitlab/ci-iwamatsu-linux-5.10.y-cip-rc/v5.10.155-cip21-405-g26d566555c3de/x86_64/x86_64_defconfig+x86-chromebook/gcc-10/lab-collabora/ltp-timers-asus-C436FA-Flip-hatch.txt
HTML log: https://storage.kernelci.org//cip-gitlab/ci-iwamatsu-linux-5.10.y-cip-rc/v5.10.155-cip21-405-g26d566555c3de/x86_64/x86_64_defconfig+x86-chromebook/gcc-10/lab-collabora/ltp-timers-asus-C436FA-Flip-hatch.html
Rootfs: http://storage.kernelci.org/images/rootfs/debian/bullseye-ltp/20221202.0/amd64/initrd.cpio.gz


* ltp-timers.clock_settime: https://kernelci.org/test/case/id/639203c40032e28a9e2abd0e
failing since 42 days (last pass: v5.10.147-cip18-56-g87bd4289362be, first fail: v5.10.147-cip18-451-g87ba4bc77ca06)

* ltp-timers.clock_settime: https://kernelci.org/test/case/id/639203c40032e28a9e2abd0e
failing since 42 days (last pass: v5.10.147-cip18-56-g87bd4289362be, first fail: v5.10.147-cip18-451-g87ba4bc77ca06)



platform | arch | lab | compiler | defconfig | regressions
--------------------------+--------+---------------+----------+------------------------------+------------
asus-C523NA-A20057-coral | x86_64 | lab-collabora | gcc-10 | x86_64_defcon...6-chromebook | 2

Details: https://kernelci.org/test/plan/id/63920b7356351e6d022abd06

Results: 32 PASS, 4 FAIL, 0 SKIP
Full config: x86_64_defconfig+x86-chromebook
Compiler: gcc-10 (gcc (Debian 10.2.1-6) 10.2.1 20210110)
Plain log: https://storage.kernelci.org//cip-gitlab/ci-iwamatsu-linux-5.10.y-cip-rc/v5.10.155-cip21-405-g26d566555c3de/x86_64/x86_64_defconfig+x86-chromebook/gcc-10/lab-collabora/ltp-timers-asus-C523NA-A20057-coral.txt
HTML log: https://storage.kernelci.org//cip-gitlab/ci-iwamatsu-linux-5.10.y-cip-rc/v5.10.155-cip21-405-g26d566555c3de/x86_64/x86_64_defconfig+x86-chromebook/gcc-10/lab-collabora/ltp-timers-asus-C523NA-A20057-coral.html
Rootfs: http://storage.kernelci.org/images/rootfs/debian/bullseye-ltp/20221202.0/amd64/initrd.cpio.gz


* ltp-timers.clock_settime: https://kernelci.org/test/case/id/63920b7356351e6d022abd0b
failing since 42 days (last pass: v5.10.147-cip18-12-g7bc9523ecfb7f, first fail: v5.10.147-cip18-451-g87ba4bc77ca06)

* ltp-timers.clock_settime: https://kernelci.org/test/case/id/63920b7356351e6d022abd0b
failing since 42 days (last pass: v5.10.147-cip18-12-g7bc9523ecfb7f, first fail: v5.10.147-cip18-451-g87ba4bc77ca06)



platform | arch | lab | compiler | defconfig | regressions
--------------------------+--------+---------------+----------+------------------------------+------------
rk3399-gru-kevin | arm64 | lab-collabora | gcc-10 | defconfig+arm64-chromebook | 2

Details: https://kernelci.org/test/plan/id/63920a4722697da90d2abd3e

Results: 32 PASS, 4 FAIL, 0 SKIP
Full config: defconfig+arm64-chromebook
Compiler: gcc-10 (aarch64-linux-gnu-gcc (Debian 10.2.1-6) 10.2.1 20210110)
Plain log: https://storage.kernelci.org//cip-gitlab/ci-iwamatsu-linux-5.10.y-cip-rc/v5.10.155-cip21-405-g26d566555c3de/arm64/defconfig+arm64-chromebook/gcc-10/lab-collabora/ltp-timers-rk3399-gru-kevin.txt
HTML log: https://storage.kernelci.org//cip-gitlab/ci-iwamatsu-linux-5.10.y-cip-rc/v5.10.155-cip21-405-g26d566555c3de/arm64/defconfig+arm64-chromebook/gcc-10/lab-collabora/ltp-timers-rk3399-gru-kevin.html
Rootfs: http://storage.kernelci.org/images/rootfs/debian/bullseye-ltp/20221202.0/arm64/initrd.cpio.gz


* ltp-timers.clock_settime: https://kernelci.org/test/case/id/63920a4722697da90d2abd43
failing since 42 days (last pass: v5.10.147-cip18-12-g7bc9523ecfb7f, first fail: v5.10.147-cip18-451-g87ba4bc77ca06)

* ltp-timers.clock_settime: https://kernelci.org/test/case/id/63920a4722697da90d2abd43
failing since 42 days (last pass: v5.10.147-cip18-12-g7bc9523ecfb7f, first fail: v5.10.147-cip18-451-g87ba4bc77ca06)


cip-gitlab/ci/iwamatsu/linux-5.10.y-cip-rc kselftest-lib: 7 runs, 1 regressions (v5.10.155-cip21-405-g26d566555c3de) #kernelci

kernelci.org bot <bot@...>
 

cip-gitlab/ci/iwamatsu/linux-5.10.y-cip-rc kselftest-lib: 7 runs, 1 regressions (v5.10.155-cip21-405-g26d566555c3de)

Regressions Summary
-------------------

platform | arch | lab | compiler | defconfig | regressions
-----------------------------+-------+--------------+----------+---------------------+------------
meson-g12b-a311d-khadas-vim3 | arm64 | lab-baylibre | gcc-10 | defconfig+kselftest | 1

Details: https://kernelci.org/test/job/cip-gitlab/branch/ci%2Fiwamatsu%2Flinux-5.10.y-cip-rc/kernel/v5.10.155-cip21-405-g26d566555c3de/plan/kselftest-lib/

Test: kselftest-lib
Tree: cip-gitlab
Branch: ci/iwamatsu/linux-5.10.y-cip-rc
Describe: v5.10.155-cip21-405-g26d566555c3de
URL: https://gitlab.com/cip-project/cip-kernel/linux-cip.git
SHA: 26d566555c3de5796328380cfeda5b2372f45010


Test Regressions
----------------


platform | arch | lab | compiler | defconfig | regressions
-----------------------------+-------+--------------+----------+---------------------+------------
meson-g12b-a311d-khadas-vim3 | arm64 | lab-baylibre | gcc-10 | defconfig+kselftest | 1

Details: https://kernelci.org/test/plan/id/6391ffe6b443bb7a1c2abd06

Results: 0 PASS, 1 FAIL, 0 SKIP
Full config: defconfig+kselftest
Compiler: gcc-10 (aarch64-linux-gnu-gcc (Debian 10.2.1-6) 10.2.1 20210110)
Plain log: https://storage.kernelci.org//cip-gitlab/ci-iwamatsu-linux-5.10.y-cip-rc/v5.10.155-cip21-405-g26d566555c3de/arm64/defconfig+kselftest/gcc-10/lab-baylibre/kselftest-lib-meson-g12b-a311d-khadas-vim3.txt
HTML log: https://storage.kernelci.org//cip-gitlab/ci-iwamatsu-linux-5.10.y-cip-rc/v5.10.155-cip21-405-g26d566555c3de/arm64/defconfig+kselftest/gcc-10/lab-baylibre/kselftest-lib-meson-g12b-a311d-khadas-vim3.html
Rootfs: http://storage.kernelci.org/images/rootfs/debian/bullseye-kselftest/20221202.0/arm64/initrd.cpio.gz


* kselftest-lib.login: https://kernelci.org/test/case/id/6391ffe6b443bb7a1c2abd07
new failure (last pass: v5.10.153-cip19-122-g149fbc7cd21d)


cip-gitlab/ci/iwamatsu/linux-5.10.y-cip-rc kselftest-futex: 5 runs, 1 regressions (v5.10.155-cip21-405-g26d566555c3de) #kernelci

kernelci.org bot <bot@...>
 

cip-gitlab/ci/iwamatsu/linux-5.10.y-cip-rc kselftest-futex: 5 runs, 1 regressions (v5.10.155-cip21-405-g26d566555c3de)

Regressions Summary
-------------------

platform | arch | lab | compiler | defconfig | regressions
-----------------+------+---------+----------+--------------------+------------
beaglebone-black | arm | lab-cip | gcc-10 | multi_v7_defconfig | 1

Details: https://kernelci.org/test/job/cip-gitlab/branch/ci%2Fiwamatsu%2Flinux-5.10.y-cip-rc/kernel/v5.10.155-cip21-405-g26d566555c3de/plan/kselftest-futex/

Test: kselftest-futex
Tree: cip-gitlab
Branch: ci/iwamatsu/linux-5.10.y-cip-rc
Describe: v5.10.155-cip21-405-g26d566555c3de
URL: https://gitlab.com/cip-project/cip-kernel/linux-cip.git
SHA: 26d566555c3de5796328380cfeda5b2372f45010


Test Regressions
----------------


platform | arch | lab | compiler | defconfig | regressions
-----------------+------+---------+----------+--------------------+------------
beaglebone-black | arm | lab-cip | gcc-10 | multi_v7_defconfig | 1

Details: https://kernelci.org/test/plan/id/639200ed3ddfcfba432abdac

Results: 0 PASS, 1 FAIL, 0 SKIP
Full config: multi_v7_defconfig
Compiler: gcc-10 (arm-linux-gnueabihf-gcc (Debian 10.2.1-6) 10.2.1 20210110)
Plain log: https://storage.kernelci.org//cip-gitlab/ci-iwamatsu-linux-5.10.y-cip-rc/v5.10.155-cip21-405-g26d566555c3de/arm/multi_v7_defconfig/gcc-10/lab-cip/kselftest-futex-beaglebone-black.txt
HTML log: https://storage.kernelci.org//cip-gitlab/ci-iwamatsu-linux-5.10.y-cip-rc/v5.10.155-cip21-405-g26d566555c3de/arm/multi_v7_defconfig/gcc-10/lab-cip/kselftest-futex-beaglebone-black.html
Rootfs: http://storage.kernelci.org/images/rootfs/debian/bullseye-kselftest/20221202.0/armhf/initrd.cpio.gz


* kselftest-futex.login: https://kernelci.org/test/case/id/639200ed3ddfcfba432abdad
new failure (last pass: v5.10.154-cip20-99-g0e320e4d37e4)


cip-gitlab/ci/iwamatsu/linux-5.10.y-cip-rc baseline: 106 runs, 2 regressions (v5.10.155-cip21-405-g26d566555c3de) #kernelci

kernelci.org bot <bot@...>
 

cip-gitlab/ci/iwamatsu/linux-5.10.y-cip-rc baseline: 106 runs, 2 regressions (v5.10.155-cip21-405-g26d566555c3de)

Regressions Summary
-------------------

platform | arch | lab | compiler | defconfig | regressions
------------------+-------+---------------+----------+----------------------------+------------
r8a7743-iwg20d-q7 | arm | lab-cip | gcc-10 | shmobile_defconfig | 1
rk3399-gru-kevin | arm64 | lab-collabora | gcc-10 | defconfig+arm64-chromebook | 1

Details: https://kernelci.org/test/job/cip-gitlab/branch/ci%2Fiwamatsu%2Flinux-5.10.y-cip-rc/kernel/v5.10.155-cip21-405-g26d566555c3de/plan/baseline/

Test: baseline
Tree: cip-gitlab
Branch: ci/iwamatsu/linux-5.10.y-cip-rc
Describe: v5.10.155-cip21-405-g26d566555c3de
URL: https://gitlab.com/cip-project/cip-kernel/linux-cip.git
SHA: 26d566555c3de5796328380cfeda5b2372f45010


Test Regressions
----------------


platform | arch | lab | compiler | defconfig | regressions
------------------+-------+---------------+----------+----------------------------+------------
r8a7743-iwg20d-q7 | arm | lab-cip | gcc-10 | shmobile_defconfig | 1

Details: https://kernelci.org/test/plan/id/6391fab4f86f4a20f32abcfa

Results: 0 PASS, 1 FAIL, 0 SKIP
Full config: shmobile_defconfig
Compiler: gcc-10 (arm-linux-gnueabihf-gcc (Debian 10.2.1-6) 10.2.1 20210110)
Plain log: https://storage.kernelci.org//cip-gitlab/ci-iwamatsu-linux-5.10.y-cip-rc/v5.10.155-cip21-405-g26d566555c3de/arm/shmobile_defconfig/gcc-10/lab-cip/baseline-r8a7743-iwg20d-q7.txt
HTML log: https://storage.kernelci.org//cip-gitlab/ci-iwamatsu-linux-5.10.y-cip-rc/v5.10.155-cip21-405-g26d566555c3de/arm/shmobile_defconfig/gcc-10/lab-cip/baseline-r8a7743-iwg20d-q7.html
Rootfs: http://storage.kernelci.org/images/rootfs/buildroot/buildroot-baseline/20221125.0/armel/rootfs.cpio.gz


* baseline.login: https://kernelci.org/test/case/id/6391fab4f86f4a20f32abcfb
failing since 43 days (last pass: v5.10.147-cip18-56-g87bd4289362be, first fail: v5.10.147-cip18-12-g7bc9523ecfb7f)



platform | arch | lab | compiler | defconfig | regressions
------------------+-------+---------------+----------+----------------------------+------------
rk3399-gru-kevin | arm64 | lab-collabora | gcc-10 | defconfig+arm64-chromebook | 1

Details: https://kernelci.org/test/plan/id/639206c3cf6297ccc72abd0a

Results: 90 PASS, 2 FAIL, 0 SKIP
Full config: defconfig+arm64-chromebook
Compiler: gcc-10 (aarch64-linux-gnu-gcc (Debian 10.2.1-6) 10.2.1 20210110)
Plain log: https://storage.kernelci.org//cip-gitlab/ci-iwamatsu-linux-5.10.y-cip-rc/v5.10.155-cip21-405-g26d566555c3de/arm64/defconfig+arm64-chromebook/gcc-10/lab-collabora/baseline-rk3399-gru-kevin.txt
HTML log: https://storage.kernelci.org//cip-gitlab/ci-iwamatsu-linux-5.10.y-cip-rc/v5.10.155-cip21-405-g26d566555c3de/arm64/defconfig+arm64-chromebook/gcc-10/lab-collabora/baseline-rk3399-gru-kevin.html
Rootfs: http://storage.kernelci.org/images/rootfs/buildroot/buildroot-baseline/20221125.0/arm64/rootfs.cpio.gz


* baseline.bootrr.rockchip-i2s1-probed: https://kernelci.org/test/case/id/639206c3cf6297ccc72abd2c
failing since 274 days (last pass: v5.10.100-cip2-319-gcbff87047566, first fail: v5.10.100-cip2-425-g0a0d92194f39)

2022-12-08T15:45:52.341988 /lava-8290515/1/../bin/lava-test-case
2022-12-08T15:45:52.342913
2022-12-08T15:45:52.352452 <8>[ 34.010189] <LAVA_SIGNAL_TESTCASE TEST_CASE_ID=rockchip-i2s1-probed RESULT=fail>


cip-gitlab/ci/iwamatsu/linux-5.10.y-cip-rc baseline-nfs: 21 runs, 1 regressions (v5.10.155-cip21-405-g26d566555c3de) #kernelci

kernelci.org bot <bot@...>
 

cip-gitlab/ci/iwamatsu/linux-5.10.y-cip-rc baseline-nfs: 21 runs, 1 regressions (v5.10.155-cip21-405-g26d566555c3de)

Regressions Summary
-------------------

platform | arch | lab | compiler | defconfig | regressions
-----------------+-------+---------------+----------+----------------------------+------------
rk3399-gru-kevin | arm64 | lab-collabora | gcc-10 | defconfig+arm64-chromebook | 1

Details: https://kernelci.org/test/job/cip-gitlab/branch/ci%2Fiwamatsu%2Flinux-5.10.y-cip-rc/kernel/v5.10.155-cip21-405-g26d566555c3de/plan/baseline-nfs/

Test: baseline-nfs
Tree: cip-gitlab
Branch: ci/iwamatsu/linux-5.10.y-cip-rc
Describe: v5.10.155-cip21-405-g26d566555c3de
URL: https://gitlab.com/cip-project/cip-kernel/linux-cip.git
SHA: 26d566555c3de5796328380cfeda5b2372f45010


Test Regressions
----------------


platform | arch | lab | compiler | defconfig | regressions
-----------------+-------+---------------+----------+----------------------------+------------
rk3399-gru-kevin | arm64 | lab-collabora | gcc-10 | defconfig+arm64-chromebook | 1

Details: https://kernelci.org/test/plan/id/63920577c96d30f8202abd0a

Results: 84 PASS, 4 FAIL, 0 SKIP
Full config: defconfig+arm64-chromebook
Compiler: gcc-10 (aarch64-linux-gnu-gcc (Debian 10.2.1-6) 10.2.1 20210110)
Plain log: https://storage.kernelci.org//cip-gitlab/ci-iwamatsu-linux-5.10.y-cip-rc/v5.10.155-cip21-405-g26d566555c3de/arm64/defconfig+arm64-chromebook/gcc-10/lab-collabora/baseline-nfs-rk3399-gru-kevin.txt
HTML log: https://storage.kernelci.org//cip-gitlab/ci-iwamatsu-linux-5.10.y-cip-rc/v5.10.155-cip21-405-g26d566555c3de/arm64/defconfig+arm64-chromebook/gcc-10/lab-collabora/baseline-nfs-rk3399-gru-kevin.html
Rootfs: http://storage.kernelci.org/images/rootfs/debian/bullseye/20221202.0/arm64/initrd.cpio.gz


* baseline-nfs.bootrr.rockchip-i2s1-probed: https://kernelci.org/test/case/id/63920577c96d30f8202abd2c
failing since 274 days (last pass: v5.10.100-cip2-319-gcbff87047566, first fail: v5.10.100-cip2-425-g0a0d92194f39)

2022-12-08T15:40:23.544642 /lava-8290484/1/../bin/lava-test-case
2022-12-08T15:40:23.574600 [ 98.258979] <LAVA_SIGNAL_TESTCASE TEST_CASE_ID=rockchip-i2s1-probed RESULT=fail>


cip-gitlab/ci/iwamatsu/linux-5.10.y-cip-rc build: 189 builds: 3 failed, 186 passed, 4 errors, 9 warnings (v5.10.155-cip21-405-g26d566555c3de) #kernelci

kernelci.org bot <bot@...>
 

cip-gitlab/ci/iwamatsu/linux-5.10.y-cip-rc build: 189 builds: 3 failed, 186 passed, 4 errors, 9 warnings (v5.10.155-cip21-405-g26d566555c3de)

Full Build Summary: https://kernelci.org/build/cip-gitlab/branch/ci%2Fiwamatsu%2Flinux-5.10.y-cip-rc/kernel/v5.10.155-cip21-405-g26d566555c3de/

Tree: cip-gitlab
Branch: ci/iwamatsu/linux-5.10.y-cip-rc
Git Describe: v5.10.155-cip21-405-g26d566555c3de
Git Commit: 26d566555c3de5796328380cfeda5b2372f45010
Git URL: https://gitlab.com/cip-project/cip-kernel/linux-cip.git
Built: 7 unique architectures

Build Failures Detected:

arm:
rpc_defconfig: (gcc-10) FAIL

mips:
ip27_defconfig: (gcc-10) FAIL
ip28_defconfig: (gcc-10) FAIL

Errors and Warnings Detected:

arc:

arm64:

arm:
rpc_defconfig (gcc-10): 4 errors

i386:

mips:
32r2el_defconfig (gcc-10): 1 warning
decstation_64_defconfig (gcc-10): 1 warning
decstation_defconfig (gcc-10): 1 warning
decstation_r4k_defconfig (gcc-10): 1 warning
rm200_defconfig (gcc-10): 1 warning

riscv:
rv32_defconfig (gcc-10): 4 warnings

x86_64:

Errors summary:

2 arm-linux-gnueabihf-gcc: error: unrecognized -march target: armv3m
2 arm-linux-gnueabihf-gcc: error: missing argument to ‘-march=’

Warnings summary:

3 kernel/rcu/tasks.h:710:13: warning: ‘show_rcu_tasks_rude_gp_kthread’ defined but not used [-Wunused-function]
2 <stdin>:830:2: warning: #warning syscall fstat64 not implemented [-Wcpp]
2 <stdin>:1127:2: warning: #warning syscall fstatat64 not implemented [-Wcpp]
1 drivers/block/paride/bpck.c:32: warning: "PC" redefined
1 WARNING: modpost: Symbol info of vmlinux is missing. Unresolved symbol check will be entirely skipped.

Section mismatches summary:

1 WARNING: modpost: vmlinux.o(___ksymtab_gpl+ixp4xx_irq_init+0x0): Section mismatch in reference from the variable __ksymtab_ixp4xx_irq_init to the function .init.text:ixp4xx_irq_init()
1 WARNING: modpost: vmlinux.o(___ksymtab+prom_init_numa_memory+0x0): Section mismatch in reference from the variable __ksymtab_prom_init_numa_memory to the function .init.text:prom_init_numa_memory()

================================================================================

Detailed per-defconfig build reports:

--------------------------------------------------------------------------------
32r2el_defconfig (mips, gcc-10) — PASS, 0 errors, 1 warning, 0 section mismatches

Warnings:
WARNING: modpost: Symbol info of vmlinux is missing. Unresolved symbol check will be entirely skipped.

--------------------------------------------------------------------------------
allnoconfig (arc, gcc-10) — PASS, 0 errors, 0 warnings, 0 section mismatches

--------------------------------------------------------------------------------
allnoconfig (x86_64, gcc-10) — PASS, 0 errors, 0 warnings, 0 section mismatches

--------------------------------------------------------------------------------
allnoconfig (i386, gcc-10) — PASS, 0 errors, 0 warnings, 0 section mismatches

--------------------------------------------------------------------------------
am200epdkit_defconfig (arm, gcc-10) — PASS, 0 errors, 0 warnings, 0 section mismatches

--------------------------------------------------------------------------------
ar7_defconfig (mips, gcc-10) — PASS, 0 errors, 0 warnings, 0 section mismatches

--------------------------------------------------------------------------------
aspeed_g4_defconfig (arm, gcc-10) — PASS, 0 errors, 0 warnings, 0 section mismatches

--------------------------------------------------------------------------------
aspeed_g5_defconfig (arm, gcc-10) — PASS, 0 errors, 0 warnings, 0 section mismatches

--------------------------------------------------------------------------------
assabet_defconfig (arm, gcc-10) — PASS, 0 errors, 0 warnings, 0 section mismatches

--------------------------------------------------------------------------------
at91_dt_defconfig (arm, gcc-10) — PASS, 0 errors, 0 warnings, 0 section mismatches

--------------------------------------------------------------------------------
ath25_defconfig (mips, gcc-10) — PASS, 0 errors, 0 warnings, 0 section mismatches

--------------------------------------------------------------------------------
ath79_defconfig (mips, gcc-10) — PASS, 0 errors, 0 warnings, 0 section mismatches

--------------------------------------------------------------------------------
axm55xx_defconfig (arm, gcc-10) — PASS, 0 errors, 0 warnings, 0 section mismatches

--------------------------------------------------------------------------------
axs103_defconfig (arc, gcc-10) — PASS, 0 errors, 0 warnings, 0 section mismatches

--------------------------------------------------------------------------------
axs103_smp_defconfig (arc, gcc-10) — PASS, 0 errors, 0 warnings, 0 section mismatches

--------------------------------------------------------------------------------
badge4_defconfig (arm, gcc-10) — PASS, 0 errors, 0 warnings, 0 section mismatches

--------------------------------------------------------------------------------
bcm2835_defconfig (arm, gcc-10) — PASS, 0 errors, 0 warnings, 0 section mismatches

--------------------------------------------------------------------------------
bcm47xx_defconfig (mips, gcc-10) — PASS, 0 errors, 0 warnings, 0 section mismatches

--------------------------------------------------------------------------------
bcm63xx_defconfig (mips, gcc-10) — PASS, 0 errors, 0 warnings, 0 section mismatches

--------------------------------------------------------------------------------
bigsur_defconfig (mips, gcc-10) — PASS, 0 errors, 0 warnings, 0 section mismatches

--------------------------------------------------------------------------------
bmips_be_defconfig (mips, gcc-10) — PASS, 0 errors, 0 warnings, 0 section mismatches

--------------------------------------------------------------------------------
bmips_stb_defconfig (mips, gcc-10) — PASS, 0 errors, 0 warnings, 0 section mismatches

--------------------------------------------------------------------------------
capcella_defconfig (mips, gcc-10) — PASS, 0 errors, 0 warnings, 0 section mismatches

--------------------------------------------------------------------------------
cavium_octeon_defconfig (mips, gcc-10) — PASS, 0 errors, 0 warnings, 0 section mismatches

--------------------------------------------------------------------------------
cerfcube_defconfig (arm, gcc-10) — PASS, 0 errors, 0 warnings, 0 section mismatches

--------------------------------------------------------------------------------
ci20_defconfig (mips, gcc-10) — PASS, 0 errors, 0 warnings, 0 section mismatches

--------------------------------------------------------------------------------
cm_x300_defconfig (arm, gcc-10) — PASS, 0 errors, 0 warnings, 0 section mismatches

--------------------------------------------------------------------------------
cobalt_defconfig (mips, gcc-10) — PASS, 0 errors, 0 warnings, 0 section mismatches

--------------------------------------------------------------------------------
colibri_pxa270_defconfig (arm, gcc-10) — PASS, 0 errors, 0 warnings, 0 section mismatches

--------------------------------------------------------------------------------
colibri_pxa300_defconfig (arm, gcc-10) — PASS, 0 errors, 0 warnings, 0 section mismatches

--------------------------------------------------------------------------------
collie_defconfig (arm, gcc-10) — PASS, 0 errors, 0 warnings, 0 section mismatches

--------------------------------------------------------------------------------
corgi_defconfig (arm, gcc-10) — PASS, 0 errors, 0 warnings, 0 section mismatches

--------------------------------------------------------------------------------
cu1000-neo_defconfig (mips, gcc-10) — PASS, 0 errors, 0 warnings, 0 section mismatches

--------------------------------------------------------------------------------
cu1830-neo_defconfig (mips, gcc-10) — PASS, 0 errors, 0 warnings, 0 section mismatches

--------------------------------------------------------------------------------
davinci_all_defconfig (arm, gcc-10) — PASS, 0 errors, 0 warnings, 0 section mismatches

--------------------------------------------------------------------------------
db1xxx_defconfig (mips, gcc-10) — PASS, 0 errors, 0 warnings, 0 section mismatches

--------------------------------------------------------------------------------
decstation_64_defconfig (mips, gcc-10) — PASS, 0 errors, 1 warning, 0 section mismatches

Warnings:
kernel/rcu/tasks.h:710:13: warning: ‘show_rcu_tasks_rude_gp_kthread’ defined but not used [-Wunused-function]

--------------------------------------------------------------------------------
decstation_defconfig (mips, gcc-10) — PASS, 0 errors, 1 warning, 0 section mismatches

Warnings:
kernel/rcu/tasks.h:710:13: warning: ‘show_rcu_tasks_rude_gp_kthread’ defined but not used [-Wunused-function]

--------------------------------------------------------------------------------
decstation_r4k_defconfig (mips, gcc-10) — PASS, 0 errors, 1 warning, 0 section mismatches

Warnings:
kernel/rcu/tasks.h:710:13: warning: ‘show_rcu_tasks_rude_gp_kthread’ defined but not used [-Wunused-function]

--------------------------------------------------------------------------------
defconfig (riscv, gcc-10) — PASS, 0 errors, 0 warnings, 0 section mismatches

--------------------------------------------------------------------------------
defconfig+arm64-chromebook (arm64, gcc-10) — PASS, 0 errors, 0 warnings, 0 section mismatches

--------------------------------------------------------------------------------
defconfig+arm64-chromebook+kselftest (arm64, gcc-10) — PASS, 0 errors, 0 warnings, 0 section mismatches

--------------------------------------------------------------------------------
defconfig+kselftest (arm64, gcc-10) — PASS, 0 errors, 0 warnings, 0 section mismatches

--------------------------------------------------------------------------------
dove_defconfig (arm, gcc-10) — PASS, 0 errors, 0 warnings, 0 section mismatches

--------------------------------------------------------------------------------
e55_defconfig (mips, gcc-10) — PASS, 0 errors, 0 warnings, 0 section mismatches

--------------------------------------------------------------------------------
ebsa110_defconfig (arm, gcc-10) — PASS, 0 errors, 0 warnings, 0 section mismatches

--------------------------------------------------------------------------------
efm32_defconfig (arm, gcc-10) — PASS, 0 errors, 0 warnings, 0 section mismatches

--------------------------------------------------------------------------------
ep93xx_defconfig (arm, gcc-10) — PASS, 0 errors, 0 warnings, 0 section mismatches

--------------------------------------------------------------------------------
eseries_pxa_defconfig (arm, gcc-10) — PASS, 0 errors, 0 warnings, 0 section mismatches

--------------------------------------------------------------------------------
exynos_defconfig (arm, gcc-10) — PASS, 0 errors, 0 warnings, 0 section mismatches

--------------------------------------------------------------------------------
ezx_defconfig (arm, gcc-10) — PASS, 0 errors, 0 warnings, 0 section mismatches

--------------------------------------------------------------------------------
footbridge_defconfig (arm, gcc-10) — PASS, 0 errors, 0 warnings, 0 section mismatches

--------------------------------------------------------------------------------
fuloong2e_defconfig (mips, gcc-10) — PASS, 0 errors, 0 warnings, 0 section mismatches

--------------------------------------------------------------------------------
gcw0_defconfig (mips, gcc-10) — PASS, 0 errors, 0 warnings, 0 section mismatches

--------------------------------------------------------------------------------
gemini_defconfig (arm, gcc-10) — PASS, 0 errors, 0 warnings, 0 section mismatches

--------------------------------------------------------------------------------
gpr_defconfig (mips, gcc-10) — PASS, 0 errors, 0 warnings, 0 section mismatches

--------------------------------------------------------------------------------
h3600_defconfig (arm, gcc-10) — PASS, 0 errors, 0 warnings, 0 section mismatches

--------------------------------------------------------------------------------
h5000_defconfig (arm, gcc-10) — PASS, 0 errors, 0 warnings, 0 section mismatches

--------------------------------------------------------------------------------
hackkit_defconfig (arm, gcc-10) — PASS, 0 errors, 0 warnings, 0 section mismatches

--------------------------------------------------------------------------------
haps_hs_defconfig (arc, gcc-10) — PASS, 0 errors, 0 warnings, 0 section mismatches

--------------------------------------------------------------------------------
haps_hs_smp_defconfig (arc, gcc-10) — PASS, 0 errors, 0 warnings, 0 section mismatches

--------------------------------------------------------------------------------
hisi_defconfig (arm, gcc-10) — PASS, 0 errors, 0 warnings, 0 section mismatches

--------------------------------------------------------------------------------
hsdk_defconfig (arc, gcc-10) — PASS, 0 errors, 0 warnings, 0 section mismatches

--------------------------------------------------------------------------------
i386_defconfig (i386, gcc-10) — PASS, 0 errors, 0 warnings, 0 section mismatches

--------------------------------------------------------------------------------
imote2_defconfig (arm, gcc-10) — PASS, 0 errors, 0 warnings, 0 section mismatches

--------------------------------------------------------------------------------
imx_v4_v5_defconfig (arm, gcc-10) — PASS, 0 errors, 0 warnings, 0 section mismatches

--------------------------------------------------------------------------------
imx_v6_v7_defconfig (arm, gcc-10) — PASS, 0 errors, 0 warnings, 0 section mismatches

--------------------------------------------------------------------------------
integrator_defconfig (arm, gcc-10) — PASS, 0 errors, 0 warnings, 0 section mismatches

--------------------------------------------------------------------------------
iop32x_defconfig (arm, gcc-10) — PASS, 0 errors, 0 warnings, 0 section mismatches

--------------------------------------------------------------------------------
ip22_defconfig (mips, gcc-10) — PASS, 0 errors, 0 warnings, 0 section mismatches

--------------------------------------------------------------------------------
ip27_defconfig (mips, gcc-10) — FAIL, 0 errors, 0 warnings, 0 section mismatches

--------------------------------------------------------------------------------
ip28_defconfig (mips, gcc-10) — FAIL, 0 errors, 0 warnings, 0 section mismatches

--------------------------------------------------------------------------------
ip32_defconfig (mips, gcc-10) — PASS, 0 errors, 0 warnings, 0 section mismatches

--------------------------------------------------------------------------------
ixp4xx_defconfig (arm, gcc-10) — PASS, 0 errors, 0 warnings, 0 section mismatches

Section mismatches:
WARNING: modpost: vmlinux.o(___ksymtab_gpl+ixp4xx_irq_init+0x0): Section mismatch in reference from the variable __ksymtab_ixp4xx_irq_init to the function .init.text:ixp4xx_irq_init()

--------------------------------------------------------------------------------
jazz_defconfig (mips, gcc-10) — PASS, 0 errors, 0 warnings, 0 section mismatches

--------------------------------------------------------------------------------
jmr3927_defconfig (mips, gcc-10) — PASS, 0 errors, 0 warnings, 0 section mismatches

--------------------------------------------------------------------------------
jornada720_defconfig (arm, gcc-10) — PASS, 0 errors, 0 warnings, 0 section mismatches

--------------------------------------------------------------------------------
keystone_defconfig (arm, gcc-10) — PASS, 0 errors, 0 warnings, 0 section mismatches

--------------------------------------------------------------------------------
lart_defconfig (arm, gcc-10) — PASS, 0 errors, 0 warnings, 0 section mismatches

--------------------------------------------------------------------------------
lemote2f_defconfig (mips, gcc-10) — PASS, 0 errors, 0 warnings, 0 section mismatches

--------------------------------------------------------------------------------
loongson1b_defconfig (mips, gcc-10) — PASS, 0 errors, 0 warnings, 0 section mismatches

--------------------------------------------------------------------------------
loongson1c_defconfig (mips, gcc-10) — PASS, 0 errors, 0 warnings, 0 section mismatches

--------------------------------------------------------------------------------
loongson3_defconfig (mips, gcc-10) — PASS, 0 errors, 0 warnings, 0 section mismatches

Section mismatches:
WARNING: modpost: vmlinux.o(___ksymtab+prom_init_numa_memory+0x0): Section mismatch in reference from the variable __ksymtab_prom_init_numa_memory to the function .init.text:prom_init_numa_memory()

--------------------------------------------------------------------------------
lpc18xx_defconfig (arm, gcc-10) — PASS, 0 errors, 0 warnings, 0 section mismatches

--------------------------------------------------------------------------------
lpc32xx_defconfig (arm, gcc-10) — PASS, 0 errors, 0 warnings, 0 section mismatches

--------------------------------------------------------------------------------
lpd270_defconfig (arm, gcc-10) — PASS, 0 errors, 0 warnings, 0 section mismatches

--------------------------------------------------------------------------------
lubbock_defconfig (arm, gcc-10) — PASS, 0 errors, 0 warnings, 0 section mismatches

--------------------------------------------------------------------------------
magician_defconfig (arm, gcc-10) — PASS, 0 errors, 0 warnings, 0 section mismatches

--------------------------------------------------------------------------------
mainstone_defconfig (arm, gcc-10) — PASS, 0 errors, 0 warnings, 0 section mismatches

--------------------------------------------------------------------------------
malta_defconfig (mips, gcc-10) — PASS, 0 errors, 0 warnings, 0 section mismatches

--------------------------------------------------------------------------------
malta_kvm_defconfig (mips, gcc-10) — PASS, 0 errors, 0 warnings, 0 section mismatches

--------------------------------------------------------------------------------
malta_kvm_guest_defconfig (mips, gcc-10) — PASS, 0 errors, 0 warnings, 0 section mismatches

--------------------------------------------------------------------------------
malta_qemu_32r6_defconfig (mips, gcc-10) — PASS, 0 errors, 0 warnings, 0 section mismatches

--------------------------------------------------------------------------------
maltaaprp_defconfig (mips, gcc-10) — PASS, 0 errors, 0 warnings, 0 section mismatches

--------------------------------------------------------------------------------
maltasmvp_defconfig (mips, gcc-10) — PASS, 0 errors, 0 warnings, 0 section mismatches

--------------------------------------------------------------------------------
maltasmvp_eva_defconfig (mips, gcc-10) — PASS, 0 errors, 0 warnings, 0 section mismatches

--------------------------------------------------------------------------------
maltaup_defconfig (mips, gcc-10) — PASS, 0 errors, 0 warnings, 0 section mismatches

--------------------------------------------------------------------------------
maltaup_xpa_defconfig (mips, gcc-10) — PASS, 0 errors, 0 warnings, 0 section mismatches

--------------------------------------------------------------------------------
milbeaut_m10v_defconfig (arm, gcc-10) — PASS, 0 errors, 0 warnings, 0 section mismatches

--------------------------------------------------------------------------------
mini2440_defconfig (arm, gcc-10) — PASS, 0 errors, 0 warnings, 0 section mismatches

--------------------------------------------------------------------------------
mmp2_defconfig (arm, gcc-10) — PASS, 0 errors, 0 warnings, 0 section mismatches

--------------------------------------------------------------------------------
moxart_defconfig (arm, gcc-10) — PASS, 0 errors, 0 warnings, 0 section mismatches

--------------------------------------------------------------------------------
mpc30x_defconfig (mips, gcc-10) — PASS, 0 errors, 0 warnings, 0 section mismatches

--------------------------------------------------------------------------------
mps2_defconfig (arm, gcc-10) — PASS, 0 errors, 0 warnings, 0 section mismatches

--------------------------------------------------------------------------------
mtx1_defconfig (mips, gcc-10) — PASS, 0 errors, 0 warnings, 0 section mismatches

--------------------------------------------------------------------------------
multi_v4t_defconfig (arm, gcc-10) — PASS, 0 errors, 0 warnings, 0 section mismatches

--------------------------------------------------------------------------------
multi_v5_defconfig (arm, gcc-10) — PASS, 0 errors, 0 warnings, 0 section mismatches

--------------------------------------------------------------------------------
multi_v7_defconfig (arm, gcc-10) — PASS, 0 errors, 0 warnings, 0 section mismatches

--------------------------------------------------------------------------------
multi_v7_defconfig+kselftest (arm, gcc-10) — PASS, 0 errors, 0 warnings, 0 section mismatches

--------------------------------------------------------------------------------
mvebu_v5_defconfig (arm, gcc-10) — PASS, 0 errors, 0 warnings, 0 section mismatches

--------------------------------------------------------------------------------
mvebu_v7_defconfig (arm, gcc-10) — PASS, 0 errors, 0 warnings, 0 section mismatches

--------------------------------------------------------------------------------
mxs_defconfig (arm, gcc-10) — PASS, 0 errors, 0 warnings, 0 section mismatches

--------------------------------------------------------------------------------
neponset_defconfig (arm, gcc-10) — PASS, 0 errors, 0 warnings, 0 section mismatches

--------------------------------------------------------------------------------
netwinder_defconfig (arm, gcc-10) — PASS, 0 errors, 0 warnings, 0 section mismatches

--------------------------------------------------------------------------------
nhk8815_defconfig (arm, gcc-10) — PASS, 0 errors, 0 warnings, 0 section mismatches

--------------------------------------------------------------------------------
nlm_xlp_defconfig (mips, gcc-10) — PASS, 0 errors, 0 warnings, 0 section mismatches

--------------------------------------------------------------------------------
nlm_xlr_defconfig (mips, gcc-10) — PASS, 0 errors, 0 warnings, 0 section mismatches

--------------------------------------------------------------------------------
nommu_k210_defconfig (riscv, gcc-10) — PASS, 0 errors, 0 warnings, 0 section mismatches

--------------------------------------------------------------------------------
nsimosci_hs_defconfig (arc, gcc-10) — PASS, 0 errors, 0 warnings, 0 section mismatches

--------------------------------------------------------------------------------
nsimosci_hs_smp_defconfig (arc, gcc-10) — PASS, 0 errors, 0 warnings, 0 section mismatches

--------------------------------------------------------------------------------
omap1_defconfig (arm, gcc-10) — PASS, 0 errors, 0 warnings, 0 section mismatches

--------------------------------------------------------------------------------
omap2plus_defconfig (arm, gcc-10) — PASS, 0 errors, 0 warnings, 0 section mismatches

--------------------------------------------------------------------------------
omega2p_defconfig (mips, gcc-10) — PASS, 0 errors, 0 warnings, 0 section mismatches

--------------------------------------------------------------------------------
orion5x_defconfig (arm, gcc-10) — PASS, 0 errors, 0 warnings, 0 section mismatches

--------------------------------------------------------------------------------
oxnas_v6_defconfig (arm, gcc-10) — PASS, 0 errors, 0 warnings, 0 section mismatches

--------------------------------------------------------------------------------
palmz72_defconfig (arm, gcc-10) — PASS, 0 errors, 0 warnings, 0 section mismatches

--------------------------------------------------------------------------------
pcm027_defconfig (arm, gcc-10) — PASS, 0 errors, 0 warnings, 0 section mismatches

--------------------------------------------------------------------------------
pic32mzda_defconfig (mips, gcc-10) — PASS, 0 errors, 0 warnings, 0 section mismatches

--------------------------------------------------------------------------------
pistachio_defconfig (mips, gcc-10) — PASS, 0 errors, 0 warnings, 0 section mismatches

--------------------------------------------------------------------------------
pleb_defconfig (arm, gcc-10) — PASS, 0 errors, 0 warnings, 0 section mismatches

--------------------------------------------------------------------------------
prima2_defconfig (arm, gcc-10) — PASS, 0 errors, 0 warnings, 0 section mismatches

--------------------------------------------------------------------------------
pxa168_defconfig (arm, gcc-10) — PASS, 0 errors, 0 warnings, 0 section mismatches

--------------------------------------------------------------------------------
pxa255-idp_defconfig (arm, gcc-10) — PASS, 0 errors, 0 warnings, 0 section mismatches

--------------------------------------------------------------------------------
pxa3xx_defconfig (arm, gcc-10) — PASS, 0 errors, 0 warnings, 0 section mismatches

--------------------------------------------------------------------------------
pxa910_defconfig (arm, gcc-10) — PASS, 0 errors, 0 warnings, 0 section mismatches

--------------------------------------------------------------------------------
pxa_defconfig (arm, gcc-10) — PASS, 0 errors, 0 warnings, 0 section mismatches

--------------------------------------------------------------------------------
qcom_defconfig (arm, gcc-10) — PASS, 0 errors, 0 warnings, 0 section mismatches

--------------------------------------------------------------------------------
qi_lb60_defconfig (mips, gcc-10) — PASS, 0 errors, 0 warnings, 0 section mismatches

--------------------------------------------------------------------------------
rb532_defconfig (mips, gcc-10) — PASS, 0 errors, 0 warnings, 0 section mismatches

--------------------------------------------------------------------------------
rbtx49xx_defconfig (mips, gcc-10) — PASS, 0 errors, 0 warnings, 0 section mismatches

--------------------------------------------------------------------------------
realview_defconfig (arm, gcc-10) — PASS, 0 errors, 0 warnings, 0 section mismatches

--------------------------------------------------------------------------------
rm200_defconfig (mips, gcc-10) — PASS, 0 errors, 1 warning, 0 section mismatches

Warnings:
drivers/block/paride/bpck.c:32: warning: "PC" redefined

--------------------------------------------------------------------------------
rpc_defconfig (arm, gcc-10) — FAIL, 4 errors, 0 warnings, 0 section mismatches

Errors:
arm-linux-gnueabihf-gcc: error: unrecognized -march target: armv3m
arm-linux-gnueabihf-gcc: error: missing argument to ‘-march=’
arm-linux-gnueabihf-gcc: error: unrecognized -march target: armv3m
arm-linux-gnueabihf-gcc: error: missing argument to ‘-march=’

--------------------------------------------------------------------------------
rs90_defconfig (mips, gcc-10) — PASS, 0 errors, 0 warnings, 0 section mismatches

--------------------------------------------------------------------------------
rt305x_defconfig (mips, gcc-10) — PASS, 0 errors, 0 warnings, 0 section mismatches

--------------------------------------------------------------------------------
rv32_defconfig (riscv, gcc-10) — PASS, 0 errors, 4 warnings, 0 section mismatches

Warnings:
<stdin>:830:2: warning: #warning syscall fstat64 not implemented [-Wcpp]
<stdin>:1127:2: warning: #warning syscall fstatat64 not implemented [-Wcpp]
<stdin>:830:2: warning: #warning syscall fstat64 not implemented [-Wcpp]
<stdin>:1127:2: warning: #warning syscall fstatat64 not implemented [-Wcpp]

--------------------------------------------------------------------------------
s3c2410_defconfig (arm, gcc-10) — PASS, 0 errors, 0 warnings, 0 section mismatches

--------------------------------------------------------------------------------
s3c6400_defconfig (arm, gcc-10) — PASS, 0 errors, 0 warnings, 0 section mismatches

--------------------------------------------------------------------------------
s5pv210_defconfig (arm, gcc-10) — PASS, 0 errors, 0 warnings, 0 section mismatches

--------------------------------------------------------------------------------
sama5_defconfig (arm, gcc-10) — PASS, 0 errors, 0 warnings, 0 section mismatches

--------------------------------------------------------------------------------
sb1250_swarm_defconfig (mips, gcc-10) — PASS, 0 errors, 0 warnings, 0 section mismatches

--------------------------------------------------------------------------------
shannon_defconfig (arm, gcc-10) — PASS, 0 errors, 0 warnings, 0 section mismatches

--------------------------------------------------------------------------------
shmobile_defconfig (arm, gcc-10) — PASS, 0 errors, 0 warnings, 0 section mismatches

--------------------------------------------------------------------------------
simpad_defconfig (arm, gcc-10) — PASS, 0 errors, 0 warnings, 0 section mismatches

--------------------------------------------------------------------------------
socfpga_defconfig (arm, gcc-10) — PASS, 0 errors, 0 warnings, 0 section mismatches

--------------------------------------------------------------------------------
spear13xx_defconfig (arm, gcc-10) — PASS, 0 errors, 0 warnings, 0 section mismatches

--------------------------------------------------------------------------------
spear3xx_defconfig (arm, gcc-10) — PASS, 0 errors, 0 warnings, 0 section mismatches

--------------------------------------------------------------------------------
spear6xx_defconfig (arm, gcc-10) — PASS, 0 errors, 0 warnings, 0 section mismatches

--------------------------------------------------------------------------------
spitz_defconfig (arm, gcc-10) — PASS, 0 errors, 0 warnings, 0 section mismatches

--------------------------------------------------------------------------------
stm32_defconfig (arm, gcc-10) — PASS, 0 errors, 0 warnings, 0 section mismatches

--------------------------------------------------------------------------------
sunxi_defconfig (arm, gcc-10) — PASS, 0 errors, 0 warnings, 0 section mismatches

--------------------------------------------------------------------------------
tango4_defconfig (arm, gcc-10) — PASS, 0 errors, 0 warnings, 0 section mismatches

--------------------------------------------------------------------------------
tb0219_defconfig (mips, gcc-10) — PASS, 0 errors, 0 warnings, 0 section mismatches

--------------------------------------------------------------------------------
tb0226_defconfig (mips, gcc-10) — PASS, 0 errors, 0 warnings, 0 section mismatches

--------------------------------------------------------------------------------
tb0287_defconfig (mips, gcc-10) — PASS, 0 errors, 0 warnings, 0 section mismatches

--------------------------------------------------------------------------------
tct_hammer_defconfig (arm, gcc-10) — PASS, 0 errors, 0 warnings, 0 section mismatches

--------------------------------------------------------------------------------
tegra_defconfig (arm, gcc-10) — PASS, 0 errors, 0 warnings, 0 section mismatches

--------------------------------------------------------------------------------
tinyconfig (x86_64, gcc-10) — PASS, 0 errors, 0 warnings, 0 section mismatches

--------------------------------------------------------------------------------
tinyconfig (i386, gcc-10) — PASS, 0 errors, 0 warnings, 0 section mismatches

--------------------------------------------------------------------------------
tinyconfig (arc, gcc-10) — PASS, 0 errors, 0 warnings, 0 section mismatches

--------------------------------------------------------------------------------
trizeps4_defconfig (arm, gcc-10) — PASS, 0 errors, 0 warnings, 0 section mismatches

--------------------------------------------------------------------------------
u300_defconfig (arm, gcc-10) — PASS, 0 errors, 0 warnings, 0 section mismatches

--------------------------------------------------------------------------------
u8500_defconfig (arm, gcc-10) — PASS, 0 errors, 0 warnings, 0 section mismatches

--------------------------------------------------------------------------------
vdk_hs38_defconfig (arc, gcc-10) — PASS, 0 errors, 0 warnings, 0 section mismatches

--------------------------------------------------------------------------------
vdk_hs38_smp_defconfig (arc, gcc-10) — PASS, 0 errors, 0 warnings, 0 section mismatches

--------------------------------------------------------------------------------
versatile_defconfig (arm, gcc-10) — PASS, 0 errors, 0 warnings, 0 section mismatches

--------------------------------------------------------------------------------
vexpress_defconfig (arm, gcc-10) — PASS, 0 errors, 0 warnings, 0 section mismatches

--------------------------------------------------------------------------------
vf610m4_defconfig (arm, gcc-10) — PASS, 0 errors, 0 warnings, 0 section mismatches

--------------------------------------------------------------------------------
viper_defconfig (arm, gcc-10) — PASS, 0 errors, 0 warnings, 0 section mismatches

--------------------------------------------------------------------------------
vocore2_defconfig (mips, gcc-10) — PASS, 0 errors, 0 warnings, 0 section mismatches

--------------------------------------------------------------------------------
vt8500_v6_v7_defconfig (arm, gcc-10) — PASS, 0 errors, 0 warnings, 0 section mismatches

--------------------------------------------------------------------------------
workpad_defconfig (mips, gcc-10) — PASS, 0 errors, 0 warnings, 0 section mismatches

--------------------------------------------------------------------------------
x86_64_defconfig (x86_64, gcc-10) — PASS, 0 errors, 0 warnings, 0 section mismatches

--------------------------------------------------------------------------------
x86_64_defconfig+kselftest (x86_64, gcc-10) — PASS, 0 errors, 0 warnings, 0 section mismatches

--------------------------------------------------------------------------------
x86_64_defconfig+x86-chromebook (x86_64, gcc-10) — PASS, 0 errors, 0 warnings, 0 section mismatches

--------------------------------------------------------------------------------
x86_64_defconfig+x86-chromebook+kselftest (x86_64, gcc-10) — PASS, 0 errors, 0 warnings, 0 section mismatches

--------------------------------------------------------------------------------
xcep_defconfig (arm, gcc-10) — PASS, 0 errors, 0 warnings, 0 section mismatches

--------------------------------------------------------------------------------
zeus_defconfig (arm, gcc-10) — PASS, 0 errors, 0 warnings, 0 section mismatches

--------------------------------------------------------------------------------
zx_defconfig (arm, gcc-10) — PASS, 0 errors, 0 warnings, 0 section mismatches

---
For more info write to <info@...>


Re: [isar-cip-core] security-customizations: Fix account locked for non-consecutive failed attempts

Jan Kiszka
 

On 28.11.22 06:25, Sai.Sathujoda@... wrote:
From: Sai <Sai.Sathujoda@...>

As per security configuration the user account should be locked for consecutive
failed login attempts, but with current pam configuration it is locked even for
non-consecutive failed login attempts, because it is missing the pam configuration
in account phase which will do necessary reset for non-consecutive failed attempts.

Closes [1]
[1] https://gitlab.com/cip-project/cip-testing/cip-security-tests/-/issues/3

Signed-off-by: Sai <Sai.Sathujoda@...>
---
recipes-core/security-customizations/files/postinst | 6 ++++--
1 file changed, 4 insertions(+), 2 deletions(-)

diff --git a/recipes-core/security-customizations/files/postinst b/recipes-core/security-customizations/files/postinst
index 0d0eb07..4ff8ecf 100644
--- a/recipes-core/security-customizations/files/postinst
+++ b/recipes-core/security-customizations/files/postinst
@@ -25,11 +25,13 @@ PAM_AUTH_FILE="/etc/pam.d/common-auth"
# pam_tally2 is deprecated from pam version 1.4.0-7
if [ -f /lib/*-linux-gnu*/security/pam_tally2.so ]; then
PAM_MODULE="pam_tally2.so"
- PAM_CONFIG="auth required pam_tally2.so deny=3 even_deny_root unlock_time=60 root_unlock_time=60"
+ PAM_CONFIG="auth required pam_tally2.so deny=3 even_deny_root unlock_time=60 root_unlock_time=60
+ \naccount required pam_tally2.so"
elif [ -f /lib/*-linux-gnu*/security/pam_faillock.so ]; then
PAM_MODULE="pam_faillock.so"
PAM_CONFIG="auth required pam_faillock.so preauth silent deny=3 even_deny_root unlock_time=60 root_unlock_time=60 \
- \nauth required pam_faillock.so .so authfail deny=3 even_deny_root unlock_time=60 root_unlock_time=60"
+ \nauth required pam_faillock.so .so authfail deny=3 even_deny_root unlock_time=60 root_unlock_time=60 \
+ \naccount required pam_faillock.so"
else
echo "No suitable pam module found to lock failed login attempts"
exit 1
Thanks, applied.

Jan

--
Siemens AG, Technology
Competence Center Embedded Linux


Re: [isar-cip-core][PATCH] initramfs-abrootfs: check if /etc/os-release exists

Jan Kiszka
 

On 30.11.22 12:18, Quirin Gylstorff wrote:
From: Quirin Gylstorff <quirin.gylstorff@...>

If a valid root file system does not contain /etc/os-release the
script aborts before checking other root file systems. This occurs
for example if the boot occurs from a USB stick and a ext4 root
file system exists on internal memory.

Also ensure that IMAGE_UUID and TARGET_IMAGE_UUID are not empty
before comparing to each other.

Signed-off-by: Quirin Gylstorff <quirin.gylstorff@...>
---
.../initramfs-abrootfs-hook/files/abrootfs.script | 7 +++++--
1 file changed, 5 insertions(+), 2 deletions(-)

diff --git a/recipes-initramfs/initramfs-abrootfs-hook/files/abrootfs.script b/recipes-initramfs/initramfs-abrootfs-hook/files/abrootfs.script
index 23bbfe7..848e829 100644
--- a/recipes-initramfs/initramfs-abrootfs-hook/files/abrootfs.script
+++ b/recipes-initramfs/initramfs-abrootfs-hook/files/abrootfs.script
@@ -35,9 +35,12 @@ find_root_via_image_uuid()
for part in $partitions; do
if [ "$(blkid -p "${part}" --match-types novfat -s USAGE -o value)" = "filesystem" ]; then
mount -o ro -t "$(get_fstype "${part}")" "${part}" "${rootmnt}"
- . "${rootmnt}/etc/os-release"
+ if [ -e "${rootmnt}/etc/os-release" ]; then
+ . "${rootmnt}/etc/os-release"
+ fi
umount "${rootmnt}"
- if [ "${IMAGE_UUID}" = "${TARGET_IMAGE_UUID}" ]; then
+ if [ -n "${IMAGE_UUID}" ] && [ -n "${TARGET_IMAGE_UUID}" ] &&
+ [ "${IMAGE_UUID}" = "${TARGET_IMAGE_UUID}" ]; then
found_root="${part}"
break
fi
Thanks, applied.

Jan

--
Siemens AG, Technology
Competence Center Embedded Linux


CIP IRC weekly meeting today on libera.chat

Jan Kiszka
 

Hi all,

Kindly be reminded to attend the weekly meeting through IRC to discuss
technical topics with CIP kernel today. Our channel is the following:

irc:irc.libera.chat:6667/cip

The IRC meeting is scheduled to UTC (GMT) 12:00:

https://www.timeanddate.com/worldclock/meetingdetails.html?year=2022&month=12&day=8&hour=12&min=0&sec=0&p1=224&p2=179&p3=136&p4=37&p5=241&p6=248

USWest USEast UK DE TW JP
05:00 08:00 12:00 13:00 20:00 21:00

Last meeting minutes:
https://ircbot.wl.linuxfoundation.org/meetings/cip/2022/12/cip.2022-12-01-12.04.log.html

* Action items
1. Add qemu-riscv to cip-kernel-config - patersonc
* Kernel maintenance updates
* Kernel release status
- 4.4
- 4.19
- 5.10
* Kernel testing
* AOB

Jan


New CVE entries this week

Masami Ichikawa
 

Hi !

It's this week's CVE report.

This week reported 9 new CVEs and 3 updated CVEs.

* New CVEs

CVE-2022-4269: kernel: net: CPU soft lockup in TC mirred
egress-to-ingress action

CVSS v3 score is 5.5MEDIUM.

A deadlock bug was found in the Linux kernel traffic control(TC)
subsystem. When configuring redirecting egress packets to ingress
using TC action "mirred" a local user could trigger deadlock.
This issue was introduced by commit 53592b364001 ("net/sched:
act_mirred: Implement ingress actions") in 4.10-rc1.

Fixed status
Patch is available but it hasn't been merged into the mainlin yet.

CVE-2022-20565: HID: core: Correctly handle ReportSize being zero

CVSS v3 score is not provided.

If ReportSize is 0 which is legal value, calculating total size of
byte will be wrong. When the wrong value is passed to memset() it will
access invalid memory area.
This bug was fixed in 5.9-rc4. cip/4.4 kernels contain backport commit 12b27c4.

Fixed status
mainline: [bce1305c0ece3dc549663605e567655dd701752c]
stable/4.14: [9e5894b7e2229e6d89319864fb08304571fd44f7]
stable/4.19: [abae259fdccc5e41ff302dd80a2b944ce385c970]
stable/4.9: [cf7797ea60e3e721e3ae5090edbc2ec72d715436]
stable/5.4: [667514df10a08e4a65cb88f5fd5ffeccd027c4af]

CVE-2022-20566: Bluetooth: L2CAP: Fix use-after-free caused by l2cap_chan_put

CVSS v3 score is not provided.

A use-after-free bug was found in the Bluetooth subsystem.
When hci_rx_work() starts up after the final channel reference has
been put during sock_clone() and this channel has been destroyed
before starting hci_rx_work(), it will lead to a UAF bug.
cip/4.4 kernels contain backport commit 46e77e0.

This bug was fixed in 5.19.

Fixed status
mainline: [d0be8347c623e0ac4202a1d4e0373882821f56b0]
stable/4.14: [5bb395334392891dffae5a0e8f37dbe1d70496c9]
stable/4.19: [bbd1fdb0e1adf827997a93bf108f20ede038e56e]
stable/4.9: [d255c861e268ba342e855244639a15f12d7a0bf2]
stable/5.10: [de5d4654ac6c22b1be756fdf7db18471e7df01ea]
stable/5.15: [f32d5615a78a1256c4f557ccc6543866e75d03f4]
stable/5.4: [098e07ef0059296e710a801cdbd74b59016e6624]

CVE-2022-20567: l2tp: fix race in pppol2tp_release with session object destroy

CVSS v3 score is not provided.

A race condition bug was found in l2tp subsystem. When
pppol2tp_release() put final reference on its socket by call_rcu,
while pppol2tp_put_sk() is running, pppol2tp_release() may release an
already freed socket.

This bug was introduced by commit ee40fb2 ("l2tp: protect sock pointer
of struct pppol2tp_session with RCU") in 4.15-rc1 and fixed in
4.16-rc5.
cip/4.4 kernels contain backport commit b241b0c.

Fixed status
mainline: [d02ba2a6110c530a32926af8ad441111774d2893]
stable/4.14: [1819c764fe0f851942c2b3cf5dae516e7bbe69d8]
stable/4.9: [267b8fa3f5bf8ca6458670298a02f7438855bd80]

CVE-2022-20568: io_uring: always grab file table for deferred statx

CVSS v3 score is not provided.

A use-after-free bug was found in io_uring.
This bug was only in the 5.10.y stable kernel series. According to the
commit log, it said that "This issues doesn't exist upstream since the
native workers got introduced with 5.12."

Fixed status
stable/5.10: [3c48558be571e01f67e65edcf03193484eeb2b79]

CVE-2022-3643: xen/netback: Ensure protocol headers don''t fall in the
non-linear area

CVSS v3 score is not provided.

A xen guest can reset/abort/crash NIC interface by sending certain
kinds of packets.
This bug was introduced by commit 7e5d775 ("xen-netback: remove
unconditional __pskb_pull_tail() in guest Tx path") in 3.19-rc1 so all
stable kernels affected by this issue.

Fixed status
mainline: [ad7f402ae4f466647c3a669b8a6f3e5d4271c84a]

CVE-2022-42328: xen/netback: don''t call kfree_skb() with interrupts disabled
CVE-2022-42329: xen/netback: don''t call kfree_skb() with interrupts disabled

CVSS v3 score is not provided.

CVE-2022-42328 and CVE-2022-42329 have the same root cause and are
also fixed by the same commit.

Introduced by commit be81992 ("xen/netback: don't queue unlimited
number of packages") in v5.16-rc7. This commit fixes f48da8b
("xen-netback: fix unlimited guest Rx internal queue and carrier
flapping") in 3.18-rc3.
Commit be81992 is not backported to 4.4 kernel because
drivers/net/xen-netback/rx.c isn't present in 4.4.
However, 4.9, 4.19, 5.4, 5.10, 5.15 are affected.

Fixed status
mainline: [74e7e1efdad45580cc3839f2a155174cf158f9b5]

CVE-2022-20572: dm verity: set DM_TARGET_IMMUTABLE feature flag

CVSS v3 score is not provided.

The dm-verity doesn't set its feature as immutable so that it allows a
user to change its target type.

Introduced by commit a4ffc15 ("dm: add verity target") in 3.4-rc1.
In kernel 4.4, verity_target variable is defined in drivers/md/dm-verity.c.

Fixed status
mainline: [4caae58406f8ceb741603eee460d79bacca9b1b5]
stable/4.14: [388bc1e69663956f8cee43af3bd02bd3061d222d]
stable/4.19: [6bff6107d1364c95109609c3fd680e6c8d7fa503]
stable/4.9: [27798cca4e54fe9c390396c4cc655480f827bbd5]
stable/5.10: [8df42bcd364cc3b41105215d841792aea787b133]
stable/5.15: [69712b170237ec5979f168149cd31e851a465853]
stable/5.4: [fd2f7e9984850a0162bfb6948b98ffac9fb5fa58]

* Updated CVEs

CVE-2022-3344: KVM: SVM: nested shutdown interception could lead to host crash

5.15 and 6.0 were fixed.

Fixed status
mainline: [16ae56d7e0528559bf8dc9070e3bfd8ba3de80df,
ed129ec9057f89d615ba0c81a4984a90345a1684]
stable/5.15: [3e87cb0caa25d667a9ca2fe15fef889e43ab8f95,
6425c590d0cc6914658a630a40b7f8226aa028c3]
stable/6.0: [5ca2721b7d3ed4d3da6323a2ea7339f745866d83,
d40ef0a511676bd65ca9acb295430c07af59ab85]

CVE-2022-4139: drm/i915: fix TLB invalidation for Gen12 video and
compute engines

5.10, 5.15, and 6.0 were fixed.

Fixed status
mainline: [04aa64375f48a5d430b5550d9271f8428883e550]
stable/5.10: [86f0082fb9470904b15546726417f28077088fee]
stable/5.15: [ee2d04f23bbb16208045c3de545c6127aaa1ed0e]
stable/6.0: [aef39675ad33317c8badc0165ea882e172a633e6]

CVE-2022-45869: KVM: x86/mmu: Fix race condition in direct_page_fault

6.0 was fixed.

Fixed status
mainline: [47b0c2e4c220f2251fd8dcfbb44479819c715e15]
stable/6.0: [34ced1da74eb975abdf7ef823512c7719f67601b]

Currently tracking CVEs

CVE-2021-31615: Unencrypted Bluetooth Low Energy baseband links in
Bluetooth Core Specifications 4.0 through 5.2

There is no fix information.

CVE-2020-26556: kernel: malleable commitment Bluetooth Mesh Provisioning

No fix information.

CVE-2020-26557: kernel: predictable Authvalue in Bluetooth Mesh
Provisioning Leads to MITM

No fix information.

CVE-2020-26559: kernel: Authvalue leak in Bluetooth Mesh Provisioning

No fix information.

CVE-2020-26560: kernel: impersonation attack in Bluetooth Mesh Provisioning

No fix information.

Regards,
--
Masami Ichikawa
Cybertrust Japan Co., Ltd.

Email :masami.ichikawa@...
:masami.ichikawa@...


Re: [isar-cip-core] security-customizations: Fix account locked for non-consecutive failed attempts

sai.sathujoda@...
 

Hi Jan,

Can you please review this patch ?

Regards,
Sai Ashrith (T S I P)

-----Original Message-----
From: Sai.Sathujoda@... <Sai.Sathujoda@...>
Sent: Monday, November 28, 2022 10:55 AM
To: cip-dev@...; jan.kiszka@...
Cc: ashrith sai(TSIP) <Sai.Sathujoda@...>; dinesh kumar(TSIP TMIEC ODG Porting) <dinesh.kumar@...>; hayashi kazuhiro(林 和宏 □SWC◯ACT) <kazuhiro3.hayashi@...>
Subject: [isar-cip-core] security-customizations: Fix account locked for non-consecutive failed attempts

From: Sai <Sai.Sathujoda@...>

As per security configuration the user account should be locked for consecutive failed login attempts, but with current pam configuration it is locked even for non-consecutive failed login attempts, because it is missing the pam configuration in account phase which will do necessary reset for non-consecutive failed attempts.

Closes [1]
[1] https://gitlab.com/cip-project/cip-testing/cip-security-tests/-/issues/3

Signed-off-by: Sai <Sai.Sathujoda@...>
---
recipes-core/security-customizations/files/postinst | 6 ++++--
1 file changed, 4 insertions(+), 2 deletions(-)

diff --git a/recipes-core/security-customizations/files/postinst b/recipes-core/security-customizations/files/postinst
index 0d0eb07..4ff8ecf 100644
--- a/recipes-core/security-customizations/files/postinst
+++ b/recipes-core/security-customizations/files/postinst
@@ -25,11 +25,13 @@ PAM_AUTH_FILE="/etc/pam.d/common-auth"
# pam_tally2 is deprecated from pam version 1.4.0-7 if [ -f /lib/*-linux-gnu*/security/pam_tally2.so ]; then
PAM_MODULE="pam_tally2.so"
- PAM_CONFIG="auth required pam_tally2.so deny=3 even_deny_root unlock_time=60 root_unlock_time=60"
+ PAM_CONFIG="auth required pam_tally2.so deny=3 even_deny_root unlock_time=60 root_unlock_time=60
+ \naccount required pam_tally2.so"
elif [ -f /lib/*-linux-gnu*/security/pam_faillock.so ]; then
PAM_MODULE="pam_faillock.so"
PAM_CONFIG="auth required pam_faillock.so preauth silent deny=3 even_deny_root unlock_time=60 root_unlock_time=60 \
- \nauth required pam_faillock.so .so authfail deny=3 even_deny_root unlock_time=60 root_unlock_time=60"
+ \nauth required pam_faillock.so .so authfail deny=3 even_deny_root unlock_time=60 root_unlock_time=60 \
+ \naccount required pam_faillock.so"
else
echo "No suitable pam module found to lock failed login attempts"
exit 1
--
2.20.1


Re: [RESEND][PATCH for 4.4.y] extcon: adc-jack: Fix incompatible pointer type warning

Pavel Machek
 

Hi!

From: Peter Foley <pefoley2@...>

commit 8a522bf2d4f788306443d36b26b54f0aedcdfdbe upstream.

This patch fixes the incompatible warning of extcon-adc-jack.c driver
when calling devm_extcon_dev_allocate().

Signed-off-by: Peter Foley <pefoley2@...>
[cw00.choi: Modify the patch title and descritpion]
Signed-off-by: Chanwoo Choi <cw00.choi@...>
Signed-off-by: Nobuhiro Iwamatsu <nobuhiro1.iwamatsu@...>
Thank you, applied to 4.4-cip.

Best regards,
Pavel
--
DENX Software Engineering GmbH, Managing Director: Wolfgang Denk
HRB 165235 Munich, Office: Kirchenstr.5, D-82194 Groebenzell, Germany


cip/linux-4.4.y-cip ltp-pty: 2 runs, 1 regressions (v4.4.302-cip71-1-g61333eee4869) #kernelci

kernelci.org bot <bot@...>
 

cip/linux-4.4.y-cip ltp-pty: 2 runs, 1 regressions (v4.4.302-cip71-1-g61333eee4869)

Regressions Summary
-------------------

platform | arch | lab | compiler | defconfig | regressions
-------------------------+--------+---------------+----------+------------------------------+------------
asus-C523NA-A20057-coral | x86_64 | lab-collabora | gcc-10 | x86_64_defcon...6-chromebook | 1

Details: https://kernelci.org/test/job/cip/branch/linux-4.4.y-cip/kernel/v4.4.302-cip71-1-g61333eee4869/plan/ltp-pty/

Test: ltp-pty
Tree: cip
Branch: linux-4.4.y-cip
Describe: v4.4.302-cip71-1-g61333eee4869
URL: https://git.kernel.org/pub/scm/linux/kernel/git/cip/linux-cip.git
SHA: 61333eee4869050c46b5f75ae6d337998d39f2a0

Test suite revisions:
ltp-tests
URL: https://github.com/linux-test-project/ltp.git
SHA: 498247917f40b0a82cb149e2ec1cb518acd7b632


Test Regressions
----------------


platform | arch | lab | compiler | defconfig | regressions
-------------------------+--------+---------------+----------+------------------------------+------------
asus-C523NA-A20057-coral | x86_64 | lab-collabora | gcc-10 | x86_64_defcon...6-chromebook | 1

Details: https://kernelci.org/test/plan/id/638916228b92a69cc12abd00

Results: 0 PASS, 1 FAIL, 0 SKIP
Full config: x86_64_defconfig+x86-chromebook
Compiler: gcc-10 (gcc (Debian 10.2.1-6) 10.2.1 20210110)
Plain log: https://storage.kernelci.org//cip/linux-4.4.y-cip/v4.4.302-cip71-1-g61333eee4869/x86_64/x86_64_defconfig+x86-chromebook/gcc-10/lab-collabora/ltp-pty-asus-C523NA-A20057-coral.txt
HTML log: https://storage.kernelci.org//cip/linux-4.4.y-cip/v4.4.302-cip71-1-g61333eee4869/x86_64/x86_64_defconfig+x86-chromebook/gcc-10/lab-collabora/ltp-pty-asus-C523NA-A20057-coral.html
Rootfs: http://storage.kernelci.org/images/rootfs/debian/bullseye-ltp/20221125.0/amd64/initrd.cpio.gz


* ltp-pty.login: https://kernelci.org/test/case/id/638916228b92a69cc12abd01
failing since 140 days (last pass: v4.4.302-cip69-296-g52de9431d314, first fail: v4.4.302-cip69-508-gd887d54a1be6)


cip/linux-4.4.y-cip ltp-ipc: 6 runs, 1 regressions (v4.4.302-cip71-1-g61333eee4869) #kernelci

kernelci.org bot <bot@...>
 

cip/linux-4.4.y-cip ltp-ipc: 6 runs, 1 regressions (v4.4.302-cip71-1-g61333eee4869)

Regressions Summary
-------------------

platform | arch | lab | compiler | defconfig | regressions
-------------------------+--------+---------------+----------+------------------------------+------------
asus-C523NA-A20057-coral | x86_64 | lab-collabora | gcc-10 | x86_64_defcon...6-chromebook | 1

Details: https://kernelci.org/test/job/cip/branch/linux-4.4.y-cip/kernel/v4.4.302-cip71-1-g61333eee4869/plan/ltp-ipc/

Test: ltp-ipc
Tree: cip
Branch: linux-4.4.y-cip
Describe: v4.4.302-cip71-1-g61333eee4869
URL: https://git.kernel.org/pub/scm/linux/kernel/git/cip/linux-cip.git
SHA: 61333eee4869050c46b5f75ae6d337998d39f2a0

Test suite revisions:
ltp-tests
URL: https://github.com/linux-test-project/ltp.git
SHA: 498247917f40b0a82cb149e2ec1cb518acd7b632


Test Regressions
----------------


platform | arch | lab | compiler | defconfig | regressions
-------------------------+--------+---------------+----------+------------------------------+------------
asus-C523NA-A20057-coral | x86_64 | lab-collabora | gcc-10 | x86_64_defcon...6-chromebook | 1

Details: https://kernelci.org/test/plan/id/6389178add3c0990182abd47

Results: 0 PASS, 1 FAIL, 0 SKIP
Full config: x86_64_defconfig+x86-chromebook
Compiler: gcc-10 (gcc (Debian 10.2.1-6) 10.2.1 20210110)
Plain log: https://storage.kernelci.org//cip/linux-4.4.y-cip/v4.4.302-cip71-1-g61333eee4869/x86_64/x86_64_defconfig+x86-chromebook/gcc-10/lab-collabora/ltp-ipc-asus-C523NA-A20057-coral.txt
HTML log: https://storage.kernelci.org//cip/linux-4.4.y-cip/v4.4.302-cip71-1-g61333eee4869/x86_64/x86_64_defconfig+x86-chromebook/gcc-10/lab-collabora/ltp-ipc-asus-C523NA-A20057-coral.html
Rootfs: http://storage.kernelci.org/images/rootfs/debian/bullseye-ltp/20221125.0/amd64/initrd.cpio.gz


* ltp-ipc.login: https://kernelci.org/test/case/id/6389178add3c0990182abd48
failing since 6 days (last pass: v4.4.302-cip70-98-g7f7838c92740, first fail: v4.4.302-cip70-236-g69445bc0d420)


cip/linux-4.4.y-cip ltp-fcntl-locktests: 2 runs, 1 regressions (v4.4.302-cip71-1-g61333eee4869) #kernelci

kernelci.org bot <bot@...>
 

cip/linux-4.4.y-cip ltp-fcntl-locktests: 2 runs, 1 regressions (v4.4.302-cip71-1-g61333eee4869)

Regressions Summary
-------------------

platform | arch | lab | compiler | defconfig | regressions
-------------------------+--------+---------------+----------+------------------------------+------------
asus-C523NA-A20057-coral | x86_64 | lab-collabora | gcc-10 | x86_64_defcon...6-chromebook | 1

Details: https://kernelci.org/test/job/cip/branch/linux-4.4.y-cip/kernel/v4.4.302-cip71-1-g61333eee4869/plan/ltp-fcntl-locktests/

Test: ltp-fcntl-locktests
Tree: cip
Branch: linux-4.4.y-cip
Describe: v4.4.302-cip71-1-g61333eee4869
URL: https://git.kernel.org/pub/scm/linux/kernel/git/cip/linux-cip.git
SHA: 61333eee4869050c46b5f75ae6d337998d39f2a0

Test suite revisions:
ltp-tests
URL: https://github.com/linux-test-project/ltp.git
SHA: 498247917f40b0a82cb149e2ec1cb518acd7b632


Test Regressions
----------------


platform | arch | lab | compiler | defconfig | regressions
-------------------------+--------+---------------+----------+------------------------------+------------
asus-C523NA-A20057-coral | x86_64 | lab-collabora | gcc-10 | x86_64_defcon...6-chromebook | 1

Details: https://kernelci.org/test/plan/id/6389172604058a08972abcfb

Results: 0 PASS, 1 FAIL, 0 SKIP
Full config: x86_64_defconfig+x86-chromebook
Compiler: gcc-10 (gcc (Debian 10.2.1-6) 10.2.1 20210110)
Plain log: https://storage.kernelci.org//cip/linux-4.4.y-cip/v4.4.302-cip71-1-g61333eee4869/x86_64/x86_64_defconfig+x86-chromebook/gcc-10/lab-collabora/ltp-fcntl-locktests-asus-C523NA-A20057-coral.txt
HTML log: https://storage.kernelci.org//cip/linux-4.4.y-cip/v4.4.302-cip71-1-g61333eee4869/x86_64/x86_64_defconfig+x86-chromebook/gcc-10/lab-collabora/ltp-fcntl-locktests-asus-C523NA-A20057-coral.html
Rootfs: http://storage.kernelci.org/images/rootfs/debian/bullseye-ltp/20221125.0/amd64/initrd.cpio.gz


* ltp-fcntl-locktests.login: https://kernelci.org/test/case/id/6389172604058a08972abcfc
failing since 9 days (last pass: v4.4.302-cip70-98-g7f7838c92740f, first fail: v4.4.302-cip70-236-g69445bc0d4209)


cip/linux-4.4.y-cip baseline-nfs: 20 runs, 2 regressions (v4.4.302-cip71-1-g61333eee4869) #kernelci

kernelci.org bot <bot@...>
 

cip/linux-4.4.y-cip baseline-nfs: 20 runs, 2 regressions (v4.4.302-cip71-1-g61333eee4869)

Regressions Summary
-------------------

platform | arch | lab | compiler | defconfig | regressions
--------------------------+--------+---------------+----------+------------------------------+------------
hp-x360-14-G1-sona | x86_64 | lab-collabora | gcc-10 | x86_64_defcon...6-chromebook | 1
lenovo-TPad-C13-Yoga-zork | x86_64 | lab-collabora | gcc-10 | x86_64_defcon...6-chromebook | 1

Details: https://kernelci.org/test/job/cip/branch/linux-4.4.y-cip/kernel/v4.4.302-cip71-1-g61333eee4869/plan/baseline-nfs/

Test: baseline-nfs
Tree: cip
Branch: linux-4.4.y-cip
Describe: v4.4.302-cip71-1-g61333eee4869
URL: https://git.kernel.org/pub/scm/linux/kernel/git/cip/linux-cip.git
SHA: 61333eee4869050c46b5f75ae6d337998d39f2a0


Test Regressions
----------------


platform | arch | lab | compiler | defconfig | regressions
--------------------------+--------+---------------+----------+------------------------------+------------
hp-x360-14-G1-sona | x86_64 | lab-collabora | gcc-10 | x86_64_defcon...6-chromebook | 1

Details: https://kernelci.org/test/plan/id/638916abc9976575bd2abd24

Results: 0 PASS, 1 FAIL, 0 SKIP
Full config: x86_64_defconfig+x86-chromebook
Compiler: gcc-10 (gcc (Debian 10.2.1-6) 10.2.1 20210110)
Plain log: https://storage.kernelci.org//cip/linux-4.4.y-cip/v4.4.302-cip71-1-g61333eee4869/x86_64/x86_64_defconfig+x86-chromebook/gcc-10/lab-collabora/baseline-nfs-hp-x360-14-G1-sona.txt
HTML log: https://storage.kernelci.org//cip/linux-4.4.y-cip/v4.4.302-cip71-1-g61333eee4869/x86_64/x86_64_defconfig+x86-chromebook/gcc-10/lab-collabora/baseline-nfs-hp-x360-14-G1-sona.html
Rootfs: http://storage.kernelci.org/images/rootfs/debian/bullseye/20221125.0/amd64/initrd.cpio.gz


* baseline-nfs.login: https://kernelci.org/test/case/id/638916abc9976575bd2abd25
failing since 2 days (last pass: v4.4.302-cip70-236-g69445bc0d420, first fail: v4.4.302-cip71)



platform | arch | lab | compiler | defconfig | regressions
--------------------------+--------+---------------+----------+------------------------------+------------
lenovo-TPad-C13-Yoga-zork | x86_64 | lab-collabora | gcc-10 | x86_64_defcon...6-chromebook | 1

Details: https://kernelci.org/test/plan/id/63891bf2b7928025402abd18

Results: 0 PASS, 1 FAIL, 0 SKIP
Full config: x86_64_defconfig+x86-chromebook
Compiler: gcc-10 (gcc (Debian 10.2.1-6) 10.2.1 20210110)
Plain log: https://storage.kernelci.org//cip/linux-4.4.y-cip/v4.4.302-cip71-1-g61333eee4869/x86_64/x86_64_defconfig+x86-chromebook/gcc-10/lab-collabora/baseline-nfs-lenovo-TPad-C13-Yoga-zork.txt
HTML log: https://storage.kernelci.org//cip/linux-4.4.y-cip/v4.4.302-cip71-1-g61333eee4869/x86_64/x86_64_defconfig+x86-chromebook/gcc-10/lab-collabora/baseline-nfs-lenovo-TPad-C13-Yoga-zork.html
Rootfs: http://storage.kernelci.org/images/rootfs/debian/bullseye/20221125.0/amd64/initrd.cpio.gz


* baseline-nfs.login: https://kernelci.org/test/case/id/63891bf2b7928025402abd19
new failure (last pass: v4.4.302-cip71)


cip/linux-4.4.y-cip build: 180 builds: 0 failed, 180 passed, 41 warnings (v4.4.302-cip71-1-g61333eee4869) #kernelci

kernelci.org bot <bot@...>
 

cip/linux-4.4.y-cip build: 180 builds: 0 failed, 180 passed, 41 warnings (v4.4.302-cip71-1-g61333eee4869)

Full Build Summary: https://kernelci.org/build/cip/branch/linux-4.4.y-cip/kernel/v4.4.302-cip71-1-g61333eee4869/

Tree: cip
Branch: linux-4.4.y-cip
Git Describe: v4.4.302-cip71-1-g61333eee4869
Git Commit: 61333eee4869050c46b5f75ae6d337998d39f2a0
Git URL: https://git.kernel.org/pub/scm/linux/kernel/git/cip/linux-cip.git
Built: 5 unique architectures

Warnings Detected:

arc:

arm:
clps711x_defconfig (gcc-10): 1 warning
davinci_all_defconfig (gcc-10): 1 warning
lpc32xx_defconfig (gcc-10): 1 warning
mini2440_defconfig (gcc-10): 1 warning
mxs_defconfig (gcc-10): 1 warning
omap1_defconfig (gcc-10): 1 warning
omap2plus_defconfig (gcc-10): 1 warning
s3c2410_defconfig (gcc-10): 1 warning
s3c6400_defconfig (gcc-10): 2 warnings

i386:
i386_defconfig (gcc-10): 4 warnings

mips:
ip22_defconfig (gcc-10): 1 warning
mtx1_defconfig (gcc-10): 3 warnings

x86_64:
allnoconfig (gcc-10): 4 warnings
tinyconfig (gcc-10): 3 warnings
x86_64_defconfig (gcc-10): 8 warnings
x86_64_defconfig+x86-chromebook (gcc-10): 8 warnings


Warnings summary:

7 arch/x86/kernel/process.c:456: Warning: no instruction mnemonic suffix given and no register operands; using default for `btr'
4 arch/x86/entry/entry_64.S:487: Warning: no instruction mnemonic suffix given and no register operands; using default for `btr'
4 arch/x86/entry/entry_64.S:1642: Warning: no instruction mnemonic suffix given and no register operands; using default for `sysret'
3 ld: warning: creating DT_TEXTREL in a PIE
3 drivers/tty/serial/samsung.c:1776:34: warning: array ‘s3c24xx_uart_dt_match’ assumed to have one element
3 WARNING: vmlinux.o (.discard.retpoline_safe): unexpected non-allocatable section.
3 WARNING: vmlinux.o (.discard.nospec): unexpected non-allocatable section.
2 sound/pci/echoaudio/echoaudio_dsp.c:647:9: warning: iteration 1073741824 invokes undefined behavior [-Waggressive-loop-optimizations]
2 ld: arch/x86/boot/compressed/head_64.o: warning: relocation in read-only section `.head.text'
1 sound/pci/echoaudio/echoaudio_dsp.c:658:9: warning: iteration 1073741824 invokes undefined behavior [-Waggressive-loop-optimizations]
1 ld: arch/x86/boot/compressed/head_32.o: warning: relocation in read-only section `.head.text'
1 drivers/net/ethernet/seeq/sgiseeq.c:804:26: warning: passing argument 5 of ‘dma_free_attrs’ makes pointer from integer without a cast [-Wint-conversion]
1 drivers/mmc/host/sdhci-s3c.c:429:34: warning: array ‘sdhci_s3c_dt_match’ assumed to have one element
1 drivers/gpio/gpio-omap.c:1161:34: warning: array ‘omap_gpio_match’ assumed to have one element
1 drivers/cpufreq/ti-cpufreq.c:250:24: warning: passing argument 1 of ‘PTR_ERR_OR_ZERO’ makes pointer from integer without a cast [-Wint-conversion]
1 arch/arm/mach-mxs/mach-mxs.c:285:26: warning: duplicate ‘const’ declaration specifier [-Wduplicate-decl-specifier]
1 arch/arm/mach-lpc32xx/phy3250.c:215:36: warning: duplicate ‘const’ declaration specifier [-Wduplicate-decl-specifier]
1 arch/arm/mach-davinci/da8xx-dt.c:23:34: warning: duplicate ‘const’ declaration specifier [-Wduplicate-decl-specifier]
1 arch/arm/mach-clps711x/board-autcpu12.c:163:26: warning: duplicate ‘const’ declaration specifier [-Wduplicate-decl-specifier]

================================================================================

Detailed per-defconfig build reports:

--------------------------------------------------------------------------------
acs5k_defconfig (arm, gcc-10) — PASS, 0 errors, 0 warnings, 0 section mismatches

--------------------------------------------------------------------------------
acs5k_tiny_defconfig (arm, gcc-10) — PASS, 0 errors, 0 warnings, 0 section mismatches

--------------------------------------------------------------------------------
allnoconfig (arm, gcc-10) — PASS, 0 errors, 0 warnings, 0 section mismatches

--------------------------------------------------------------------------------
allnoconfig (x86_64, gcc-10) — PASS, 0 errors, 4 warnings, 0 section mismatches

Warnings:
arch/x86/entry/entry_64.S:487: Warning: no instruction mnemonic suffix given and no register operands; using default for `btr'
arch/x86/entry/entry_64.S:1642: Warning: no instruction mnemonic suffix given and no register operands; using default for `sysret'
arch/x86/kernel/process.c:456: Warning: no instruction mnemonic suffix given and no register operands; using default for `btr'
arch/x86/kernel/process.c:456: Warning: no instruction mnemonic suffix given and no register operands; using default for `btr'

--------------------------------------------------------------------------------
allnoconfig (i386, gcc-10) — PASS, 0 errors, 0 warnings, 0 section mismatches

--------------------------------------------------------------------------------
allnoconfig (arc, gcc-10) — PASS, 0 errors, 0 warnings, 0 section mismatches

--------------------------------------------------------------------------------
allnoconfig (mips, gcc-10) — PASS, 0 errors, 0 warnings, 0 section mismatches

--------------------------------------------------------------------------------
am200epdkit_defconfig (arm, gcc-10) — PASS, 0 errors, 0 warnings, 0 section mismatches

--------------------------------------------------------------------------------
ar7_defconfig (mips, gcc-10) — PASS, 0 errors, 0 warnings, 0 section mismatches

--------------------------------------------------------------------------------
assabet_defconfig (arm, gcc-10) — PASS, 0 errors, 0 warnings, 0 section mismatches

--------------------------------------------------------------------------------
at91_dt_defconfig (arm, gcc-10) — PASS, 0 errors, 0 warnings, 0 section mismatches

--------------------------------------------------------------------------------
ath79_defconfig (mips, gcc-10) — PASS, 0 errors, 0 warnings, 0 section mismatches

--------------------------------------------------------------------------------
axm55xx_defconfig (arm, gcc-10) — PASS, 0 errors, 0 warnings, 0 section mismatches

--------------------------------------------------------------------------------
axs103_defconfig (arc, gcc-10) — PASS, 0 errors, 0 warnings, 0 section mismatches

--------------------------------------------------------------------------------
axs103_smp_defconfig (arc, gcc-10) — PASS, 0 errors, 0 warnings, 0 section mismatches

--------------------------------------------------------------------------------
badge4_defconfig (arm, gcc-10) — PASS, 0 errors, 0 warnings, 0 section mismatches

--------------------------------------------------------------------------------
bcm2835_defconfig (arm, gcc-10) — PASS, 0 errors, 0 warnings, 0 section mismatches

--------------------------------------------------------------------------------
bcm47xx_defconfig (mips, gcc-10) — PASS, 0 errors, 0 warnings, 0 section mismatches

--------------------------------------------------------------------------------
bcm63xx_defconfig (mips, gcc-10) — PASS, 0 errors, 0 warnings, 0 section mismatches

--------------------------------------------------------------------------------
bcm_defconfig (arm, gcc-10) — PASS, 0 errors, 0 warnings, 0 section mismatches

--------------------------------------------------------------------------------
bigsur_defconfig (mips, gcc-10) — PASS, 0 errors, 0 warnings, 0 section mismatches

--------------------------------------------------------------------------------
bmips_be_defconfig (mips, gcc-10) — PASS, 0 errors, 0 warnings, 0 section mismatches

--------------------------------------------------------------------------------
bmips_stb_defconfig (mips, gcc-10) — PASS, 0 errors, 0 warnings, 0 section mismatches

--------------------------------------------------------------------------------
capcella_defconfig (mips, gcc-10) — PASS, 0 errors, 0 warnings, 0 section mismatches

--------------------------------------------------------------------------------
cavium_octeon_defconfig (mips, gcc-10) — PASS, 0 errors, 0 warnings, 0 section mismatches

--------------------------------------------------------------------------------
cerfcube_defconfig (arm, gcc-10) — PASS, 0 errors, 0 warnings, 0 section mismatches

--------------------------------------------------------------------------------
ci20_defconfig (mips, gcc-10) — PASS, 0 errors, 0 warnings, 0 section mismatches

--------------------------------------------------------------------------------
clps711x_defconfig (arm, gcc-10) — PASS, 0 errors, 1 warning, 0 section mismatches

Warnings:
arch/arm/mach-clps711x/board-autcpu12.c:163:26: warning: duplicate ‘const’ declaration specifier [-Wduplicate-decl-specifier]

--------------------------------------------------------------------------------
cm_x2xx_defconfig (arm, gcc-10) — PASS, 0 errors, 0 warnings, 0 section mismatches

--------------------------------------------------------------------------------
cm_x300_defconfig (arm, gcc-10) — PASS, 0 errors, 0 warnings, 0 section mismatches

--------------------------------------------------------------------------------
cobalt_defconfig (mips, gcc-10) — PASS, 0 errors, 0 warnings, 0 section mismatches

--------------------------------------------------------------------------------
colibri_pxa270_defconfig (arm, gcc-10) — PASS, 0 errors, 0 warnings, 0 section mismatches

--------------------------------------------------------------------------------
colibri_pxa300_defconfig (arm, gcc-10) — PASS, 0 errors, 0 warnings, 0 section mismatches

--------------------------------------------------------------------------------
collie_defconfig (arm, gcc-10) — PASS, 0 errors, 0 warnings, 0 section mismatches

--------------------------------------------------------------------------------
corgi_defconfig (arm, gcc-10) — PASS, 0 errors, 0 warnings, 0 section mismatches

--------------------------------------------------------------------------------
davinci_all_defconfig (arm, gcc-10) — PASS, 0 errors, 1 warning, 0 section mismatches

Warnings:
arch/arm/mach-davinci/da8xx-dt.c:23:34: warning: duplicate ‘const’ declaration specifier [-Wduplicate-decl-specifier]

--------------------------------------------------------------------------------
db1xxx_defconfig (mips, gcc-10) — PASS, 0 errors, 0 warnings, 0 section mismatches

--------------------------------------------------------------------------------
decstation_defconfig (mips, gcc-10) — PASS, 0 errors, 0 warnings, 0 section mismatches

--------------------------------------------------------------------------------
dove_defconfig (arm, gcc-10) — PASS, 0 errors, 0 warnings, 0 section mismatches

--------------------------------------------------------------------------------
e55_defconfig (mips, gcc-10) — PASS, 0 errors, 0 warnings, 0 section mismatches

--------------------------------------------------------------------------------
ebsa110_defconfig (arm, gcc-10) — PASS, 0 errors, 0 warnings, 0 section mismatches

--------------------------------------------------------------------------------
efm32_defconfig (arm, gcc-10) — PASS, 0 errors, 0 warnings, 0 section mismatches

--------------------------------------------------------------------------------
em_x270_defconfig (arm, gcc-10) — PASS, 0 errors, 0 warnings, 0 section mismatches

--------------------------------------------------------------------------------
ep93xx_defconfig (arm, gcc-10) — PASS, 0 errors, 0 warnings, 0 section mismatches

--------------------------------------------------------------------------------
eseries_pxa_defconfig (arm, gcc-10) — PASS, 0 errors, 0 warnings, 0 section mismatches

--------------------------------------------------------------------------------
exynos_defconfig (arm, gcc-10) — PASS, 0 errors, 0 warnings, 0 section mismatches

--------------------------------------------------------------------------------
ezx_defconfig (arm, gcc-10) — PASS, 0 errors, 0 warnings, 0 section mismatches

--------------------------------------------------------------------------------
footbridge_defconfig (arm, gcc-10) — PASS, 0 errors, 0 warnings, 0 section mismatches

--------------------------------------------------------------------------------
gpr_defconfig (mips, gcc-10) — PASS, 0 errors, 0 warnings, 0 section mismatches

--------------------------------------------------------------------------------
h3600_defconfig (arm, gcc-10) — PASS, 0 errors, 0 warnings, 0 section mismatches

--------------------------------------------------------------------------------
h5000_defconfig (arm, gcc-10) — PASS, 0 errors, 0 warnings, 0 section mismatches

--------------------------------------------------------------------------------
hackkit_defconfig (arm, gcc-10) — PASS, 0 errors, 0 warnings, 0 section mismatches

--------------------------------------------------------------------------------
hisi_defconfig (arm, gcc-10) — PASS, 0 errors, 0 warnings, 0 section mismatches

--------------------------------------------------------------------------------
i386_defconfig (i386, gcc-10) — PASS, 0 errors, 4 warnings, 0 section mismatches

Warnings:
WARNING: vmlinux.o (.discard.nospec): unexpected non-allocatable section.
WARNING: vmlinux.o (.discard.retpoline_safe): unexpected non-allocatable section.
ld: arch/x86/boot/compressed/head_32.o: warning: relocation in read-only section `.head.text'
ld: warning: creating DT_TEXTREL in a PIE

--------------------------------------------------------------------------------
imote2_defconfig (arm, gcc-10) — PASS, 0 errors, 0 warnings, 0 section mismatches

--------------------------------------------------------------------------------
imx_v4_v5_defconfig (arm, gcc-10) — PASS, 0 errors, 0 warnings, 0 section mismatches

--------------------------------------------------------------------------------
imx_v6_v7_defconfig (arm, gcc-10) — PASS, 0 errors, 0 warnings, 0 section mismatches

--------------------------------------------------------------------------------
integrator_defconfig (arm, gcc-10) — PASS, 0 errors, 0 warnings, 0 section mismatches

--------------------------------------------------------------------------------
iop13xx_defconfig (arm, gcc-10) — PASS, 0 errors, 0 warnings, 0 section mismatches

--------------------------------------------------------------------------------
iop32x_defconfig (arm, gcc-10) — PASS, 0 errors, 0 warnings, 0 section mismatches

--------------------------------------------------------------------------------
iop33x_defconfig (arm, gcc-10) — PASS, 0 errors, 0 warnings, 0 section mismatches

--------------------------------------------------------------------------------
ip22_defconfig (mips, gcc-10) — PASS, 0 errors, 1 warning, 0 section mismatches

Warnings:
drivers/net/ethernet/seeq/sgiseeq.c:804:26: warning: passing argument 5 of ‘dma_free_attrs’ makes pointer from integer without a cast [-Wint-conversion]

--------------------------------------------------------------------------------
ip32_defconfig (mips, gcc-10) — PASS, 0 errors, 0 warnings, 0 section mismatches

--------------------------------------------------------------------------------
ixp4xx_defconfig (arm, gcc-10) — PASS, 0 errors, 0 warnings, 0 section mismatches

--------------------------------------------------------------------------------
jazz_defconfig (mips, gcc-10) — PASS, 0 errors, 0 warnings, 0 section mismatches

--------------------------------------------------------------------------------
jmr3927_defconfig (mips, gcc-10) — PASS, 0 errors, 0 warnings, 0 section mismatches

--------------------------------------------------------------------------------
jornada720_defconfig (arm, gcc-10) — PASS, 0 errors, 0 warnings, 0 section mismatches

--------------------------------------------------------------------------------
keystone_defconfig (arm, gcc-10) — PASS, 0 errors, 0 warnings, 0 section mismatches

--------------------------------------------------------------------------------
ks8695_defconfig (arm, gcc-10) — PASS, 0 errors, 0 warnings, 0 section mismatches

--------------------------------------------------------------------------------
lart_defconfig (arm, gcc-10) — PASS, 0 errors, 0 warnings, 0 section mismatches

--------------------------------------------------------------------------------
lasat_defconfig (mips, gcc-10) — PASS, 0 errors, 0 warnings, 0 section mismatches

--------------------------------------------------------------------------------
loongson3_defconfig (mips, gcc-10) — PASS, 0 errors, 0 warnings, 0 section mismatches

--------------------------------------------------------------------------------
lpc18xx_defconfig (arm, gcc-10) — PASS, 0 errors, 0 warnings, 0 section mismatches

--------------------------------------------------------------------------------
lpc32xx_defconfig (arm, gcc-10) — PASS, 0 errors, 1 warning, 0 section mismatches

Warnings:
arch/arm/mach-lpc32xx/phy3250.c:215:36: warning: duplicate ‘const’ declaration specifier [-Wduplicate-decl-specifier]

--------------------------------------------------------------------------------
lpd270_defconfig (arm, gcc-10) — PASS, 0 errors, 0 warnings, 0 section mismatches

--------------------------------------------------------------------------------
ls1b_defconfig (mips, gcc-10) — PASS, 0 errors, 0 warnings, 0 section mismatches

--------------------------------------------------------------------------------
lubbock_defconfig (arm, gcc-10) — PASS, 0 errors, 0 warnings, 0 section mismatches

--------------------------------------------------------------------------------
magician_defconfig (arm, gcc-10) — PASS, 0 errors, 0 warnings, 0 section mismatches

--------------------------------------------------------------------------------
mainstone_defconfig (arm, gcc-10) — PASS, 0 errors, 0 warnings, 0 section mismatches

--------------------------------------------------------------------------------
malta_defconfig (mips, gcc-10) — PASS, 0 errors, 0 warnings, 0 section mismatches

--------------------------------------------------------------------------------
malta_kvm_defconfig (mips, gcc-10) — PASS, 0 errors, 0 warnings, 0 section mismatches

--------------------------------------------------------------------------------
malta_kvm_guest_defconfig (mips, gcc-10) — PASS, 0 errors, 0 warnings, 0 section mismatches

--------------------------------------------------------------------------------
malta_qemu_32r6_defconfig (mips, gcc-10) — PASS, 0 errors, 0 warnings, 0 section mismatches

--------------------------------------------------------------------------------
maltaaprp_defconfig (mips, gcc-10) — PASS, 0 errors, 0 warnings, 0 section mismatches

--------------------------------------------------------------------------------
maltasmvp_defconfig (mips, gcc-10) — PASS, 0 errors, 0 warnings, 0 section mismatches

--------------------------------------------------------------------------------
maltasmvp_eva_defconfig (mips, gcc-10) — PASS, 0 errors, 0 warnings, 0 section mismatches

--------------------------------------------------------------------------------
maltaup_defconfig (mips, gcc-10) — PASS, 0 errors, 0 warnings, 0 section mismatches

--------------------------------------------------------------------------------
maltaup_xpa_defconfig (mips, gcc-10) — PASS, 0 errors, 0 warnings, 0 section mismatches

--------------------------------------------------------------------------------
markeins_defconfig (mips, gcc-10) — PASS, 0 errors, 0 warnings, 0 section mismatches

--------------------------------------------------------------------------------
mini2440_defconfig (arm, gcc-10) — PASS, 0 errors, 1 warning, 0 section mismatches

Warnings:
drivers/tty/serial/samsung.c:1776:34: warning: array ‘s3c24xx_uart_dt_match’ assumed to have one element

--------------------------------------------------------------------------------
mips_paravirt_defconfig (mips, gcc-10) — PASS, 0 errors, 0 warnings, 0 section mismatches

--------------------------------------------------------------------------------
mmp2_defconfig (arm, gcc-10) — PASS, 0 errors, 0 warnings, 0 section mismatches

--------------------------------------------------------------------------------
mpc30x_defconfig (mips, gcc-10) — PASS, 0 errors, 0 warnings, 0 section mismatches

--------------------------------------------------------------------------------
msp71xx_defconfig (mips, gcc-10) — PASS, 0 errors, 0 warnings, 0 section mismatches

--------------------------------------------------------------------------------
mtx1_defconfig (mips, gcc-10) — PASS, 0 errors, 3 warnings, 0 section mismatches

Warnings:
sound/pci/echoaudio/echoaudio_dsp.c:647:9: warning: iteration 1073741824 invokes undefined behavior [-Waggressive-loop-optimizations]
sound/pci/echoaudio/echoaudio_dsp.c:658:9: warning: iteration 1073741824 invokes undefined behavior [-Waggressive-loop-optimizations]
sound/pci/echoaudio/echoaudio_dsp.c:647:9: warning: iteration 1073741824 invokes undefined behavior [-Waggressive-loop-optimizations]

--------------------------------------------------------------------------------
multi_v5_defconfig (arm, gcc-10) — PASS, 0 errors, 0 warnings, 0 section mismatches

--------------------------------------------------------------------------------
multi_v7_defconfig (arm, gcc-10) — PASS, 0 errors, 0 warnings, 0 section mismatches

--------------------------------------------------------------------------------
mv78xx0_defconfig (arm, gcc-10) — PASS, 0 errors, 0 warnings, 0 section mismatches

--------------------------------------------------------------------------------
mvebu_v5_defconfig (arm, gcc-10) — PASS, 0 errors, 0 warnings, 0 section mismatches

--------------------------------------------------------------------------------
mvebu_v7_defconfig (arm, gcc-10) — PASS, 0 errors, 0 warnings, 0 section mismatches

--------------------------------------------------------------------------------
mxs_defconfig (arm, gcc-10) — PASS, 0 errors, 1 warning, 0 section mismatches

Warnings:
arch/arm/mach-mxs/mach-mxs.c:285:26: warning: duplicate ‘const’ declaration specifier [-Wduplicate-decl-specifier]

--------------------------------------------------------------------------------
neponset_defconfig (arm, gcc-10) — PASS, 0 errors, 0 warnings, 0 section mismatches

--------------------------------------------------------------------------------
netwinder_defconfig (arm, gcc-10) — PASS, 0 errors, 0 warnings, 0 section mismatches

--------------------------------------------------------------------------------
netx_defconfig (arm, gcc-10) — PASS, 0 errors, 0 warnings, 0 section mismatches

--------------------------------------------------------------------------------
nhk8815_defconfig (arm, gcc-10) — PASS, 0 errors, 0 warnings, 0 section mismatches

--------------------------------------------------------------------------------
nlm_xlp_defconfig (mips, gcc-10) — PASS, 0 errors, 0 warnings, 0 section mismatches

--------------------------------------------------------------------------------
nlm_xlr_defconfig (mips, gcc-10) — PASS, 0 errors, 0 warnings, 0 section mismatches

--------------------------------------------------------------------------------
nsim_hs_defconfig (arc, gcc-10) — PASS, 0 errors, 0 warnings, 0 section mismatches

--------------------------------------------------------------------------------
nsim_hs_smp_defconfig (arc, gcc-10) — PASS, 0 errors, 0 warnings, 0 section mismatches

--------------------------------------------------------------------------------
nsimosci_hs_defconfig (arc, gcc-10) — PASS, 0 errors, 0 warnings, 0 section mismatches

--------------------------------------------------------------------------------
nsimosci_hs_smp_defconfig (arc, gcc-10) — PASS, 0 errors, 0 warnings, 0 section mismatches

--------------------------------------------------------------------------------
nuc910_defconfig (arm, gcc-10) — PASS, 0 errors, 0 warnings, 0 section mismatches

--------------------------------------------------------------------------------
nuc950_defconfig (arm, gcc-10) — PASS, 0 errors, 0 warnings, 0 section mismatches

--------------------------------------------------------------------------------
nuc960_defconfig (arm, gcc-10) — PASS, 0 errors, 0 warnings, 0 section mismatches

--------------------------------------------------------------------------------
omap1_defconfig (arm, gcc-10) — PASS, 0 errors, 1 warning, 0 section mismatches

Warnings:
drivers/gpio/gpio-omap.c:1161:34: warning: array ‘omap_gpio_match’ assumed to have one element

--------------------------------------------------------------------------------
omap2plus_defconfig (arm, gcc-10) — PASS, 0 errors, 1 warning, 0 section mismatches

Warnings:
drivers/cpufreq/ti-cpufreq.c:250:24: warning: passing argument 1 of ‘PTR_ERR_OR_ZERO’ makes pointer from integer without a cast [-Wint-conversion]

--------------------------------------------------------------------------------
orion5x_defconfig (arm, gcc-10) — PASS, 0 errors, 0 warnings, 0 section mismatches

--------------------------------------------------------------------------------
palmz72_defconfig (arm, gcc-10) — PASS, 0 errors, 0 warnings, 0 section mismatches

--------------------------------------------------------------------------------
pcm027_defconfig (arm, gcc-10) — PASS, 0 errors, 0 warnings, 0 section mismatches

--------------------------------------------------------------------------------
pleb_defconfig (arm, gcc-10) — PASS, 0 errors, 0 warnings, 0 section mismatches

--------------------------------------------------------------------------------
pnx8335_stb225_defconfig (mips, gcc-10) — PASS, 0 errors, 0 warnings, 0 section mismatches

--------------------------------------------------------------------------------
prima2_defconfig (arm, gcc-10) — PASS, 0 errors, 0 warnings, 0 section mismatches

--------------------------------------------------------------------------------
pxa168_defconfig (arm, gcc-10) — PASS, 0 errors, 0 warnings, 0 section mismatches

--------------------------------------------------------------------------------
pxa255-idp_defconfig (arm, gcc-10) — PASS, 0 errors, 0 warnings, 0 section mismatches

--------------------------------------------------------------------------------
pxa3xx_defconfig (arm, gcc-10) — PASS, 0 errors, 0 warnings, 0 section mismatches

--------------------------------------------------------------------------------
pxa910_defconfig (arm, gcc-10) — PASS, 0 errors, 0 warnings, 0 section mismatches

--------------------------------------------------------------------------------
qcom_defconfig (arm, gcc-10) — PASS, 0 errors, 0 warnings, 0 section mismatches

--------------------------------------------------------------------------------
qi_lb60_defconfig (mips, gcc-10) — PASS, 0 errors, 0 warnings, 0 section mismatches

--------------------------------------------------------------------------------
raumfeld_defconfig (arm, gcc-10) — PASS, 0 errors, 0 warnings, 0 section mismatches

--------------------------------------------------------------------------------
rb532_defconfig (mips, gcc-10) — PASS, 0 errors, 0 warnings, 0 section mismatches

--------------------------------------------------------------------------------
rbtx49xx_defconfig (mips, gcc-10) — PASS, 0 errors, 0 warnings, 0 section mismatches

--------------------------------------------------------------------------------
realview-smp_defconfig (arm, gcc-10) — PASS, 0 errors, 0 warnings, 0 section mismatches

--------------------------------------------------------------------------------
realview_defconfig (arm, gcc-10) — PASS, 0 errors, 0 warnings, 0 section mismatches

--------------------------------------------------------------------------------
rm200_defconfig (mips, gcc-10) — PASS, 0 errors, 0 warnings, 0 section mismatches

--------------------------------------------------------------------------------
rt305x_defconfig (mips, gcc-10) — PASS, 0 errors, 0 warnings, 0 section mismatches

--------------------------------------------------------------------------------
s3c2410_defconfig (arm, gcc-10) — PASS, 0 errors, 1 warning, 0 section mismatches

Warnings:
drivers/tty/serial/samsung.c:1776:34: warning: array ‘s3c24xx_uart_dt_match’ assumed to have one element

--------------------------------------------------------------------------------
s3c6400_defconfig (arm, gcc-10) — PASS, 0 errors, 2 warnings, 0 section mismatches

Warnings:
drivers/mmc/host/sdhci-s3c.c:429:34: warning: array ‘sdhci_s3c_dt_match’ assumed to have one element
drivers/tty/serial/samsung.c:1776:34: warning: array ‘s3c24xx_uart_dt_match’ assumed to have one element

--------------------------------------------------------------------------------
s5pv210_defconfig (arm, gcc-10) — PASS, 0 errors, 0 warnings, 0 section mismatches

--------------------------------------------------------------------------------
sama5_defconfig (arm, gcc-10) — PASS, 0 errors, 0 warnings, 0 section mismatches

--------------------------------------------------------------------------------
sb1250_swarm_defconfig (mips, gcc-10) — PASS, 0 errors, 0 warnings, 0 section mismatches

--------------------------------------------------------------------------------
sead3_defconfig (mips, gcc-10) — PASS, 0 errors, 0 warnings, 0 section mismatches

--------------------------------------------------------------------------------
sead3micro_defconfig (mips, gcc-10) — PASS, 0 errors, 0 warnings, 0 section mismatches

--------------------------------------------------------------------------------
shannon_defconfig (arm, gcc-10) — PASS, 0 errors, 0 warnings, 0 section mismatches

--------------------------------------------------------------------------------
shmobile_defconfig (arm, gcc-10) — PASS, 0 errors, 0 warnings, 0 section mismatches

--------------------------------------------------------------------------------
simpad_defconfig (arm, gcc-10) — PASS, 0 errors, 0 warnings, 0 section mismatches

--------------------------------------------------------------------------------
socfpga_defconfig (arm, gcc-10) — PASS, 0 errors, 0 warnings, 0 section mismatches

--------------------------------------------------------------------------------
spear13xx_defconfig (arm, gcc-10) — PASS, 0 errors, 0 warnings, 0 section mismatches

--------------------------------------------------------------------------------
spear3xx_defconfig (arm, gcc-10) — PASS, 0 errors, 0 warnings, 0 section mismatches

--------------------------------------------------------------------------------
spear6xx_defconfig (arm, gcc-10) — PASS, 0 errors, 0 warnings, 0 section mismatches

--------------------------------------------------------------------------------
spitz_defconfig (arm, gcc-10) — PASS, 0 errors, 0 warnings, 0 section mismatches

--------------------------------------------------------------------------------
stm32_defconfig (arm, gcc-10) — PASS, 0 errors, 0 warnings, 0 section mismatches

--------------------------------------------------------------------------------
sunxi_defconfig (arm, gcc-10) — PASS, 0 errors, 0 warnings, 0 section mismatches

--------------------------------------------------------------------------------
tb0219_defconfig (mips, gcc-10) — PASS, 0 errors, 0 warnings, 0 section mismatches

--------------------------------------------------------------------------------
tb0226_defconfig (mips, gcc-10) — PASS, 0 errors, 0 warnings, 0 section mismatches

--------------------------------------------------------------------------------
tb0287_defconfig (mips, gcc-10) — PASS, 0 errors, 0 warnings, 0 section mismatches

--------------------------------------------------------------------------------
tct_hammer_defconfig (arm, gcc-10) — PASS, 0 errors, 0 warnings, 0 section mismatches

--------------------------------------------------------------------------------
tegra_defconfig (arm, gcc-10) — PASS, 0 errors, 0 warnings, 0 section mismatches

--------------------------------------------------------------------------------
tinyconfig (arc, gcc-10) — PASS, 0 errors, 0 warnings, 0 section mismatches

--------------------------------------------------------------------------------
tinyconfig (x86_64, gcc-10) — PASS, 0 errors, 3 warnings, 0 section mismatches

Warnings:
arch/x86/entry/entry_64.S:487: Warning: no instruction mnemonic suffix given and no register operands; using default for `btr'
arch/x86/entry/entry_64.S:1642: Warning: no instruction mnemonic suffix given and no register operands; using default for `sysret'
arch/x86/kernel/process.c:456: Warning: no instruction mnemonic suffix given and no register operands; using default for `btr'

--------------------------------------------------------------------------------
tinyconfig (arm, gcc-10) — PASS, 0 errors, 0 warnings, 0 section mismatches

--------------------------------------------------------------------------------
tinyconfig (i386, gcc-10) — PASS, 0 errors, 0 warnings, 0 section mismatches

--------------------------------------------------------------------------------
tinyconfig (mips, gcc-10) — PASS, 0 errors, 0 warnings, 0 section mismatches

--------------------------------------------------------------------------------
trizeps4_defconfig (arm, gcc-10) — PASS, 0 errors, 0 warnings, 0 section mismatches

--------------------------------------------------------------------------------
u300_defconfig (arm, gcc-10) — PASS, 0 errors, 0 warnings, 0 section mismatches

--------------------------------------------------------------------------------
u8500_defconfig (arm, gcc-10) — PASS, 0 errors, 0 warnings, 0 section mismatches

--------------------------------------------------------------------------------
vdk_hs38_defconfig (arc, gcc-10) — PASS, 0 errors, 0 warnings, 0 section mismatches

--------------------------------------------------------------------------------
vdk_hs38_smp_defconfig (arc, gcc-10) — PASS, 0 errors, 0 warnings, 0 section mismatches

--------------------------------------------------------------------------------
versatile_defconfig (arm, gcc-10) — PASS, 0 errors, 0 warnings, 0 section mismatches

--------------------------------------------------------------------------------
vexpress_defconfig (arm, gcc-10) — PASS, 0 errors, 0 warnings, 0 section mismatches

--------------------------------------------------------------------------------
vf610m4_defconfig (arm, gcc-10) — PASS, 0 errors, 0 warnings, 0 section mismatches

--------------------------------------------------------------------------------
viper_defconfig (arm, gcc-10) — PASS, 0 errors, 0 warnings, 0 section mismatches

--------------------------------------------------------------------------------
vt8500_v6_v7_defconfig (arm, gcc-10) — PASS, 0 errors, 0 warnings, 0 section mismatches

--------------------------------------------------------------------------------
workpad_defconfig (mips, gcc-10) — PASS, 0 errors, 0 warnings, 0 section mismatches

--------------------------------------------------------------------------------
x86_64_defconfig (x86_64, gcc-10) — PASS, 0 errors, 8 warnings, 0 section mismatches

Warnings:
arch/x86/entry/entry_64.S:487: Warning: no instruction mnemonic suffix given and no register operands; using default for `btr'
arch/x86/entry/entry_64.S:1642: Warning: no instruction mnemonic suffix given and no register operands; using default for `sysret'
arch/x86/kernel/process.c:456: Warning: no instruction mnemonic suffix given and no register operands; using default for `btr'
arch/x86/kernel/process.c:456: Warning: no instruction mnemonic suffix given and no register operands; using default for `btr'
WARNING: vmlinux.o (.discard.nospec): unexpected non-allocatable section.
WARNING: vmlinux.o (.discard.retpoline_safe): unexpected non-allocatable section.
ld: arch/x86/boot/compressed/head_64.o: warning: relocation in read-only section `.head.text'
ld: warning: creating DT_TEXTREL in a PIE

--------------------------------------------------------------------------------
x86_64_defconfig+x86-chromebook (x86_64, gcc-10) — PASS, 0 errors, 8 warnings, 0 section mismatches

Warnings:
arch/x86/entry/entry_64.S:487: Warning: no instruction mnemonic suffix given and no register operands; using default for `btr'
arch/x86/entry/entry_64.S:1642: Warning: no instruction mnemonic suffix given and no register operands; using default for `sysret'
arch/x86/kernel/process.c:456: Warning: no instruction mnemonic suffix given and no register operands; using default for `btr'
arch/x86/kernel/process.c:456: Warning: no instruction mnemonic suffix given and no register operands; using default for `btr'
WARNING: vmlinux.o (.discard.nospec): unexpected non-allocatable section.
WARNING: vmlinux.o (.discard.retpoline_safe): unexpected non-allocatable section.
ld: arch/x86/boot/compressed/head_64.o: warning: relocation in read-only section `.head.text'
ld: warning: creating DT_TEXTREL in a PIE

--------------------------------------------------------------------------------
xcep_defconfig (arm, gcc-10) — PASS, 0 errors, 0 warnings, 0 section mismatches

--------------------------------------------------------------------------------
xilfpga_defconfig (mips, gcc-10) — PASS, 0 errors, 0 warnings, 0 section mismatches

--------------------------------------------------------------------------------
xway_defconfig (mips, gcc-10) — PASS, 0 errors, 0 warnings, 0 section mismatches

--------------------------------------------------------------------------------
zeus_defconfig (arm, gcc-10) — PASS, 0 errors, 0 warnings, 0 section mismatches

--------------------------------------------------------------------------------
zx_defconfig (arm, gcc-10) — PASS, 0 errors, 0 warnings, 0 section mismatches

---
For more info write to <info@...>


cip/linux-4.4.y-cip-rt baseline: 117 runs, 6 regressions (v4.4.302-cip71-rt41) #kernelci

kernelci.org bot <bot@...>
 

cip/linux-4.4.y-cip-rt baseline: 117 runs, 6 regressions (v4.4.302-cip71-rt41)

Regressions Summary
-------------------

platform | arch | lab | compiler | defconfig | regressions
----------------------+-------+---------------+----------+-----------+------------
qemu_arm64-virt-gicv2 | arm64 | lab-baylibre | gcc-10 | defconfig | 1
qemu_arm64-virt-gicv2 | arm64 | lab-broonie | gcc-10 | defconfig | 1
qemu_arm64-virt-gicv2 | arm64 | lab-collabora | gcc-10 | defconfig | 1
qemu_arm64-virt-gicv3 | arm64 | lab-baylibre | gcc-10 | defconfig | 1
qemu_arm64-virt-gicv3 | arm64 | lab-broonie | gcc-10 | defconfig | 1
qemu_arm64-virt-gicv3 | arm64 | lab-collabora | gcc-10 | defconfig | 1

Details: https://kernelci.org/test/job/cip/branch/linux-4.4.y-cip-rt/kernel/v4.4.302-cip71-rt41/plan/baseline/

Test: baseline
Tree: cip
Branch: linux-4.4.y-cip-rt
Describe: v4.4.302-cip71-rt41
URL: https://git.kernel.org/pub/scm/linux/kernel/git/cip/linux-cip.git
SHA: 83cf69382b99a59619dd4cbe57c4038402270da9


Test Regressions
----------------


platform | arch | lab | compiler | defconfig | regressions
----------------------+-------+---------------+----------+-----------+------------
qemu_arm64-virt-gicv2 | arm64 | lab-baylibre | gcc-10 | defconfig | 1

Details: https://kernelci.org/test/plan/id/6388a90cf2cc07ca732abd20

Results: 0 PASS, 1 FAIL, 0 SKIP
Full config: defconfig
Compiler: gcc-10 (aarch64-linux-gnu-gcc (Debian 10.2.1-6) 10.2.1 20210110)
Plain log: https://storage.kernelci.org//cip/linux-4.4.y-cip-rt/v4.4.302-cip71-rt41/arm64/defconfig/gcc-10/lab-baylibre/baseline-qemu_arm64-virt-gicv2.txt
HTML log: https://storage.kernelci.org//cip/linux-4.4.y-cip-rt/v4.4.302-cip71-rt41/arm64/defconfig/gcc-10/lab-baylibre/baseline-qemu_arm64-virt-gicv2.html
Rootfs: http://storage.kernelci.org/images/rootfs/buildroot/buildroot-baseline/20221125.0/arm64/rootfs.cpio.gz


* baseline.login: https://kernelci.org/test/case/id/6388a90cf2cc07ca732abd21
new failure (last pass: v4.4.296-cip67-rt37)



platform | arch | lab | compiler | defconfig | regressions
----------------------+-------+---------------+----------+-----------+------------
qemu_arm64-virt-gicv2 | arm64 | lab-broonie | gcc-10 | defconfig | 1

Details: https://kernelci.org/test/plan/id/6388a8bb1cab70d7952abd08

Results: 0 PASS, 1 FAIL, 0 SKIP
Full config: defconfig
Compiler: gcc-10 (aarch64-linux-gnu-gcc (Debian 10.2.1-6) 10.2.1 20210110)
Plain log: https://storage.kernelci.org//cip/linux-4.4.y-cip-rt/v4.4.302-cip71-rt41/arm64/defconfig/gcc-10/lab-broonie/baseline-qemu_arm64-virt-gicv2.txt
HTML log: https://storage.kernelci.org//cip/linux-4.4.y-cip-rt/v4.4.302-cip71-rt41/arm64/defconfig/gcc-10/lab-broonie/baseline-qemu_arm64-virt-gicv2.html
Rootfs: http://storage.kernelci.org/images/rootfs/buildroot/buildroot-baseline/20221125.0/arm64/rootfs.cpio.gz


* baseline.login: https://kernelci.org/test/case/id/6388a8bb1cab70d7952abd09
new failure (last pass: v4.4.296-cip67-rt37)



platform | arch | lab | compiler | defconfig | regressions
----------------------+-------+---------------+----------+-----------+------------
qemu_arm64-virt-gicv2 | arm64 | lab-collabora | gcc-10 | defconfig | 1

Details: https://kernelci.org/test/plan/id/6388a8b31cab70d7952abcfb

Results: 0 PASS, 1 FAIL, 0 SKIP
Full config: defconfig
Compiler: gcc-10 (aarch64-linux-gnu-gcc (Debian 10.2.1-6) 10.2.1 20210110)
Plain log: https://storage.kernelci.org//cip/linux-4.4.y-cip-rt/v4.4.302-cip71-rt41/arm64/defconfig/gcc-10/lab-collabora/baseline-qemu_arm64-virt-gicv2.txt
HTML log: https://storage.kernelci.org//cip/linux-4.4.y-cip-rt/v4.4.302-cip71-rt41/arm64/defconfig/gcc-10/lab-collabora/baseline-qemu_arm64-virt-gicv2.html
Rootfs: http://storage.kernelci.org/images/rootfs/buildroot/buildroot-baseline/20221125.0/arm64/rootfs.cpio.gz


* baseline.login: https://kernelci.org/test/case/id/6388a8b31cab70d7952abcfc
new failure (last pass: v4.4.296-cip67-rt37)



platform | arch | lab | compiler | defconfig | regressions
----------------------+-------+---------------+----------+-----------+------------
qemu_arm64-virt-gicv3 | arm64 | lab-baylibre | gcc-10 | defconfig | 1

Details: https://kernelci.org/test/plan/id/6388a910be1909c2842abd06

Results: 0 PASS, 1 FAIL, 0 SKIP
Full config: defconfig
Compiler: gcc-10 (aarch64-linux-gnu-gcc (Debian 10.2.1-6) 10.2.1 20210110)
Plain log: https://storage.kernelci.org//cip/linux-4.4.y-cip-rt/v4.4.302-cip71-rt41/arm64/defconfig/gcc-10/lab-baylibre/baseline-qemu_arm64-virt-gicv3.txt
HTML log: https://storage.kernelci.org//cip/linux-4.4.y-cip-rt/v4.4.302-cip71-rt41/arm64/defconfig/gcc-10/lab-baylibre/baseline-qemu_arm64-virt-gicv3.html
Rootfs: http://storage.kernelci.org/images/rootfs/buildroot/buildroot-baseline/20221125.0/arm64/rootfs.cpio.gz


* baseline.login: https://kernelci.org/test/case/id/6388a910be1909c2842abd07
new failure (last pass: v4.4.296-cip67-rt37)



platform | arch | lab | compiler | defconfig | regressions
----------------------+-------+---------------+----------+-----------+------------
qemu_arm64-virt-gicv3 | arm64 | lab-broonie | gcc-10 | defconfig | 1

Details: https://kernelci.org/test/plan/id/6388a8bd1cab70d7952abd0e

Results: 0 PASS, 1 FAIL, 0 SKIP
Full config: defconfig
Compiler: gcc-10 (aarch64-linux-gnu-gcc (Debian 10.2.1-6) 10.2.1 20210110)
Plain log: https://storage.kernelci.org//cip/linux-4.4.y-cip-rt/v4.4.302-cip71-rt41/arm64/defconfig/gcc-10/lab-broonie/baseline-qemu_arm64-virt-gicv3.txt
HTML log: https://storage.kernelci.org//cip/linux-4.4.y-cip-rt/v4.4.302-cip71-rt41/arm64/defconfig/gcc-10/lab-broonie/baseline-qemu_arm64-virt-gicv3.html
Rootfs: http://storage.kernelci.org/images/rootfs/buildroot/buildroot-baseline/20221125.0/arm64/rootfs.cpio.gz


* baseline.login: https://kernelci.org/test/case/id/6388a8bd1cab70d7952abd0f
new failure (last pass: v4.4.296-cip67-rt37)



platform | arch | lab | compiler | defconfig | regressions
----------------------+-------+---------------+----------+-----------+------------
qemu_arm64-virt-gicv3 | arm64 | lab-collabora | gcc-10 | defconfig | 1

Details: https://kernelci.org/test/plan/id/6388a8b61cab70d7952abd01

Results: 0 PASS, 1 FAIL, 0 SKIP
Full config: defconfig
Compiler: gcc-10 (aarch64-linux-gnu-gcc (Debian 10.2.1-6) 10.2.1 20210110)
Plain log: https://storage.kernelci.org//cip/linux-4.4.y-cip-rt/v4.4.302-cip71-rt41/arm64/defconfig/gcc-10/lab-collabora/baseline-qemu_arm64-virt-gicv3.txt
HTML log: https://storage.kernelci.org//cip/linux-4.4.y-cip-rt/v4.4.302-cip71-rt41/arm64/defconfig/gcc-10/lab-collabora/baseline-qemu_arm64-virt-gicv3.html
Rootfs: http://storage.kernelci.org/images/rootfs/buildroot/buildroot-baseline/20221125.0/arm64/rootfs.cpio.gz


* baseline.login: https://kernelci.org/test/case/id/6388a8b61cab70d7952abd02
new failure (last pass: v4.4.296-cip67-rt37)


cip/linux-4.4.y-cip-rt build: 181 builds: 0 failed, 181 passed, 66 warnings (v4.4.302-cip71-rt41) #kernelci

kernelci.org bot <bot@...>
 

cip/linux-4.4.y-cip-rt build: 181 builds: 0 failed, 181 passed, 66 warnings (v4.4.302-cip71-rt41)

Full Build Summary: https://kernelci.org/build/cip/branch/linux-4.4.y-cip-rt/kernel/v4.4.302-cip71-rt41/

Tree: cip
Branch: linux-4.4.y-cip-rt
Git Describe: v4.4.302-cip71-rt41
Git Commit: 83cf69382b99a59619dd4cbe57c4038402270da9
Git URL: https://git.kernel.org/pub/scm/linux/kernel/git/cip/linux-cip.git
Built: 6 unique architectures

Warnings Detected:

arc:

arm64:
defconfig (gcc-10): 1 warning

arm:
clps711x_defconfig (gcc-10): 1 warning
davinci_all_defconfig (gcc-10): 1 warning
lpc32xx_defconfig (gcc-10): 1 warning
mini2440_defconfig (gcc-10): 1 warning
mxs_defconfig (gcc-10): 1 warning
omap1_defconfig (gcc-10): 1 warning
omap2plus_defconfig (gcc-10): 1 warning
s3c2410_defconfig (gcc-10): 1 warning
s3c6400_defconfig (gcc-10): 2 warnings

i386:
i386_defconfig (gcc-10): 4 warnings
i386_defconfig+preempt_rt (gcc-10): 4 warnings

mips:
ip22_defconfig (gcc-10): 1 warning
mtx1_defconfig (gcc-10): 3 warnings

x86_64:
defconfig (gcc-10): 8 warnings
defconfig+preempt_rt (gcc-10): 9 warnings
defconfig+x86-chromebook (gcc-10): 8 warnings
x86_64_defconfig+preempt_rt (gcc-10): 9 warnings
x86_64_defconfig+x86-chromebook+preempt_rt (gcc-10): 9 warnings


Warnings summary:

10 arch/x86/kernel/process.c:456: Warning: no instruction mnemonic suffix given and no register operands; using default for `btr'
7 ld: warning: creating DT_TEXTREL in a PIE
7 WARNING: vmlinux.o (.discard.retpoline_safe): unexpected non-allocatable section.
7 WARNING: vmlinux.o (.discard.nospec): unexpected non-allocatable section.
5 ld: arch/x86/boot/compressed/head_64.o: warning: relocation in read-only section `.head.text'
5 arch/x86/entry/entry_64.S:487: Warning: no instruction mnemonic suffix given and no register operands; using default for `btr'
5 arch/x86/entry/entry_64.S:1660: Warning: no instruction mnemonic suffix given and no register operands; using default for `sysret'
3 drivers/tty/serial/samsung.c:1776:34: warning: array ‘s3c24xx_uart_dt_match’ assumed to have one element
3 arch/x86/entry/entry_64.S:644: Warning: no instruction mnemonic suffix given and no register operands; using default for `bt'
2 sound/pci/echoaudio/echoaudio_dsp.c:647:9: warning: iteration 1073741824 invokes undefined behavior [-Waggressive-loop-optimizations]
2 ld: arch/x86/boot/compressed/head_32.o: warning: relocation in read-only section `.head.text'
1 sound/pci/echoaudio/echoaudio_dsp.c:658:9: warning: iteration 1073741824 invokes undefined behavior [-Waggressive-loop-optimizations]
1 drivers/net/ethernet/seeq/sgiseeq.c:804:26: warning: passing argument 5 of ‘dma_free_attrs’ makes pointer from integer without a cast [-Wint-conversion]
1 drivers/net/ethernet/apm/xgene/xgene_enet_main.c:32:36: warning: array ‘xgene_enet_acpi_match’ assumed to have one element
1 drivers/mmc/host/sdhci-s3c.c:429:34: warning: array ‘sdhci_s3c_dt_match’ assumed to have one element
1 drivers/gpio/gpio-omap.c:1161:34: warning: array ‘omap_gpio_match’ assumed to have one element
1 drivers/cpufreq/ti-cpufreq.c:250:24: warning: passing argument 1 of ‘PTR_ERR_OR_ZERO’ makes pointer from integer without a cast [-Wint-conversion]
1 arch/arm/mach-mxs/mach-mxs.c:285:26: warning: duplicate ‘const’ declaration specifier [-Wduplicate-decl-specifier]
1 arch/arm/mach-lpc32xx/phy3250.c:215:36: warning: duplicate ‘const’ declaration specifier [-Wduplicate-decl-specifier]
1 arch/arm/mach-davinci/da8xx-dt.c:23:34: warning: duplicate ‘const’ declaration specifier [-Wduplicate-decl-specifier]
1 arch/arm/mach-clps711x/board-autcpu12.c:163:26: warning: duplicate ‘const’ declaration specifier [-Wduplicate-decl-specifier]

================================================================================

Detailed per-defconfig build reports:

--------------------------------------------------------------------------------
acs5k_defconfig (arm, gcc-10) — PASS, 0 errors, 0 warnings, 0 section mismatches

--------------------------------------------------------------------------------
acs5k_tiny_defconfig (arm, gcc-10) — PASS, 0 errors, 0 warnings, 0 section mismatches

--------------------------------------------------------------------------------
allnoconfig (mips, gcc-10) — PASS, 0 errors, 0 warnings, 0 section mismatches

--------------------------------------------------------------------------------
allnoconfig (i386, gcc-10) — PASS, 0 errors, 0 warnings, 0 section mismatches

--------------------------------------------------------------------------------
allnoconfig (arc, gcc-10) — PASS, 0 errors, 0 warnings, 0 section mismatches

--------------------------------------------------------------------------------
am200epdkit_defconfig (arm, gcc-10) — PASS, 0 errors, 0 warnings, 0 section mismatches

--------------------------------------------------------------------------------
assabet_defconfig (arm, gcc-10) — PASS, 0 errors, 0 warnings, 0 section mismatches

--------------------------------------------------------------------------------
at91_dt_defconfig (arm, gcc-10) — PASS, 0 errors, 0 warnings, 0 section mismatches

--------------------------------------------------------------------------------
ath79_defconfig (mips, gcc-10) — PASS, 0 errors, 0 warnings, 0 section mismatches

--------------------------------------------------------------------------------
axm55xx_defconfig (arm, gcc-10) — PASS, 0 errors, 0 warnings, 0 section mismatches

--------------------------------------------------------------------------------
axs103_defconfig (arc, gcc-10) — PASS, 0 errors, 0 warnings, 0 section mismatches

--------------------------------------------------------------------------------
axs103_smp_defconfig (arc, gcc-10) — PASS, 0 errors, 0 warnings, 0 section mismatches

--------------------------------------------------------------------------------
badge4_defconfig (arm, gcc-10) — PASS, 0 errors, 0 warnings, 0 section mismatches

--------------------------------------------------------------------------------
bcm2835_defconfig (arm, gcc-10) — PASS, 0 errors, 0 warnings, 0 section mismatches

--------------------------------------------------------------------------------
bcm47xx_defconfig (mips, gcc-10) — PASS, 0 errors, 0 warnings, 0 section mismatches

--------------------------------------------------------------------------------
bcm63xx_defconfig (mips, gcc-10) — PASS, 0 errors, 0 warnings, 0 section mismatches

--------------------------------------------------------------------------------
bcm_defconfig (arm, gcc-10) — PASS, 0 errors, 0 warnings, 0 section mismatches

--------------------------------------------------------------------------------
bigsur_defconfig (mips, gcc-10) — PASS, 0 errors, 0 warnings, 0 section mismatches

--------------------------------------------------------------------------------
bmips_be_defconfig (mips, gcc-10) — PASS, 0 errors, 0 warnings, 0 section mismatches

--------------------------------------------------------------------------------
bmips_stb_defconfig (mips, gcc-10) — PASS, 0 errors, 0 warnings, 0 section mismatches

--------------------------------------------------------------------------------
capcella_defconfig (mips, gcc-10) — PASS, 0 errors, 0 warnings, 0 section mismatches

--------------------------------------------------------------------------------
cavium_octeon_defconfig (mips, gcc-10) — PASS, 0 errors, 0 warnings, 0 section mismatches

--------------------------------------------------------------------------------
cerfcube_defconfig (arm, gcc-10) — PASS, 0 errors, 0 warnings, 0 section mismatches

--------------------------------------------------------------------------------
ci20_defconfig (mips, gcc-10) — PASS, 0 errors, 0 warnings, 0 section mismatches

--------------------------------------------------------------------------------
clps711x_defconfig (arm, gcc-10) — PASS, 0 errors, 1 warning, 0 section mismatches

Warnings:
arch/arm/mach-clps711x/board-autcpu12.c:163:26: warning: duplicate ‘const’ declaration specifier [-Wduplicate-decl-specifier]

--------------------------------------------------------------------------------
cm_x2xx_defconfig (arm, gcc-10) — PASS, 0 errors, 0 warnings, 0 section mismatches

--------------------------------------------------------------------------------
cm_x300_defconfig (arm, gcc-10) — PASS, 0 errors, 0 warnings, 0 section mismatches

--------------------------------------------------------------------------------
cobalt_defconfig (mips, gcc-10) — PASS, 0 errors, 0 warnings, 0 section mismatches

--------------------------------------------------------------------------------
colibri_pxa270_defconfig (arm, gcc-10) — PASS, 0 errors, 0 warnings, 0 section mismatches

--------------------------------------------------------------------------------
colibri_pxa300_defconfig (arm, gcc-10) — PASS, 0 errors, 0 warnings, 0 section mismatches

--------------------------------------------------------------------------------
collie_defconfig (arm, gcc-10) — PASS, 0 errors, 0 warnings, 0 section mismatches

--------------------------------------------------------------------------------
corgi_defconfig (arm, gcc-10) — PASS, 0 errors, 0 warnings, 0 section mismatches

--------------------------------------------------------------------------------
davinci_all_defconfig (arm, gcc-10) — PASS, 0 errors, 1 warning, 0 section mismatches

Warnings:
arch/arm/mach-davinci/da8xx-dt.c:23:34: warning: duplicate ‘const’ declaration specifier [-Wduplicate-decl-specifier]

--------------------------------------------------------------------------------
db1xxx_defconfig (mips, gcc-10) — PASS, 0 errors, 0 warnings, 0 section mismatches

--------------------------------------------------------------------------------
decstation_defconfig (mips, gcc-10) — PASS, 0 errors, 0 warnings, 0 section mismatches

--------------------------------------------------------------------------------
defconfig (arm, gcc-10) — PASS, 0 errors, 0 warnings, 0 section mismatches

--------------------------------------------------------------------------------
defconfig (x86_64, gcc-10) — PASS, 0 errors, 8 warnings, 0 section mismatches

Warnings:
arch/x86/entry/entry_64.S:487: Warning: no instruction mnemonic suffix given and no register operands; using default for `btr'
arch/x86/entry/entry_64.S:1660: Warning: no instruction mnemonic suffix given and no register operands; using default for `sysret'
arch/x86/kernel/process.c:456: Warning: no instruction mnemonic suffix given and no register operands; using default for `btr'
arch/x86/kernel/process.c:456: Warning: no instruction mnemonic suffix given and no register operands; using default for `btr'
WARNING: vmlinux.o (.discard.nospec): unexpected non-allocatable section.
WARNING: vmlinux.o (.discard.retpoline_safe): unexpected non-allocatable section.
ld: arch/x86/boot/compressed/head_64.o: warning: relocation in read-only section `.head.text'
ld: warning: creating DT_TEXTREL in a PIE

--------------------------------------------------------------------------------
defconfig (arm64, gcc-10) — PASS, 0 errors, 1 warning, 0 section mismatches

Warnings:
drivers/net/ethernet/apm/xgene/xgene_enet_main.c:32:36: warning: array ‘xgene_enet_acpi_match’ assumed to have one element

--------------------------------------------------------------------------------
defconfig+preempt_rt (arm, gcc-10) — PASS, 0 errors, 0 warnings, 0 section mismatches

--------------------------------------------------------------------------------
defconfig+preempt_rt (x86_64, gcc-10) — PASS, 0 errors, 9 warnings, 0 section mismatches

Warnings:
arch/x86/entry/entry_64.S:487: Warning: no instruction mnemonic suffix given and no register operands; using default for `btr'
arch/x86/entry/entry_64.S:644: Warning: no instruction mnemonic suffix given and no register operands; using default for `bt'
arch/x86/entry/entry_64.S:1660: Warning: no instruction mnemonic suffix given and no register operands; using default for `sysret'
arch/x86/kernel/process.c:456: Warning: no instruction mnemonic suffix given and no register operands; using default for `btr'
arch/x86/kernel/process.c:456: Warning: no instruction mnemonic suffix given and no register operands; using default for `btr'
WARNING: vmlinux.o (.discard.nospec): unexpected non-allocatable section.
WARNING: vmlinux.o (.discard.retpoline_safe): unexpected non-allocatable section.
ld: arch/x86/boot/compressed/head_64.o: warning: relocation in read-only section `.head.text'
ld: warning: creating DT_TEXTREL in a PIE

--------------------------------------------------------------------------------
defconfig+preempt_rt (arm64, gcc-10) — PASS, 0 errors, 0 warnings, 0 section mismatches

--------------------------------------------------------------------------------
defconfig+x86-chromebook (x86_64, gcc-10) — PASS, 0 errors, 8 warnings, 0 section mismatches

Warnings:
arch/x86/entry/entry_64.S:487: Warning: no instruction mnemonic suffix given and no register operands; using default for `btr'
arch/x86/entry/entry_64.S:1660: Warning: no instruction mnemonic suffix given and no register operands; using default for `sysret'
arch/x86/kernel/process.c:456: Warning: no instruction mnemonic suffix given and no register operands; using default for `btr'
arch/x86/kernel/process.c:456: Warning: no instruction mnemonic suffix given and no register operands; using default for `btr'
WARNING: vmlinux.o (.discard.nospec): unexpected non-allocatable section.
WARNING: vmlinux.o (.discard.retpoline_safe): unexpected non-allocatable section.
ld: arch/x86/boot/compressed/head_64.o: warning: relocation in read-only section `.head.text'
ld: warning: creating DT_TEXTREL in a PIE

--------------------------------------------------------------------------------
dove_defconfig (arm, gcc-10) — PASS, 0 errors, 0 warnings, 0 section mismatches

--------------------------------------------------------------------------------
e55_defconfig (mips, gcc-10) — PASS, 0 errors, 0 warnings, 0 section mismatches

--------------------------------------------------------------------------------
ebsa110_defconfig (arm, gcc-10) — PASS, 0 errors, 0 warnings, 0 section mismatches

--------------------------------------------------------------------------------
efm32_defconfig (arm, gcc-10) — PASS, 0 errors, 0 warnings, 0 section mismatches

--------------------------------------------------------------------------------
em_x270_defconfig (arm, gcc-10) — PASS, 0 errors, 0 warnings, 0 section mismatches

--------------------------------------------------------------------------------
ep93xx_defconfig (arm, gcc-10) — PASS, 0 errors, 0 warnings, 0 section mismatches

--------------------------------------------------------------------------------
eseries_pxa_defconfig (arm, gcc-10) — PASS, 0 errors, 0 warnings, 0 section mismatches

--------------------------------------------------------------------------------
exynos_defconfig (arm, gcc-10) — PASS, 0 errors, 0 warnings, 0 section mismatches

--------------------------------------------------------------------------------
ezx_defconfig (arm, gcc-10) — PASS, 0 errors, 0 warnings, 0 section mismatches

--------------------------------------------------------------------------------
footbridge_defconfig (arm, gcc-10) — PASS, 0 errors, 0 warnings, 0 section mismatches

--------------------------------------------------------------------------------
gpr_defconfig (mips, gcc-10) — PASS, 0 errors, 0 warnings, 0 section mismatches

--------------------------------------------------------------------------------
h3600_defconfig (arm, gcc-10) — PASS, 0 errors, 0 warnings, 0 section mismatches

--------------------------------------------------------------------------------
h5000_defconfig (arm, gcc-10) — PASS, 0 errors, 0 warnings, 0 section mismatches

--------------------------------------------------------------------------------
hackkit_defconfig (arm, gcc-10) — PASS, 0 errors, 0 warnings, 0 section mismatches

--------------------------------------------------------------------------------
hisi_defconfig (arm, gcc-10) — PASS, 0 errors, 0 warnings, 0 section mismatches

--------------------------------------------------------------------------------
i386_defconfig (i386, gcc-10) — PASS, 0 errors, 4 warnings, 0 section mismatches

Warnings:
WARNING: vmlinux.o (.discard.nospec): unexpected non-allocatable section.
WARNING: vmlinux.o (.discard.retpoline_safe): unexpected non-allocatable section.
ld: arch/x86/boot/compressed/head_32.o: warning: relocation in read-only section `.head.text'
ld: warning: creating DT_TEXTREL in a PIE

--------------------------------------------------------------------------------
i386_defconfig+preempt_rt (i386, gcc-10) — PASS, 0 errors, 4 warnings, 0 section mismatches

Warnings:
WARNING: vmlinux.o (.discard.nospec): unexpected non-allocatable section.
WARNING: vmlinux.o (.discard.retpoline_safe): unexpected non-allocatable section.
ld: arch/x86/boot/compressed/head_32.o: warning: relocation in read-only section `.head.text'
ld: warning: creating DT_TEXTREL in a PIE

--------------------------------------------------------------------------------
imote2_defconfig (arm, gcc-10) — PASS, 0 errors, 0 warnings, 0 section mismatches

--------------------------------------------------------------------------------
imx_v4_v5_defconfig (arm, gcc-10) — PASS, 0 errors, 0 warnings, 0 section mismatches

--------------------------------------------------------------------------------
imx_v6_v7_defconfig (arm, gcc-10) — PASS, 0 errors, 0 warnings, 0 section mismatches

--------------------------------------------------------------------------------
integrator_defconfig (arm, gcc-10) — PASS, 0 errors, 0 warnings, 0 section mismatches

--------------------------------------------------------------------------------
iop13xx_defconfig (arm, gcc-10) — PASS, 0 errors, 0 warnings, 0 section mismatches

--------------------------------------------------------------------------------
iop32x_defconfig (arm, gcc-10) — PASS, 0 errors, 0 warnings, 0 section mismatches

--------------------------------------------------------------------------------
iop33x_defconfig (arm, gcc-10) — PASS, 0 errors, 0 warnings, 0 section mismatches

--------------------------------------------------------------------------------
ip22_defconfig (mips, gcc-10) — PASS, 0 errors, 1 warning, 0 section mismatches

Warnings:
drivers/net/ethernet/seeq/sgiseeq.c:804:26: warning: passing argument 5 of ‘dma_free_attrs’ makes pointer from integer without a cast [-Wint-conversion]

--------------------------------------------------------------------------------
ip32_defconfig (mips, gcc-10) — PASS, 0 errors, 0 warnings, 0 section mismatches

--------------------------------------------------------------------------------
ixp4xx_defconfig (arm, gcc-10) — PASS, 0 errors, 0 warnings, 0 section mismatches

--------------------------------------------------------------------------------
jazz_defconfig (mips, gcc-10) — PASS, 0 errors, 0 warnings, 0 section mismatches

--------------------------------------------------------------------------------
jmr3927_defconfig (mips, gcc-10) — PASS, 0 errors, 0 warnings, 0 section mismatches

--------------------------------------------------------------------------------
jornada720_defconfig (arm, gcc-10) — PASS, 0 errors, 0 warnings, 0 section mismatches

--------------------------------------------------------------------------------
keystone_defconfig (arm, gcc-10) — PASS, 0 errors, 0 warnings, 0 section mismatches

--------------------------------------------------------------------------------
ks8695_defconfig (arm, gcc-10) — PASS, 0 errors, 0 warnings, 0 section mismatches

--------------------------------------------------------------------------------
lart_defconfig (arm, gcc-10) — PASS, 0 errors, 0 warnings, 0 section mismatches

--------------------------------------------------------------------------------
lasat_defconfig (mips, gcc-10) — PASS, 0 errors, 0 warnings, 0 section mismatches

--------------------------------------------------------------------------------
loongson3_defconfig (mips, gcc-10) — PASS, 0 errors, 0 warnings, 0 section mismatches

--------------------------------------------------------------------------------
lpc18xx_defconfig (arm, gcc-10) — PASS, 0 errors, 0 warnings, 0 section mismatches

--------------------------------------------------------------------------------
lpc32xx_defconfig (arm, gcc-10) — PASS, 0 errors, 1 warning, 0 section mismatches

Warnings:
arch/arm/mach-lpc32xx/phy3250.c:215:36: warning: duplicate ‘const’ declaration specifier [-Wduplicate-decl-specifier]

--------------------------------------------------------------------------------
lpd270_defconfig (arm, gcc-10) — PASS, 0 errors, 0 warnings, 0 section mismatches

--------------------------------------------------------------------------------
ls1b_defconfig (mips, gcc-10) — PASS, 0 errors, 0 warnings, 0 section mismatches

--------------------------------------------------------------------------------
lubbock_defconfig (arm, gcc-10) — PASS, 0 errors, 0 warnings, 0 section mismatches

--------------------------------------------------------------------------------
magician_defconfig (arm, gcc-10) — PASS, 0 errors, 0 warnings, 0 section mismatches

--------------------------------------------------------------------------------
mainstone_defconfig (arm, gcc-10) — PASS, 0 errors, 0 warnings, 0 section mismatches

--------------------------------------------------------------------------------
malta_defconfig (mips, gcc-10) — PASS, 0 errors, 0 warnings, 0 section mismatches

--------------------------------------------------------------------------------
malta_kvm_defconfig (mips, gcc-10) — PASS, 0 errors, 0 warnings, 0 section mismatches

--------------------------------------------------------------------------------
malta_kvm_guest_defconfig (mips, gcc-10) — PASS, 0 errors, 0 warnings, 0 section mismatches

--------------------------------------------------------------------------------
malta_qemu_32r6_defconfig (mips, gcc-10) — PASS, 0 errors, 0 warnings, 0 section mismatches

--------------------------------------------------------------------------------
maltaaprp_defconfig (mips, gcc-10) — PASS, 0 errors, 0 warnings, 0 section mismatches

--------------------------------------------------------------------------------
maltasmvp_defconfig (mips, gcc-10) — PASS, 0 errors, 0 warnings, 0 section mismatches

--------------------------------------------------------------------------------
maltasmvp_eva_defconfig (mips, gcc-10) — PASS, 0 errors, 0 warnings, 0 section mismatches

--------------------------------------------------------------------------------
maltaup_defconfig (mips, gcc-10) — PASS, 0 errors, 0 warnings, 0 section mismatches

--------------------------------------------------------------------------------
maltaup_xpa_defconfig (mips, gcc-10) — PASS, 0 errors, 0 warnings, 0 section mismatches

--------------------------------------------------------------------------------
markeins_defconfig (mips, gcc-10) — PASS, 0 errors, 0 warnings, 0 section mismatches

--------------------------------------------------------------------------------
mini2440_defconfig (arm, gcc-10) — PASS, 0 errors, 1 warning, 0 section mismatches

Warnings:
drivers/tty/serial/samsung.c:1776:34: warning: array ‘s3c24xx_uart_dt_match’ assumed to have one element

--------------------------------------------------------------------------------
mips_paravirt_defconfig (mips, gcc-10) — PASS, 0 errors, 0 warnings, 0 section mismatches

--------------------------------------------------------------------------------
mmp2_defconfig (arm, gcc-10) — PASS, 0 errors, 0 warnings, 0 section mismatches

--------------------------------------------------------------------------------
mpc30x_defconfig (mips, gcc-10) — PASS, 0 errors, 0 warnings, 0 section mismatches

--------------------------------------------------------------------------------
msp71xx_defconfig (mips, gcc-10) — PASS, 0 errors, 0 warnings, 0 section mismatches

--------------------------------------------------------------------------------
mtx1_defconfig (mips, gcc-10) — PASS, 0 errors, 3 warnings, 0 section mismatches

Warnings:
sound/pci/echoaudio/echoaudio_dsp.c:647:9: warning: iteration 1073741824 invokes undefined behavior [-Waggressive-loop-optimizations]
sound/pci/echoaudio/echoaudio_dsp.c:658:9: warning: iteration 1073741824 invokes undefined behavior [-Waggressive-loop-optimizations]
sound/pci/echoaudio/echoaudio_dsp.c:647:9: warning: iteration 1073741824 invokes undefined behavior [-Waggressive-loop-optimizations]

--------------------------------------------------------------------------------
multi_v5_defconfig (arm, gcc-10) — PASS, 0 errors, 0 warnings, 0 section mismatches

--------------------------------------------------------------------------------
multi_v7_defconfig (arm, gcc-10) — PASS, 0 errors, 0 warnings, 0 section mismatches

--------------------------------------------------------------------------------
multi_v7_defconfig+preempt_rt (arm, gcc-10) — PASS, 0 errors, 0 warnings, 0 section mismatches

--------------------------------------------------------------------------------
mv78xx0_defconfig (arm, gcc-10) — PASS, 0 errors, 0 warnings, 0 section mismatches

--------------------------------------------------------------------------------
mvebu_v5_defconfig (arm, gcc-10) — PASS, 0 errors, 0 warnings, 0 section mismatches

--------------------------------------------------------------------------------
mvebu_v7_defconfig (arm, gcc-10) — PASS, 0 errors, 0 warnings, 0 section mismatches

--------------------------------------------------------------------------------
mxs_defconfig (arm, gcc-10) — PASS, 0 errors, 1 warning, 0 section mismatches

Warnings:
arch/arm/mach-mxs/mach-mxs.c:285:26: warning: duplicate ‘const’ declaration specifier [-Wduplicate-decl-specifier]

--------------------------------------------------------------------------------
neponset_defconfig (arm, gcc-10) — PASS, 0 errors, 0 warnings, 0 section mismatches

--------------------------------------------------------------------------------
netwinder_defconfig (arm, gcc-10) — PASS, 0 errors, 0 warnings, 0 section mismatches

--------------------------------------------------------------------------------
netx_defconfig (arm, gcc-10) — PASS, 0 errors, 0 warnings, 0 section mismatches

--------------------------------------------------------------------------------
nhk8815_defconfig (arm, gcc-10) — PASS, 0 errors, 0 warnings, 0 section mismatches

--------------------------------------------------------------------------------
nlm_xlp_defconfig (mips, gcc-10) — PASS, 0 errors, 0 warnings, 0 section mismatches

--------------------------------------------------------------------------------
nlm_xlr_defconfig (mips, gcc-10) — PASS, 0 errors, 0 warnings, 0 section mismatches

--------------------------------------------------------------------------------
nsim_hs_defconfig (arc, gcc-10) — PASS, 0 errors, 0 warnings, 0 section mismatches

--------------------------------------------------------------------------------
nsim_hs_smp_defconfig (arc, gcc-10) — PASS, 0 errors, 0 warnings, 0 section mismatches

--------------------------------------------------------------------------------
nsimosci_hs_defconfig (arc, gcc-10) — PASS, 0 errors, 0 warnings, 0 section mismatches

--------------------------------------------------------------------------------
nsimosci_hs_smp_defconfig (arc, gcc-10) — PASS, 0 errors, 0 warnings, 0 section mismatches

--------------------------------------------------------------------------------
nuc910_defconfig (arm, gcc-10) — PASS, 0 errors, 0 warnings, 0 section mismatches

--------------------------------------------------------------------------------
nuc950_defconfig (arm, gcc-10) — PASS, 0 errors, 0 warnings, 0 section mismatches

--------------------------------------------------------------------------------
nuc960_defconfig (arm, gcc-10) — PASS, 0 errors, 0 warnings, 0 section mismatches

--------------------------------------------------------------------------------
omap1_defconfig (arm, gcc-10) — PASS, 0 errors, 1 warning, 0 section mismatches

Warnings:
drivers/gpio/gpio-omap.c:1161:34: warning: array ‘omap_gpio_match’ assumed to have one element

--------------------------------------------------------------------------------
omap2plus_defconfig (arm, gcc-10) — PASS, 0 errors, 1 warning, 0 section mismatches

Warnings:
drivers/cpufreq/ti-cpufreq.c:250:24: warning: passing argument 1 of ‘PTR_ERR_OR_ZERO’ makes pointer from integer without a cast [-Wint-conversion]

--------------------------------------------------------------------------------
orion5x_defconfig (arm, gcc-10) — PASS, 0 errors, 0 warnings, 0 section mismatches

--------------------------------------------------------------------------------
palmz72_defconfig (arm, gcc-10) — PASS, 0 errors, 0 warnings, 0 section mismatches

--------------------------------------------------------------------------------
pcm027_defconfig (arm, gcc-10) — PASS, 0 errors, 0 warnings, 0 section mismatches

--------------------------------------------------------------------------------
pleb_defconfig (arm, gcc-10) — PASS, 0 errors, 0 warnings, 0 section mismatches

--------------------------------------------------------------------------------
pnx8335_stb225_defconfig (mips, gcc-10) — PASS, 0 errors, 0 warnings, 0 section mismatches

--------------------------------------------------------------------------------
prima2_defconfig (arm, gcc-10) — PASS, 0 errors, 0 warnings, 0 section mismatches

--------------------------------------------------------------------------------
pxa168_defconfig (arm, gcc-10) — PASS, 0 errors, 0 warnings, 0 section mismatches

--------------------------------------------------------------------------------
pxa255-idp_defconfig (arm, gcc-10) — PASS, 0 errors, 0 warnings, 0 section mismatches

--------------------------------------------------------------------------------
pxa3xx_defconfig (arm, gcc-10) — PASS, 0 errors, 0 warnings, 0 section mismatches

--------------------------------------------------------------------------------
pxa910_defconfig (arm, gcc-10) — PASS, 0 errors, 0 warnings, 0 section mismatches

--------------------------------------------------------------------------------
qcom_defconfig (arm, gcc-10) — PASS, 0 errors, 0 warnings, 0 section mismatches

--------------------------------------------------------------------------------
qi_lb60_defconfig (mips, gcc-10) — PASS, 0 errors, 0 warnings, 0 section mismatches

--------------------------------------------------------------------------------
raumfeld_defconfig (arm, gcc-10) — PASS, 0 errors, 0 warnings, 0 section mismatches

--------------------------------------------------------------------------------
rb532_defconfig (mips, gcc-10) — PASS, 0 errors, 0 warnings, 0 section mismatches

--------------------------------------------------------------------------------
rbtx49xx_defconfig (mips, gcc-10) — PASS, 0 errors, 0 warnings, 0 section mismatches

--------------------------------------------------------------------------------
realview-smp_defconfig (arm, gcc-10) — PASS, 0 errors, 0 warnings, 0 section mismatches

--------------------------------------------------------------------------------
realview_defconfig (arm, gcc-10) — PASS, 0 errors, 0 warnings, 0 section mismatches

--------------------------------------------------------------------------------
rm200_defconfig (mips, gcc-10) — PASS, 0 errors, 0 warnings, 0 section mismatches

--------------------------------------------------------------------------------
rt305x_defconfig (mips, gcc-10) — PASS, 0 errors, 0 warnings, 0 section mismatches

--------------------------------------------------------------------------------
s3c2410_defconfig (arm, gcc-10) — PASS, 0 errors, 1 warning, 0 section mismatches

Warnings:
drivers/tty/serial/samsung.c:1776:34: warning: array ‘s3c24xx_uart_dt_match’ assumed to have one element

--------------------------------------------------------------------------------
s3c6400_defconfig (arm, gcc-10) — PASS, 0 errors, 2 warnings, 0 section mismatches

Warnings:
drivers/mmc/host/sdhci-s3c.c:429:34: warning: array ‘sdhci_s3c_dt_match’ assumed to have one element
drivers/tty/serial/samsung.c:1776:34: warning: array ‘s3c24xx_uart_dt_match’ assumed to have one element

--------------------------------------------------------------------------------
s5pv210_defconfig (arm, gcc-10) — PASS, 0 errors, 0 warnings, 0 section mismatches

--------------------------------------------------------------------------------
sama5_defconfig (arm, gcc-10) — PASS, 0 errors, 0 warnings, 0 section mismatches

--------------------------------------------------------------------------------
sb1250_swarm_defconfig (mips, gcc-10) — PASS, 0 errors, 0 warnings, 0 section mismatches

--------------------------------------------------------------------------------
sead3_defconfig (mips, gcc-10) — PASS, 0 errors, 0 warnings, 0 section mismatches

--------------------------------------------------------------------------------
sead3micro_defconfig (mips, gcc-10) — PASS, 0 errors, 0 warnings, 0 section mismatches

--------------------------------------------------------------------------------
shannon_defconfig (arm, gcc-10) — PASS, 0 errors, 0 warnings, 0 section mismatches

--------------------------------------------------------------------------------
shmobile_defconfig (arm, gcc-10) — PASS, 0 errors, 0 warnings, 0 section mismatches

--------------------------------------------------------------------------------
simpad_defconfig (arm, gcc-10) — PASS, 0 errors, 0 warnings, 0 section mismatches

--------------------------------------------------------------------------------
socfpga_defconfig (arm, gcc-10) — PASS, 0 errors, 0 warnings, 0 section mismatches

--------------------------------------------------------------------------------
spear13xx_defconfig (arm, gcc-10) — PASS, 0 errors, 0 warnings, 0 section mismatches

--------------------------------------------------------------------------------
spear3xx_defconfig (arm, gcc-10) — PASS, 0 errors, 0 warnings, 0 section mismatches

--------------------------------------------------------------------------------
spear6xx_defconfig (arm, gcc-10) — PASS, 0 errors, 0 warnings, 0 section mismatches

--------------------------------------------------------------------------------
spitz_defconfig (arm, gcc-10) — PASS, 0 errors, 0 warnings, 0 section mismatches

--------------------------------------------------------------------------------
stm32_defconfig (arm, gcc-10) — PASS, 0 errors, 0 warnings, 0 section mismatches

--------------------------------------------------------------------------------
sunxi_defconfig (arm, gcc-10) — PASS, 0 errors, 0 warnings, 0 section mismatches

--------------------------------------------------------------------------------
tb0219_defconfig (mips, gcc-10) — PASS, 0 errors, 0 warnings, 0 section mismatches

--------------------------------------------------------------------------------
tb0226_defconfig (mips, gcc-10) — PASS, 0 errors, 0 warnings, 0 section mismatches

--------------------------------------------------------------------------------
tb0287_defconfig (mips, gcc-10) — PASS, 0 errors, 0 warnings, 0 section mismatches

--------------------------------------------------------------------------------
tct_hammer_defconfig (arm, gcc-10) — PASS, 0 errors, 0 warnings, 0 section mismatches

--------------------------------------------------------------------------------
tegra_defconfig (arm, gcc-10) — PASS, 0 errors, 0 warnings, 0 section mismatches

--------------------------------------------------------------------------------
trizeps4_defconfig (arm, gcc-10) — PASS, 0 errors, 0 warnings, 0 section mismatches

--------------------------------------------------------------------------------
u300_defconfig (arm, gcc-10) — PASS, 0 errors, 0 warnings, 0 section mismatches

--------------------------------------------------------------------------------
u8500_defconfig (arm, gcc-10) — PASS, 0 errors, 0 warnings, 0 section mismatches

--------------------------------------------------------------------------------
vdk_hs38_defconfig (arc, gcc-10) — PASS, 0 errors, 0 warnings, 0 section mismatches

--------------------------------------------------------------------------------
vdk_hs38_smp_defconfig (arc, gcc-10) — PASS, 0 errors, 0 warnings, 0 section mismatches

--------------------------------------------------------------------------------
versatile_defconfig (arm, gcc-10) — PASS, 0 errors, 0 warnings, 0 section mismatches

--------------------------------------------------------------------------------
vexpress_defconfig (arm, gcc-10) — PASS, 0 errors, 0 warnings, 0 section mismatches

--------------------------------------------------------------------------------
vf610m4_defconfig (arm, gcc-10) — PASS, 0 errors, 0 warnings, 0 section mismatches

--------------------------------------------------------------------------------
viper_defconfig (arm, gcc-10) — PASS, 0 errors, 0 warnings, 0 section mismatches

--------------------------------------------------------------------------------
vt8500_v6_v7_defconfig (arm, gcc-10) — PASS, 0 errors, 0 warnings, 0 section mismatches

--------------------------------------------------------------------------------
workpad_defconfig (mips, gcc-10) — PASS, 0 errors, 0 warnings, 0 section mismatches

--------------------------------------------------------------------------------
x86_64_defconfig+preempt_rt (x86_64, gcc-10) — PASS, 0 errors, 9 warnings, 0 section mismatches

Warnings:
arch/x86/entry/entry_64.S:487: Warning: no instruction mnemonic suffix given and no register operands; using default for `btr'
arch/x86/entry/entry_64.S:644: Warning: no instruction mnemonic suffix given and no register operands; using default for `bt'
arch/x86/entry/entry_64.S:1660: Warning: no instruction mnemonic suffix given and no register operands; using default for `sysret'
arch/x86/kernel/process.c:456: Warning: no instruction mnemonic suffix given and no register operands; using default for `btr'
arch/x86/kernel/process.c:456: Warning: no instruction mnemonic suffix given and no register operands; using default for `btr'
WARNING: vmlinux.o (.discard.nospec): unexpected non-allocatable section.
WARNING: vmlinux.o (.discard.retpoline_safe): unexpected non-allocatable section.
ld: arch/x86/boot/compressed/head_64.o: warning: relocation in read-only section `.head.text'
ld: warning: creating DT_TEXTREL in a PIE

--------------------------------------------------------------------------------
x86_64_defconfig+x86-chromebook+preempt_rt (x86_64, gcc-10) — PASS, 0 errors, 9 warnings, 0 section mismatches

Warnings:
arch/x86/entry/entry_64.S:487: Warning: no instruction mnemonic suffix given and no register operands; using default for `btr'
arch/x86/entry/entry_64.S:644: Warning: no instruction mnemonic suffix given and no register operands; using default for `bt'
arch/x86/entry/entry_64.S:1660: Warning: no instruction mnemonic suffix given and no register operands; using default for `sysret'
arch/x86/kernel/process.c:456: Warning: no instruction mnemonic suffix given and no register operands; using default for `btr'
arch/x86/kernel/process.c:456: Warning: no instruction mnemonic suffix given and no register operands; using default for `btr'
WARNING: vmlinux.o (.discard.nospec): unexpected non-allocatable section.
WARNING: vmlinux.o (.discard.retpoline_safe): unexpected non-allocatable section.
ld: arch/x86/boot/compressed/head_64.o: warning: relocation in read-only section `.head.text'
ld: warning: creating DT_TEXTREL in a PIE

--------------------------------------------------------------------------------
xcep_defconfig (arm, gcc-10) — PASS, 0 errors, 0 warnings, 0 section mismatches

--------------------------------------------------------------------------------
xilfpga_defconfig (mips, gcc-10) — PASS, 0 errors, 0 warnings, 0 section mismatches

--------------------------------------------------------------------------------
xway_defconfig (mips, gcc-10) — PASS, 0 errors, 0 warnings, 0 section mismatches

--------------------------------------------------------------------------------
zeus_defconfig (arm, gcc-10) — PASS, 0 errors, 0 warnings, 0 section mismatches

--------------------------------------------------------------------------------
zx_defconfig (arm, gcc-10) — PASS, 0 errors, 0 warnings, 0 section mismatches

---
For more info write to <info@...>


IRC meet-up today

Jan Kiszka
 

Hi all,

Being on a retreat, I missed the notification today and will not be able to run our regular meeting this time. Please organise yourself - and sorry for the late notice.

Jan

1 - 20 of 10169