Date   

cip-gitlab/ci/iwamatsu/linux-4.19.y-cip-rc baseline-nfs: 22 runs, 1 regressions (v4.19.256-cip80-1-g68250b8eafbe0) #kernelci

kernelci.org bot <bot@...>
 

cip-gitlab/ci/iwamatsu/linux-4.19.y-cip-rc baseline-nfs: 22 runs, 1 regressions (v4.19.256-cip80-1-g68250b8eafbe0)

Regressions Summary
-------------------

platform | arch | lab | compiler | defconfig | regressions
----------------------+-------+--------------+----------+-----------+------------
meson-gxm-khadas-vim2 | arm64 | lab-baylibre | gcc-10 | defconfig | 1

Details: https://kernelci.org/test/job/cip-gitlab/branch/ci%2Fiwamatsu%2Flinux-4.19.y-cip-rc/kernel/v4.19.256-cip80-1-g68250b8eafbe0/plan/baseline-nfs/

Test: baseline-nfs
Tree: cip-gitlab
Branch: ci/iwamatsu/linux-4.19.y-cip-rc
Describe: v4.19.256-cip80-1-g68250b8eafbe0
URL: https://gitlab.com/cip-project/cip-kernel/linux-cip.git
SHA: 68250b8eafbe07c581320a9a33cdfd6217030bb8


Test Regressions
----------------


platform | arch | lab | compiler | defconfig | regressions
----------------------+-------+--------------+----------+-----------+------------
meson-gxm-khadas-vim2 | arm64 | lab-baylibre | gcc-10 | defconfig | 1

Details: https://kernelci.org/test/plan/id/631040c908dba5e157355669

Results: 0 PASS, 1 FAIL, 0 SKIP
Full config: defconfig
Compiler: gcc-10 (aarch64-linux-gnu-gcc (Debian 10.2.1-6) 10.2.1 20210110)
Plain log: https://storage.kernelci.org//cip-gitlab/ci-iwamatsu-linux-4.19.y-cip-rc/v4.19.256-cip80-1-g68250b8eafbe0/arm64/defconfig/gcc-10/lab-baylibre/baseline-nfs-meson-gxm-khadas-vim2.txt
HTML log: https://storage.kernelci.org//cip-gitlab/ci-iwamatsu-linux-4.19.y-cip-rc/v4.19.256-cip80-1-g68250b8eafbe0/arm64/defconfig/gcc-10/lab-baylibre/baseline-nfs-meson-gxm-khadas-vim2.html
Rootfs: http://storage.kernelci.org/images/rootfs/debian/bullseye/20220826.0/arm64/initrd.cpio.gz


* baseline-nfs.login: https://kernelci.org/test/case/id/631040c908dba5e15735566a
failing since 20 days (last pass: v4.19.231-cip68-123-g92e3e7f3d4df, first fail: v4.19.252-cip78-146-g6acc38498265c)


cip-gitlab/ci/iwamatsu/linux-4.19.y-cip-rc baseline: 80 runs, 9 regressions (v4.19.256-cip80-1-g68250b8eafbe0) #kernelci

kernelci.org bot <bot@...>
 

cip-gitlab/ci/iwamatsu/linux-4.19.y-cip-rc baseline: 80 runs, 9 regressions (v4.19.256-cip80-1-g68250b8eafbe0)

Regressions Summary
-------------------

platform | arch | lab | compiler | defconfig | regressions
---------------------------+--------+---------------+----------+------------------------------+------------
hp-x360-14-G1-sona | x86_64 | lab-collabora | gcc-10 | x86_64_defcon...6-chromebook | 1
qemu_arm64-virt-gicv2 | arm64 | lab-broonie | gcc-10 | defconfig | 1
qemu_arm64-virt-gicv2 | arm64 | lab-collabora | gcc-10 | defconfig | 1
qemu_arm64-virt-gicv2-uefi | arm64 | lab-broonie | gcc-10 | defconfig | 1
qemu_arm64-virt-gicv2-uefi | arm64 | lab-collabora | gcc-10 | defconfig | 1
qemu_arm64-virt-gicv3 | arm64 | lab-broonie | gcc-10 | defconfig | 1
qemu_arm64-virt-gicv3 | arm64 | lab-collabora | gcc-10 | defconfig | 1
qemu_arm64-virt-gicv3-uefi | arm64 | lab-broonie | gcc-10 | defconfig | 1
qemu_arm64-virt-gicv3-uefi | arm64 | lab-collabora | gcc-10 | defconfig | 1

Details: https://kernelci.org/test/job/cip-gitlab/branch/ci%2Fiwamatsu%2Flinux-4.19.y-cip-rc/kernel/v4.19.256-cip80-1-g68250b8eafbe0/plan/baseline/

Test: baseline
Tree: cip-gitlab
Branch: ci/iwamatsu/linux-4.19.y-cip-rc
Describe: v4.19.256-cip80-1-g68250b8eafbe0
URL: https://gitlab.com/cip-project/cip-kernel/linux-cip.git
SHA: 68250b8eafbe07c581320a9a33cdfd6217030bb8


Test Regressions
----------------


platform | arch | lab | compiler | defconfig | regressions
---------------------------+--------+---------------+----------+------------------------------+------------
hp-x360-14-G1-sona | x86_64 | lab-collabora | gcc-10 | x86_64_defcon...6-chromebook | 1

Details: https://kernelci.org/test/plan/id/631040c4e64c1e9a6735564c

Results: 0 PASS, 1 FAIL, 0 SKIP
Full config: x86_64_defconfig+x86-chromebook
Compiler: gcc-10 (gcc (Debian 10.2.1-6) 10.2.1 20210110)
Plain log: https://storage.kernelci.org//cip-gitlab/ci-iwamatsu-linux-4.19.y-cip-rc/v4.19.256-cip80-1-g68250b8eafbe0/x86_64/x86_64_defconfig+x86-chromebook/gcc-10/lab-collabora/baseline-hp-x360-14-G1-sona.txt
HTML log: https://storage.kernelci.org//cip-gitlab/ci-iwamatsu-linux-4.19.y-cip-rc/v4.19.256-cip80-1-g68250b8eafbe0/x86_64/x86_64_defconfig+x86-chromebook/gcc-10/lab-collabora/baseline-hp-x360-14-G1-sona.html
Rootfs: http://storage.kernelci.org/images/rootfs/buildroot/buildroot-baseline/20220805.0/x86/rootfs.cpio.gz


* baseline.login: https://kernelci.org/test/case/id/631040c4e64c1e9a6735564d
new failure (last pass: v4.19.252-cip78-146-g6acc38498265c)



platform | arch | lab | compiler | defconfig | regressions
---------------------------+--------+---------------+----------+------------------------------+------------
qemu_arm64-virt-gicv2 | arm64 | lab-broonie | gcc-10 | defconfig | 1

Details: https://kernelci.org/test/plan/id/631040cfab0e22ffe9355658

Results: 0 PASS, 1 FAIL, 0 SKIP
Full config: defconfig
Compiler: gcc-10 (aarch64-linux-gnu-gcc (Debian 10.2.1-6) 10.2.1 20210110)
Plain log: https://storage.kernelci.org//cip-gitlab/ci-iwamatsu-linux-4.19.y-cip-rc/v4.19.256-cip80-1-g68250b8eafbe0/arm64/defconfig/gcc-10/lab-broonie/baseline-qemu_arm64-virt-gicv2.txt
HTML log: https://storage.kernelci.org//cip-gitlab/ci-iwamatsu-linux-4.19.y-cip-rc/v4.19.256-cip80-1-g68250b8eafbe0/arm64/defconfig/gcc-10/lab-broonie/baseline-qemu_arm64-virt-gicv2.html
Rootfs: http://storage.kernelci.org/images/rootfs/buildroot/buildroot-baseline/20220805.0/arm64/rootfs.cpio.gz


* baseline.login: https://kernelci.org/test/case/id/631040cfab0e22ffe9355659
failing since 105 days (last pass: v4.19.239-cip72-68-g407458469172, first fail: v4.19.242-cip73-50-gd57bc44cb340)



platform | arch | lab | compiler | defconfig | regressions
---------------------------+--------+---------------+----------+------------------------------+------------
qemu_arm64-virt-gicv2 | arm64 | lab-collabora | gcc-10 | defconfig | 1

Details: https://kernelci.org/test/plan/id/631040ba82e680ff0a355662

Results: 0 PASS, 1 FAIL, 0 SKIP
Full config: defconfig
Compiler: gcc-10 (aarch64-linux-gnu-gcc (Debian 10.2.1-6) 10.2.1 20210110)
Plain log: https://storage.kernelci.org//cip-gitlab/ci-iwamatsu-linux-4.19.y-cip-rc/v4.19.256-cip80-1-g68250b8eafbe0/arm64/defconfig/gcc-10/lab-collabora/baseline-qemu_arm64-virt-gicv2.txt
HTML log: https://storage.kernelci.org//cip-gitlab/ci-iwamatsu-linux-4.19.y-cip-rc/v4.19.256-cip80-1-g68250b8eafbe0/arm64/defconfig/gcc-10/lab-collabora/baseline-qemu_arm64-virt-gicv2.html
Rootfs: http://storage.kernelci.org/images/rootfs/buildroot/buildroot-baseline/20220805.0/arm64/rootfs.cpio.gz


* baseline.login: https://kernelci.org/test/case/id/631040ba82e680ff0a355663
failing since 105 days (last pass: v4.19.239-cip72-68-g407458469172, first fail: v4.19.242-cip73-50-gd57bc44cb340)



platform | arch | lab | compiler | defconfig | regressions
---------------------------+--------+---------------+----------+------------------------------+------------
qemu_arm64-virt-gicv2-uefi | arm64 | lab-broonie | gcc-10 | defconfig | 1

Details: https://kernelci.org/test/plan/id/6310410b87286099da355649

Results: 0 PASS, 1 FAIL, 0 SKIP
Full config: defconfig
Compiler: gcc-10 (aarch64-linux-gnu-gcc (Debian 10.2.1-6) 10.2.1 20210110)
Plain log: https://storage.kernelci.org//cip-gitlab/ci-iwamatsu-linux-4.19.y-cip-rc/v4.19.256-cip80-1-g68250b8eafbe0/arm64/defconfig/gcc-10/lab-broonie/baseline-qemu_arm64-virt-gicv2-uefi.txt
HTML log: https://storage.kernelci.org//cip-gitlab/ci-iwamatsu-linux-4.19.y-cip-rc/v4.19.256-cip80-1-g68250b8eafbe0/arm64/defconfig/gcc-10/lab-broonie/baseline-qemu_arm64-virt-gicv2-uefi.html
Rootfs: http://storage.kernelci.org/images/rootfs/buildroot/buildroot-baseline/20220805.0/arm64/rootfs.cpio.gz


* baseline.login: https://kernelci.org/test/case/id/6310410b87286099da35564a
failing since 105 days (last pass: v4.19.239-cip72-68-g407458469172, first fail: v4.19.242-cip73-50-gd57bc44cb340)



platform | arch | lab | compiler | defconfig | regressions
---------------------------+--------+---------------+----------+------------------------------+------------
qemu_arm64-virt-gicv2-uefi | arm64 | lab-collabora | gcc-10 | defconfig | 1

Details: https://kernelci.org/test/plan/id/631040cfe64c1e9a67355654

Results: 0 PASS, 1 FAIL, 0 SKIP
Full config: defconfig
Compiler: gcc-10 (aarch64-linux-gnu-gcc (Debian 10.2.1-6) 10.2.1 20210110)
Plain log: https://storage.kernelci.org//cip-gitlab/ci-iwamatsu-linux-4.19.y-cip-rc/v4.19.256-cip80-1-g68250b8eafbe0/arm64/defconfig/gcc-10/lab-collabora/baseline-qemu_arm64-virt-gicv2-uefi.txt
HTML log: https://storage.kernelci.org//cip-gitlab/ci-iwamatsu-linux-4.19.y-cip-rc/v4.19.256-cip80-1-g68250b8eafbe0/arm64/defconfig/gcc-10/lab-collabora/baseline-qemu_arm64-virt-gicv2-uefi.html
Rootfs: http://storage.kernelci.org/images/rootfs/buildroot/buildroot-baseline/20220805.0/arm64/rootfs.cpio.gz


* baseline.login: https://kernelci.org/test/case/id/631040cfe64c1e9a67355655
failing since 105 days (last pass: v4.19.239-cip72-68-g407458469172, first fail: v4.19.242-cip73-50-gd57bc44cb340)



platform | arch | lab | compiler | defconfig | regressions
---------------------------+--------+---------------+----------+------------------------------+------------
qemu_arm64-virt-gicv3 | arm64 | lab-broonie | gcc-10 | defconfig | 1

Details: https://kernelci.org/test/plan/id/631040f787286099da355642

Results: 0 PASS, 1 FAIL, 0 SKIP
Full config: defconfig
Compiler: gcc-10 (aarch64-linux-gnu-gcc (Debian 10.2.1-6) 10.2.1 20210110)
Plain log: https://storage.kernelci.org//cip-gitlab/ci-iwamatsu-linux-4.19.y-cip-rc/v4.19.256-cip80-1-g68250b8eafbe0/arm64/defconfig/gcc-10/lab-broonie/baseline-qemu_arm64-virt-gicv3.txt
HTML log: https://storage.kernelci.org//cip-gitlab/ci-iwamatsu-linux-4.19.y-cip-rc/v4.19.256-cip80-1-g68250b8eafbe0/arm64/defconfig/gcc-10/lab-broonie/baseline-qemu_arm64-virt-gicv3.html
Rootfs: http://storage.kernelci.org/images/rootfs/buildroot/buildroot-baseline/20220805.0/arm64/rootfs.cpio.gz


* baseline.login: https://kernelci.org/test/case/id/631040f787286099da355643
failing since 105 days (last pass: v4.19.239-cip72-68-g407458469172, first fail: v4.19.242-cip73-50-gd57bc44cb340)



platform | arch | lab | compiler | defconfig | regressions
---------------------------+--------+---------------+----------+------------------------------+------------
qemu_arm64-virt-gicv3 | arm64 | lab-collabora | gcc-10 | defconfig | 1

Details: https://kernelci.org/test/plan/id/631040c56bc01e0271355649

Results: 0 PASS, 1 FAIL, 0 SKIP
Full config: defconfig
Compiler: gcc-10 (aarch64-linux-gnu-gcc (Debian 10.2.1-6) 10.2.1 20210110)
Plain log: https://storage.kernelci.org//cip-gitlab/ci-iwamatsu-linux-4.19.y-cip-rc/v4.19.256-cip80-1-g68250b8eafbe0/arm64/defconfig/gcc-10/lab-collabora/baseline-qemu_arm64-virt-gicv3.txt
HTML log: https://storage.kernelci.org//cip-gitlab/ci-iwamatsu-linux-4.19.y-cip-rc/v4.19.256-cip80-1-g68250b8eafbe0/arm64/defconfig/gcc-10/lab-collabora/baseline-qemu_arm64-virt-gicv3.html
Rootfs: http://storage.kernelci.org/images/rootfs/buildroot/buildroot-baseline/20220805.0/arm64/rootfs.cpio.gz


* baseline.login: https://kernelci.org/test/case/id/631040c56bc01e027135564a
failing since 105 days (last pass: v4.19.239-cip72-68-g407458469172, first fail: v4.19.242-cip73-50-gd57bc44cb340)



platform | arch | lab | compiler | defconfig | regressions
---------------------------+--------+---------------+----------+------------------------------+------------
qemu_arm64-virt-gicv3-uefi | arm64 | lab-broonie | gcc-10 | defconfig | 1

Details: https://kernelci.org/test/plan/id/6310410c87286099da35564d

Results: 0 PASS, 1 FAIL, 0 SKIP
Full config: defconfig
Compiler: gcc-10 (aarch64-linux-gnu-gcc (Debian 10.2.1-6) 10.2.1 20210110)
Plain log: https://storage.kernelci.org//cip-gitlab/ci-iwamatsu-linux-4.19.y-cip-rc/v4.19.256-cip80-1-g68250b8eafbe0/arm64/defconfig/gcc-10/lab-broonie/baseline-qemu_arm64-virt-gicv3-uefi.txt
HTML log: https://storage.kernelci.org//cip-gitlab/ci-iwamatsu-linux-4.19.y-cip-rc/v4.19.256-cip80-1-g68250b8eafbe0/arm64/defconfig/gcc-10/lab-broonie/baseline-qemu_arm64-virt-gicv3-uefi.html
Rootfs: http://storage.kernelci.org/images/rootfs/buildroot/buildroot-baseline/20220805.0/arm64/rootfs.cpio.gz


* baseline.login: https://kernelci.org/test/case/id/6310410c87286099da35564e
failing since 105 days (last pass: v4.19.239-cip72-68-g407458469172, first fail: v4.19.242-cip73-50-gd57bc44cb340)



platform | arch | lab | compiler | defconfig | regressions
---------------------------+--------+---------------+----------+------------------------------+------------
qemu_arm64-virt-gicv3-uefi | arm64 | lab-collabora | gcc-10 | defconfig | 1

Details: https://kernelci.org/test/plan/id/631040c6e64c1e9a67355650

Results: 0 PASS, 1 FAIL, 0 SKIP
Full config: defconfig
Compiler: gcc-10 (aarch64-linux-gnu-gcc (Debian 10.2.1-6) 10.2.1 20210110)
Plain log: https://storage.kernelci.org//cip-gitlab/ci-iwamatsu-linux-4.19.y-cip-rc/v4.19.256-cip80-1-g68250b8eafbe0/arm64/defconfig/gcc-10/lab-collabora/baseline-qemu_arm64-virt-gicv3-uefi.txt
HTML log: https://storage.kernelci.org//cip-gitlab/ci-iwamatsu-linux-4.19.y-cip-rc/v4.19.256-cip80-1-g68250b8eafbe0/arm64/defconfig/gcc-10/lab-collabora/baseline-qemu_arm64-virt-gicv3-uefi.html
Rootfs: http://storage.kernelci.org/images/rootfs/buildroot/buildroot-baseline/20220805.0/arm64/rootfs.cpio.gz


* baseline.login: https://kernelci.org/test/case/id/631040c6e64c1e9a67355651
failing since 105 days (last pass: v4.19.239-cip72-68-g407458469172, first fail: v4.19.242-cip73-50-gd57bc44cb340)


cip-gitlab/ci/iwamatsu/linux-4.19.y-cip-rc build: 164 builds: 4 failed, 160 passed, 2 errors, 27 warnings (v4.19.256-cip80-1-g68250b8eafbe0) #kernelci

kernelci.org bot <bot@...>
 

cip-gitlab/ci/iwamatsu/linux-4.19.y-cip-rc build: 164 builds: 4 failed, 160 passed, 2 errors, 27 warnings (v4.19.256-cip80-1-g68250b8eafbe0)

Full Build Summary: https://kernelci.org/build/cip-gitlab/branch/ci%2Fiwamatsu%2Flinux-4.19.y-cip-rc/kernel/v4.19.256-cip80-1-g68250b8eafbe0/

Tree: cip-gitlab
Branch: ci/iwamatsu/linux-4.19.y-cip-rc
Git Describe: v4.19.256-cip80-1-g68250b8eafbe0
Git Commit: 68250b8eafbe07c581320a9a33cdfd6217030bb8
Git URL: https://gitlab.com/cip-project/cip-kernel/linux-cip.git
Built: 7 unique architectures

Build Failures Detected:

arm:
rpc_defconfig: (gcc-10) FAIL

mips:
ip27_defconfig: (gcc-10) FAIL
ip28_defconfig: (gcc-10) FAIL

riscv:
allnoconfig: (gcc-10) FAIL

Errors and Warnings Detected:

arc:

arm64:
defconfig (gcc-10): 3 warnings

arm:
rpc_defconfig (gcc-10): 2 errors

i386:
allnoconfig (gcc-10): 2 warnings
i386_defconfig (gcc-10): 2 warnings
tinyconfig (gcc-10): 2 warnings

mips:
loongson3_defconfig (gcc-10): 1 warning
malta_qemu_32r6_defconfig (gcc-10): 1 warning
mtx1_defconfig (gcc-10): 3 warnings
nlm_xlp_defconfig (gcc-10): 1 warning

riscv:

x86_64:
allnoconfig (gcc-10): 3 warnings
tinyconfig (gcc-10): 3 warnings
x86_64_defconfig (gcc-10): 3 warnings
x86_64_defconfig+x86-chromebook (gcc-10): 3 warnings

Errors summary:

1 arm-linux-gnueabihf-gcc: error: unrecognized -march target: armv3
1 arm-linux-gnueabihf-gcc: error: missing argument to ‘-march=’

Warnings summary:

7 ld: warning: creating DT_TEXTREL in a PIE
4 ld: arch/x86/boot/compressed/head_64.o: warning: relocation in read-only section `.head.text'
4 arch/x86/entry/entry_64.S:1738: Warning: no instruction mnemonic suffix given and no register operands; using default for `sysret'
3 ld: arch/x86/boot/compressed/head_32.o: warning: relocation in read-only section `.head.text'
3 aarch64-linux-gnu-ld: warning: -z norelro ignored
2 sound/pci/echoaudio/echoaudio_dsp.c:647:9: warning: iteration 1073741824 invokes undefined behavior [-Waggressive-loop-optimizations]
1 {standard input}:132: Warning: macro instruction expanded into multiple instructions
1 sound/pci/echoaudio/echoaudio_dsp.c:658:9: warning: iteration 1073741824 invokes undefined behavior [-Waggressive-loop-optimizations]
1 net/core/rtnetlink.c:3199:1: warning: the frame size of 1344 bytes is larger than 1024 bytes [-Wframe-larger-than=]
1 net/core/rtnetlink.c:3199:1: warning: the frame size of 1328 bytes is larger than 1024 bytes [-Wframe-larger-than=]

Section mismatches summary:

11 WARNING: modpost: Found 1 section mismatch(es).

================================================================================

Detailed per-defconfig build reports:

--------------------------------------------------------------------------------
acs5k_defconfig (arm, gcc-10) — PASS, 0 errors, 0 warnings, 0 section mismatches

--------------------------------------------------------------------------------
acs5k_tiny_defconfig (arm, gcc-10) — PASS, 0 errors, 0 warnings, 0 section mismatches

--------------------------------------------------------------------------------
allnoconfig (riscv, gcc-10) — FAIL, 0 errors, 0 warnings, 0 section mismatches

--------------------------------------------------------------------------------
allnoconfig (arc, gcc-10) — PASS, 0 errors, 0 warnings, 0 section mismatches

--------------------------------------------------------------------------------
allnoconfig (i386, gcc-10) — PASS, 0 errors, 2 warnings, 0 section mismatches

Warnings:
ld: arch/x86/boot/compressed/head_32.o: warning: relocation in read-only section `.head.text'
ld: warning: creating DT_TEXTREL in a PIE

--------------------------------------------------------------------------------
allnoconfig (x86_64, gcc-10) — PASS, 0 errors, 3 warnings, 0 section mismatches

Warnings:
arch/x86/entry/entry_64.S:1738: Warning: no instruction mnemonic suffix given and no register operands; using default for `sysret'
ld: arch/x86/boot/compressed/head_64.o: warning: relocation in read-only section `.head.text'
ld: warning: creating DT_TEXTREL in a PIE

--------------------------------------------------------------------------------
am200epdkit_defconfig (arm, gcc-10) — PASS, 0 errors, 0 warnings, 0 section mismatches

--------------------------------------------------------------------------------
ar7_defconfig (mips, gcc-10) — PASS, 0 errors, 0 warnings, 0 section mismatches

--------------------------------------------------------------------------------
aspeed_g5_defconfig (arm, gcc-10) — PASS, 0 errors, 0 warnings, 0 section mismatches

--------------------------------------------------------------------------------
assabet_defconfig (arm, gcc-10) — PASS, 0 errors, 0 warnings, 0 section mismatches

--------------------------------------------------------------------------------
at91_dt_defconfig (arm, gcc-10) — PASS, 0 errors, 0 warnings, 0 section mismatches

--------------------------------------------------------------------------------
ath25_defconfig (mips, gcc-10) — PASS, 0 errors, 0 warnings, 0 section mismatches

--------------------------------------------------------------------------------
axm55xx_defconfig (arm, gcc-10) — PASS, 0 errors, 0 warnings, 0 section mismatches

--------------------------------------------------------------------------------
axs103_defconfig (arc, gcc-10) — PASS, 0 errors, 0 warnings, 0 section mismatches

--------------------------------------------------------------------------------
axs103_smp_defconfig (arc, gcc-10) — PASS, 0 errors, 0 warnings, 0 section mismatches

--------------------------------------------------------------------------------
bcm2835_defconfig (arm, gcc-10) — PASS, 0 errors, 0 warnings, 0 section mismatches

--------------------------------------------------------------------------------
bcm47xx_defconfig (mips, gcc-10) — PASS, 0 errors, 0 warnings, 0 section mismatches

--------------------------------------------------------------------------------
bcm63xx_defconfig (mips, gcc-10) — PASS, 0 errors, 0 warnings, 0 section mismatches

--------------------------------------------------------------------------------
bigsur_defconfig (mips, gcc-10) — PASS, 0 errors, 0 warnings, 0 section mismatches

--------------------------------------------------------------------------------
bmips_be_defconfig (mips, gcc-10) — PASS, 0 errors, 0 warnings, 0 section mismatches

--------------------------------------------------------------------------------
bmips_stb_defconfig (mips, gcc-10) — PASS, 0 errors, 0 warnings, 0 section mismatches

--------------------------------------------------------------------------------
capcella_defconfig (mips, gcc-10) — PASS, 0 errors, 0 warnings, 0 section mismatches

--------------------------------------------------------------------------------
cavium_octeon_defconfig (mips, gcc-10) — PASS, 0 errors, 0 warnings, 0 section mismatches

--------------------------------------------------------------------------------
cerfcube_defconfig (arm, gcc-10) — PASS, 0 errors, 0 warnings, 0 section mismatches

--------------------------------------------------------------------------------
ci20_defconfig (mips, gcc-10) — PASS, 0 errors, 0 warnings, 0 section mismatches

--------------------------------------------------------------------------------
cm_x2xx_defconfig (arm, gcc-10) — PASS, 0 errors, 0 warnings, 0 section mismatches

--------------------------------------------------------------------------------
cm_x300_defconfig (arm, gcc-10) — PASS, 0 errors, 0 warnings, 0 section mismatches

--------------------------------------------------------------------------------
cobalt_defconfig (mips, gcc-10) — PASS, 0 errors, 0 warnings, 0 section mismatches

--------------------------------------------------------------------------------
colibri_pxa270_defconfig (arm, gcc-10) — PASS, 0 errors, 0 warnings, 0 section mismatches

--------------------------------------------------------------------------------
colibri_pxa300_defconfig (arm, gcc-10) — PASS, 0 errors, 0 warnings, 0 section mismatches

--------------------------------------------------------------------------------
collie_defconfig (arm, gcc-10) — PASS, 0 errors, 0 warnings, 0 section mismatches

--------------------------------------------------------------------------------
corgi_defconfig (arm, gcc-10) — PASS, 0 errors, 0 warnings, 0 section mismatches

--------------------------------------------------------------------------------
db1xxx_defconfig (mips, gcc-10) — PASS, 0 errors, 0 warnings, 0 section mismatches

--------------------------------------------------------------------------------
decstation_defconfig (mips, gcc-10) — PASS, 0 errors, 0 warnings, 0 section mismatches

--------------------------------------------------------------------------------
defconfig (arm64, gcc-10) — PASS, 0 errors, 3 warnings, 0 section mismatches

Warnings:
aarch64-linux-gnu-ld: warning: -z norelro ignored
aarch64-linux-gnu-ld: warning: -z norelro ignored
aarch64-linux-gnu-ld: warning: -z norelro ignored

Section mismatches:
WARNING: modpost: Found 1 section mismatch(es).

--------------------------------------------------------------------------------
dove_defconfig (arm, gcc-10) — PASS, 0 errors, 0 warnings, 0 section mismatches

--------------------------------------------------------------------------------
e55_defconfig (mips, gcc-10) — PASS, 0 errors, 0 warnings, 0 section mismatches

--------------------------------------------------------------------------------
ebsa110_defconfig (arm, gcc-10) — PASS, 0 errors, 0 warnings, 0 section mismatches

--------------------------------------------------------------------------------
efm32_defconfig (arm, gcc-10) — PASS, 0 errors, 0 warnings, 0 section mismatches

--------------------------------------------------------------------------------
em_x270_defconfig (arm, gcc-10) — PASS, 0 errors, 0 warnings, 0 section mismatches

--------------------------------------------------------------------------------
ep93xx_defconfig (arm, gcc-10) — PASS, 0 errors, 0 warnings, 0 section mismatches

Section mismatches:
WARNING: modpost: Found 1 section mismatch(es).

--------------------------------------------------------------------------------
eseries_pxa_defconfig (arm, gcc-10) — PASS, 0 errors, 0 warnings, 0 section mismatches

--------------------------------------------------------------------------------
exynos_defconfig (arm, gcc-10) — PASS, 0 errors, 0 warnings, 0 section mismatches

--------------------------------------------------------------------------------
ezx_defconfig (arm, gcc-10) — PASS, 0 errors, 0 warnings, 0 section mismatches

--------------------------------------------------------------------------------
footbridge_defconfig (arm, gcc-10) — PASS, 0 errors, 0 warnings, 0 section mismatches

--------------------------------------------------------------------------------
gcw0_defconfig (mips, gcc-10) — PASS, 0 errors, 0 warnings, 0 section mismatches

--------------------------------------------------------------------------------
gemini_defconfig (arm, gcc-10) — PASS, 0 errors, 0 warnings, 0 section mismatches

--------------------------------------------------------------------------------
gpr_defconfig (mips, gcc-10) — PASS, 0 errors, 0 warnings, 0 section mismatches

--------------------------------------------------------------------------------
h3600_defconfig (arm, gcc-10) — PASS, 0 errors, 0 warnings, 0 section mismatches

--------------------------------------------------------------------------------
h5000_defconfig (arm, gcc-10) — PASS, 0 errors, 0 warnings, 0 section mismatches

--------------------------------------------------------------------------------
hackkit_defconfig (arm, gcc-10) — PASS, 0 errors, 0 warnings, 0 section mismatches

--------------------------------------------------------------------------------
haps_hs_defconfig (arc, gcc-10) — PASS, 0 errors, 0 warnings, 0 section mismatches

--------------------------------------------------------------------------------
i386_defconfig (i386, gcc-10) — PASS, 0 errors, 2 warnings, 0 section mismatches

Warnings:
ld: arch/x86/boot/compressed/head_32.o: warning: relocation in read-only section `.head.text'
ld: warning: creating DT_TEXTREL in a PIE

--------------------------------------------------------------------------------
imote2_defconfig (arm, gcc-10) — PASS, 0 errors, 0 warnings, 0 section mismatches

--------------------------------------------------------------------------------
imx_v4_v5_defconfig (arm, gcc-10) — PASS, 0 errors, 0 warnings, 0 section mismatches

--------------------------------------------------------------------------------
integrator_defconfig (arm, gcc-10) — PASS, 0 errors, 0 warnings, 0 section mismatches

Section mismatches:
WARNING: modpost: Found 1 section mismatch(es).

--------------------------------------------------------------------------------
iop13xx_defconfig (arm, gcc-10) — PASS, 0 errors, 0 warnings, 0 section mismatches

--------------------------------------------------------------------------------
iop32x_defconfig (arm, gcc-10) — PASS, 0 errors, 0 warnings, 0 section mismatches

--------------------------------------------------------------------------------
iop33x_defconfig (arm, gcc-10) — PASS, 0 errors, 0 warnings, 0 section mismatches

--------------------------------------------------------------------------------
ip22_defconfig (mips, gcc-10) — PASS, 0 errors, 0 warnings, 0 section mismatches

--------------------------------------------------------------------------------
ip27_defconfig (mips, gcc-10) — FAIL, 0 errors, 0 warnings, 0 section mismatches

--------------------------------------------------------------------------------
ip28_defconfig (mips, gcc-10) — FAIL, 0 errors, 0 warnings, 0 section mismatches

--------------------------------------------------------------------------------
ip32_defconfig (mips, gcc-10) — PASS, 0 errors, 0 warnings, 0 section mismatches

--------------------------------------------------------------------------------
ixp4xx_defconfig (arm, gcc-10) — PASS, 0 errors, 0 warnings, 0 section mismatches

--------------------------------------------------------------------------------
jazz_defconfig (mips, gcc-10) — PASS, 0 errors, 0 warnings, 0 section mismatches

--------------------------------------------------------------------------------
jmr3927_defconfig (mips, gcc-10) — PASS, 0 errors, 0 warnings, 0 section mismatches

--------------------------------------------------------------------------------
jornada720_defconfig (arm, gcc-10) — PASS, 0 errors, 0 warnings, 0 section mismatches

--------------------------------------------------------------------------------
keystone_defconfig (arm, gcc-10) — PASS, 0 errors, 0 warnings, 0 section mismatches

--------------------------------------------------------------------------------
ks8695_defconfig (arm, gcc-10) — PASS, 0 errors, 0 warnings, 0 section mismatches

--------------------------------------------------------------------------------
lart_defconfig (arm, gcc-10) — PASS, 0 errors, 0 warnings, 0 section mismatches

--------------------------------------------------------------------------------
lasat_defconfig (mips, gcc-10) — PASS, 0 errors, 0 warnings, 0 section mismatches

--------------------------------------------------------------------------------
loongson1b_defconfig (mips, gcc-10) — PASS, 0 errors, 0 warnings, 0 section mismatches

--------------------------------------------------------------------------------
loongson1c_defconfig (mips, gcc-10) — PASS, 0 errors, 0 warnings, 0 section mismatches

--------------------------------------------------------------------------------
loongson3_defconfig (mips, gcc-10) — PASS, 0 errors, 1 warning, 0 section mismatches

Warnings:
net/core/rtnetlink.c:3199:1: warning: the frame size of 1328 bytes is larger than 1024 bytes [-Wframe-larger-than=]

--------------------------------------------------------------------------------
lpc18xx_defconfig (arm, gcc-10) — PASS, 0 errors, 0 warnings, 0 section mismatches

--------------------------------------------------------------------------------
lpd270_defconfig (arm, gcc-10) — PASS, 0 errors, 0 warnings, 0 section mismatches

--------------------------------------------------------------------------------
lubbock_defconfig (arm, gcc-10) — PASS, 0 errors, 0 warnings, 0 section mismatches

--------------------------------------------------------------------------------
magician_defconfig (arm, gcc-10) — PASS, 0 errors, 0 warnings, 0 section mismatches

--------------------------------------------------------------------------------
mainstone_defconfig (arm, gcc-10) — PASS, 0 errors, 0 warnings, 0 section mismatches

--------------------------------------------------------------------------------
malta_defconfig (mips, gcc-10) — PASS, 0 errors, 0 warnings, 0 section mismatches

--------------------------------------------------------------------------------
malta_kvm_defconfig (mips, gcc-10) — PASS, 0 errors, 0 warnings, 0 section mismatches

--------------------------------------------------------------------------------
malta_kvm_guest_defconfig (mips, gcc-10) — PASS, 0 errors, 0 warnings, 0 section mismatches

--------------------------------------------------------------------------------
malta_qemu_32r6_defconfig (mips, gcc-10) — PASS, 0 errors, 1 warning, 0 section mismatches

Warnings:
{standard input}:132: Warning: macro instruction expanded into multiple instructions

--------------------------------------------------------------------------------
maltaaprp_defconfig (mips, gcc-10) — PASS, 0 errors, 0 warnings, 0 section mismatches

--------------------------------------------------------------------------------
maltasmvp_defconfig (mips, gcc-10) — PASS, 0 errors, 0 warnings, 0 section mismatches

--------------------------------------------------------------------------------
maltaup_defconfig (mips, gcc-10) — PASS, 0 errors, 0 warnings, 0 section mismatches

--------------------------------------------------------------------------------
maltaup_xpa_defconfig (mips, gcc-10) — PASS, 0 errors, 0 warnings, 0 section mismatches

--------------------------------------------------------------------------------
markeins_defconfig (mips, gcc-10) — PASS, 0 errors, 0 warnings, 0 section mismatches

--------------------------------------------------------------------------------
mini2440_defconfig (arm, gcc-10) — PASS, 0 errors, 0 warnings, 0 section mismatches

--------------------------------------------------------------------------------
mmp2_defconfig (arm, gcc-10) — PASS, 0 errors, 0 warnings, 0 section mismatches

--------------------------------------------------------------------------------
moxart_defconfig (arm, gcc-10) — PASS, 0 errors, 0 warnings, 0 section mismatches

--------------------------------------------------------------------------------
mpc30x_defconfig (mips, gcc-10) — PASS, 0 errors, 0 warnings, 0 section mismatches

--------------------------------------------------------------------------------
msp71xx_defconfig (mips, gcc-10) — PASS, 0 errors, 0 warnings, 0 section mismatches

--------------------------------------------------------------------------------
mtx1_defconfig (mips, gcc-10) — PASS, 0 errors, 3 warnings, 0 section mismatches

Warnings:
sound/pci/echoaudio/echoaudio_dsp.c:647:9: warning: iteration 1073741824 invokes undefined behavior [-Waggressive-loop-optimizations]
sound/pci/echoaudio/echoaudio_dsp.c:658:9: warning: iteration 1073741824 invokes undefined behavior [-Waggressive-loop-optimizations]
sound/pci/echoaudio/echoaudio_dsp.c:647:9: warning: iteration 1073741824 invokes undefined behavior [-Waggressive-loop-optimizations]

--------------------------------------------------------------------------------
multi_v4t_defconfig (arm, gcc-10) — PASS, 0 errors, 0 warnings, 0 section mismatches

--------------------------------------------------------------------------------
multi_v5_defconfig (arm, gcc-10) — PASS, 0 errors, 0 warnings, 0 section mismatches

Section mismatches:
WARNING: modpost: Found 1 section mismatch(es).

--------------------------------------------------------------------------------
multi_v7_defconfig (arm, gcc-10) — PASS, 0 errors, 0 warnings, 0 section mismatches

--------------------------------------------------------------------------------
mvebu_v5_defconfig (arm, gcc-10) — PASS, 0 errors, 0 warnings, 0 section mismatches

--------------------------------------------------------------------------------
mvebu_v7_defconfig (arm, gcc-10) — PASS, 0 errors, 0 warnings, 0 section mismatches

--------------------------------------------------------------------------------
mxs_defconfig (arm, gcc-10) — PASS, 0 errors, 0 warnings, 0 section mismatches

--------------------------------------------------------------------------------
netwinder_defconfig (arm, gcc-10) — PASS, 0 errors, 0 warnings, 0 section mismatches

--------------------------------------------------------------------------------
nhk8815_defconfig (arm, gcc-10) — PASS, 0 errors, 0 warnings, 0 section mismatches

Section mismatches:
WARNING: modpost: Found 1 section mismatch(es).

--------------------------------------------------------------------------------
nlm_xlp_defconfig (mips, gcc-10) — PASS, 0 errors, 1 warning, 0 section mismatches

Warnings:
net/core/rtnetlink.c:3199:1: warning: the frame size of 1344 bytes is larger than 1024 bytes [-Wframe-larger-than=]

--------------------------------------------------------------------------------
nlm_xlr_defconfig (mips, gcc-10) — PASS, 0 errors, 0 warnings, 0 section mismatches

--------------------------------------------------------------------------------
nsim_hs_defconfig (arc, gcc-10) — PASS, 0 errors, 0 warnings, 0 section mismatches

--------------------------------------------------------------------------------
nsim_hs_smp_defconfig (arc, gcc-10) — PASS, 0 errors, 0 warnings, 0 section mismatches

--------------------------------------------------------------------------------
nsimosci_hs_smp_defconfig (arc, gcc-10) — PASS, 0 errors, 0 warnings, 0 section mismatches

--------------------------------------------------------------------------------
nuc910_defconfig (arm, gcc-10) — PASS, 0 errors, 0 warnings, 0 section mismatches

--------------------------------------------------------------------------------
nuc950_defconfig (arm, gcc-10) — PASS, 0 errors, 0 warnings, 0 section mismatches

--------------------------------------------------------------------------------
nuc960_defconfig (arm, gcc-10) — PASS, 0 errors, 0 warnings, 0 section mismatches

--------------------------------------------------------------------------------
orion5x_defconfig (arm, gcc-10) — PASS, 0 errors, 0 warnings, 0 section mismatches

--------------------------------------------------------------------------------
oxnas_v6_defconfig (arm, gcc-10) — PASS, 0 errors, 0 warnings, 0 section mismatches

--------------------------------------------------------------------------------
palmz72_defconfig (arm, gcc-10) — PASS, 0 errors, 0 warnings, 0 section mismatches

--------------------------------------------------------------------------------
pcm027_defconfig (arm, gcc-10) — PASS, 0 errors, 0 warnings, 0 section mismatches

--------------------------------------------------------------------------------
pleb_defconfig (arm, gcc-10) — PASS, 0 errors, 0 warnings, 0 section mismatches

--------------------------------------------------------------------------------
pnx8335_stb225_defconfig (mips, gcc-10) — PASS, 0 errors, 0 warnings, 0 section mismatches

--------------------------------------------------------------------------------
prima2_defconfig (arm, gcc-10) — PASS, 0 errors, 0 warnings, 0 section mismatches

--------------------------------------------------------------------------------
pxa3xx_defconfig (arm, gcc-10) — PASS, 0 errors, 0 warnings, 0 section mismatches

--------------------------------------------------------------------------------
pxa910_defconfig (arm, gcc-10) — PASS, 0 errors, 0 warnings, 0 section mismatches

--------------------------------------------------------------------------------
pxa_defconfig (arm, gcc-10) — PASS, 0 errors, 0 warnings, 0 section mismatches

--------------------------------------------------------------------------------
qcom_defconfig (arm, gcc-10) — PASS, 0 errors, 0 warnings, 0 section mismatches

--------------------------------------------------------------------------------
qi_lb60_defconfig (mips, gcc-10) — PASS, 0 errors, 0 warnings, 0 section mismatches

--------------------------------------------------------------------------------
raumfeld_defconfig (arm, gcc-10) — PASS, 0 errors, 0 warnings, 0 section mismatches

--------------------------------------------------------------------------------
rb532_defconfig (mips, gcc-10) — PASS, 0 errors, 0 warnings, 0 section mismatches

--------------------------------------------------------------------------------
realview_defconfig (arm, gcc-10) — PASS, 0 errors, 0 warnings, 0 section mismatches

--------------------------------------------------------------------------------
rm200_defconfig (mips, gcc-10) — PASS, 0 errors, 0 warnings, 0 section mismatches

--------------------------------------------------------------------------------
rpc_defconfig (arm, gcc-10) — FAIL, 2 errors, 0 warnings, 0 section mismatches

Errors:
arm-linux-gnueabihf-gcc: error: unrecognized -march target: armv3
arm-linux-gnueabihf-gcc: error: missing argument to ‘-march=’

--------------------------------------------------------------------------------
rt305x_defconfig (mips, gcc-10) — PASS, 0 errors, 0 warnings, 0 section mismatches

--------------------------------------------------------------------------------
s3c6400_defconfig (arm, gcc-10) — PASS, 0 errors, 0 warnings, 0 section mismatches

Section mismatches:
WARNING: modpost: Found 1 section mismatch(es).

--------------------------------------------------------------------------------
s5pv210_defconfig (arm, gcc-10) — PASS, 0 errors, 0 warnings, 0 section mismatches

Section mismatches:
WARNING: modpost: Found 1 section mismatch(es).

--------------------------------------------------------------------------------
shannon_defconfig (arm, gcc-10) — PASS, 0 errors, 0 warnings, 0 section mismatches

--------------------------------------------------------------------------------
shmobile_defconfig (arm, gcc-10) — PASS, 0 errors, 0 warnings, 0 section mismatches

--------------------------------------------------------------------------------
simpad_defconfig (arm, gcc-10) — PASS, 0 errors, 0 warnings, 0 section mismatches

--------------------------------------------------------------------------------
socfpga_defconfig (arm, gcc-10) — PASS, 0 errors, 0 warnings, 0 section mismatches

--------------------------------------------------------------------------------
spear13xx_defconfig (arm, gcc-10) — PASS, 0 errors, 0 warnings, 0 section mismatches

--------------------------------------------------------------------------------
spear3xx_defconfig (arm, gcc-10) — PASS, 0 errors, 0 warnings, 0 section mismatches

Section mismatches:
WARNING: modpost: Found 1 section mismatch(es).

--------------------------------------------------------------------------------
spear6xx_defconfig (arm, gcc-10) — PASS, 0 errors, 0 warnings, 0 section mismatches

Section mismatches:
WARNING: modpost: Found 1 section mismatch(es).

--------------------------------------------------------------------------------
spitz_defconfig (arm, gcc-10) — PASS, 0 errors, 0 warnings, 0 section mismatches

--------------------------------------------------------------------------------
stm32_defconfig (arm, gcc-10) — PASS, 0 errors, 0 warnings, 0 section mismatches

--------------------------------------------------------------------------------
sunxi_defconfig (arm, gcc-10) — PASS, 0 errors, 0 warnings, 0 section mismatches

--------------------------------------------------------------------------------
tango4_defconfig (arm, gcc-10) — PASS, 0 errors, 0 warnings, 0 section mismatches

--------------------------------------------------------------------------------
tb0219_defconfig (mips, gcc-10) — PASS, 0 errors, 0 warnings, 0 section mismatches

--------------------------------------------------------------------------------
tb0287_defconfig (mips, gcc-10) — PASS, 0 errors, 0 warnings, 0 section mismatches

--------------------------------------------------------------------------------
tct_hammer_defconfig (arm, gcc-10) — PASS, 0 errors, 0 warnings, 0 section mismatches

--------------------------------------------------------------------------------
tegra_defconfig (arm, gcc-10) — PASS, 0 errors, 0 warnings, 0 section mismatches

--------------------------------------------------------------------------------
tinyconfig (i386, gcc-10) — PASS, 0 errors, 2 warnings, 0 section mismatches

Warnings:
ld: arch/x86/boot/compressed/head_32.o: warning: relocation in read-only section `.head.text'
ld: warning: creating DT_TEXTREL in a PIE

--------------------------------------------------------------------------------
tinyconfig (arc, gcc-10) — PASS, 0 errors, 0 warnings, 0 section mismatches

--------------------------------------------------------------------------------
tinyconfig (x86_64, gcc-10) — PASS, 0 errors, 3 warnings, 0 section mismatches

Warnings:
arch/x86/entry/entry_64.S:1738: Warning: no instruction mnemonic suffix given and no register operands; using default for `sysret'
ld: arch/x86/boot/compressed/head_64.o: warning: relocation in read-only section `.head.text'
ld: warning: creating DT_TEXTREL in a PIE

--------------------------------------------------------------------------------
trizeps4_defconfig (arm, gcc-10) — PASS, 0 errors, 0 warnings, 0 section mismatches

--------------------------------------------------------------------------------
u300_defconfig (arm, gcc-10) — PASS, 0 errors, 0 warnings, 0 section mismatches

Section mismatches:
WARNING: modpost: Found 1 section mismatch(es).

--------------------------------------------------------------------------------
u8500_defconfig (arm, gcc-10) — PASS, 0 errors, 0 warnings, 0 section mismatches

--------------------------------------------------------------------------------
vdk_hs38_defconfig (arc, gcc-10) — PASS, 0 errors, 0 warnings, 0 section mismatches

--------------------------------------------------------------------------------
vdk_hs38_smp_defconfig (arc, gcc-10) — PASS, 0 errors, 0 warnings, 0 section mismatches

--------------------------------------------------------------------------------
versatile_defconfig (arm, gcc-10) — PASS, 0 errors, 0 warnings, 0 section mismatches

Section mismatches:
WARNING: modpost: Found 1 section mismatch(es).

--------------------------------------------------------------------------------
vexpress_defconfig (arm, gcc-10) — PASS, 0 errors, 0 warnings, 0 section mismatches

--------------------------------------------------------------------------------
vf610m4_defconfig (arm, gcc-10) — PASS, 0 errors, 0 warnings, 0 section mismatches

--------------------------------------------------------------------------------
viper_defconfig (arm, gcc-10) — PASS, 0 errors, 0 warnings, 0 section mismatches

--------------------------------------------------------------------------------
vocore2_defconfig (mips, gcc-10) — PASS, 0 errors, 0 warnings, 0 section mismatches

--------------------------------------------------------------------------------
vt8500_v6_v7_defconfig (arm, gcc-10) — PASS, 0 errors, 0 warnings, 0 section mismatches

--------------------------------------------------------------------------------
workpad_defconfig (mips, gcc-10) — PASS, 0 errors, 0 warnings, 0 section mismatches

--------------------------------------------------------------------------------
x86_64_defconfig (x86_64, gcc-10) — PASS, 0 errors, 3 warnings, 0 section mismatches

Warnings:
arch/x86/entry/entry_64.S:1738: Warning: no instruction mnemonic suffix given and no register operands; using default for `sysret'
ld: arch/x86/boot/compressed/head_64.o: warning: relocation in read-only section `.head.text'
ld: warning: creating DT_TEXTREL in a PIE

--------------------------------------------------------------------------------
x86_64_defconfig+x86-chromebook (x86_64, gcc-10) — PASS, 0 errors, 3 warnings, 0 section mismatches

Warnings:
arch/x86/entry/entry_64.S:1738: Warning: no instruction mnemonic suffix given and no register operands; using default for `sysret'
ld: arch/x86/boot/compressed/head_64.o: warning: relocation in read-only section `.head.text'
ld: warning: creating DT_TEXTREL in a PIE

--------------------------------------------------------------------------------
zeus_defconfig (arm, gcc-10) — PASS, 0 errors, 0 warnings, 0 section mismatches

--------------------------------------------------------------------------------
zx_defconfig (arm, gcc-10) — PASS, 0 errors, 0 warnings, 0 section mismatches

---
For more info write to <info@...>


Re: [PATCH 4.19.y-cip] drm: rcar-du: Fix Alpha blending issue on Gen3

Nobuhiro Iwamatsu
 

Hi,

-----Original Message-----
From: Biju Das <biju.das.jz@...>
Sent: Wednesday, August 31, 2022 12:00 AM
To: cip-dev@...; iwamatsu nobuhiro(岩松 信洋 □SWC◯A
CT) <nobuhiro1.iwamatsu@...>; Pavel Machek
<pavel@...>
Cc: Chris Paterson <chris.paterson2@...>; Biju Das
<biju.das.jz@...>; Prabhakar Mahadev Lad
<prabhakar.mahadev-lad.rj@...>
Subject: [PATCH 4.19.y-cip] drm: rcar-du: Fix Alpha blending issue on Gen3

From: LUU HOAI <hoai.luu.ub@...>

commit b7aaa61726cbc7b941007af14a9f991a828c67e4 upstream.

As per R-Car-Gen3_Common_OPC_Customer_Notifications_V30.1.pdf,
unexpected image output(such as incorrect colors or planes being
invisible) can happen on the below conditions, as PnALPHAR register is not
initialized by reset.

When alpha blending (PpMRm.PpSPIM=0b101) is performed and:
•two Planes are enabled on any DUn (n=0,1,2,3)
oDSPRn= 0x0000 0031 or 0x0000 0013
•or DU0 and DU1 is used for display at the same time
oDSPR0= 0x0000 0001 and DSPR1= 0x0000 0003
oDSPR0= 0x0000 0003 and DSPR1= 0x0000 0001
•or DU2 and DU3(H3 Only) is used for display at the same time
oDSPR2= 0x0000 0001 and DSPR3= 0x0000 0003
oDSPR2= 0x0000 0003 and DSPR3= 0x0000 0001

This patch set PnALPHAR register to 0 to avoid this issue.

Signed-off-by: LUU HOAI <hoai.luu.ub@...>
Signed-off-by: Biju Das <biju.das.jz@...>
Reviewed-by: Laurent Pinchart <laurent.pinchart@...>
Signed-off-by: Laurent Pinchart
<laurent.pinchart+renesas@...>
Signed-off-by: Biju Das <biju.das.jz@...>
---
drivers/gpu/drm/rcar-du/rcar_du_plane.c | 12 ++++++++++++
1 file changed, 12 insertions(+)
Looks good to me this patch.
If there are no other comments and test is ok, I can apply.
Test: https://gitlab.com/cip-project/cip-kernel/linux-cip/-/pipelines/628213608

Best regards,
Nobuhiro


New CVE entries this week

Masami Ichikawa
 

Hi !

It's this week's CVE report.

This week reported 11 new CVEs and 7 updated CVEs.

* New CVEs

CVE-2022-2905: bpf: Don''t use tnum_range on array range checking for
poke descriptors

CVSS v3 score is not assigned.

A slab-out-of-bound read bug was found in the bpf subsystem. This bug
was introduced by commit d2e4c1e6c294 ("bpf: Constant map key tracking
forprog array pokes") was merged in 5.5-rc1.
This commit is not backported to 4.4, 4.9, 4.14, 4.19, and 5.4 kernels
so these kernels aren't affected.

Fixed status
mainline: [a657182a5c5150cdfacb6640aad1d2712571a409]
stable/5.10: [e8979807178434db8ceaa84dfcd44363e71e50bb]
stable/5.15: [4f672112f8665102a5842c170be1713f8ff95919]
stable/5.19: [a36df92c7ff7ecde2fb362241d0ab024dddd0597]

CVE-2022-2959: Linux Kernel Watch Queue Race Condition Privilege
Escalation Vulnerability

CVSS v3 score is not assigned.

A race condition bug was found in the watch queue feature due to a
missing lock in pip_resize_ring(). This bug allows an attacker to
escalate their privilege.

This bug was introduced by commit c73be61 ("pipe: Add general
notification queue support") that was merged in 5.8-rc1. The general
notification queue support isn't supported on 4.4, 4.14, 4.14, and
5.4.

Fixed status
mainline: [189b0ddc245139af81198d1a3637cac74f96e13a]

CVE-2022-2964: kernel: memory corruption in AX88179_178A based USB
ethernet device.

CVSS v3 score is not assigned.

An out-of-bound access vulnerability was found in linux kernel driver
for AX88179_178A based USB ethernet device.
The ax88179_rx_fixup() contains several out-of-bound access bugs. It
probably has out-of-bound write bug.

This bug was introduced by commit e2ca90c ("ax88179_178a: ASIX
AX88179_178A USB 3.0/2.0 to gigabit ethernet adapter driver") which
was merged in 3.9-rc2.

Fixed status

CVE-2022-2977: kernel: use-after-free Read in put_device (/dev/vtpmx)

CVSS v3 score is not assigned.

A flaw was found in the kernel's implementation of proxied virtualized
TPM devices.

Commit 7e0438f8 ("tpm: fix reference counting for struct tpm_chip")
fixes following commits.

- fdc915f ("tpm: expose spaces via a device link /dev/tpmrm<n>")
- 8979b02 ("tpm: Fix reference count to main device")

Commit fdc915f and 8979b02 were merged in 4.12-rc1. Kernel 4.4 and 4.9
do not contain these commits.

Fixed status
mainline: [7e0438f83dc769465ee663bb5dcf8cc154940712]

CVE-2022-2991: kernel: heap-based overflow in LightNVM Subsystem may
lead to privilege escalation

CVSS v3 score is not assigned.

A heap-based buffer overflow was found in the Linux kernel's LightNVM
subsystem that an attacker will be able to escalate privileges.

The lightnvm subsystem was removed by commit 9ea9b9 ("remove the
lightnvm subsystem") in 5.15-rc1.
This fix disables CONFIG_NVM by default.

cip-kernel-config/4.4.y-cip-rt/x86/siemens_i386-rt.config enables CONFIG_NVM.

Fixed status
mainline: [9ea9b9c48387edc101d56349492ad9c0492ff78d]
stable/4.14: [a9ae9dc21233d3dbe165f5e3e33df3c8bf3c35d0]
stable/4.19: [455431805699e91c2fd66b7fe43db27643d9b3fd]
stable/4.9: [08cf860b84ff15d405f62d6d23ba3b7d194abb2e]
stable/5.10: [549209caabc89f2877ad5f62d11fca5c052e0e8f]
stable/5.4: [b2589647008f8086582055414bb914088bca4c78]

CVE-2022-XXXX: KVM instruction emulation doesn't clear
KVM_VCPU_PREEMPTED, breaking guest's TLB flushing

CVE ID hasn't been assigned yet.
CVSS v3 score is not assigned.

YAML file is CVE-2022-KVM_VCPU_PREEMPTED-guest-TLB-flush.yml.

The KVM_FEATURE_PV_TLB_FLUSH feature was introduced by commit 858a43a
("KVM: X86: use paravirtualized TLB Shootdown") was merged in
4.16-rc1. Therefore, 4.4, 4.9, and 4.14 are not affected.

This vulnerability is affected by x86/x86_64 architectures.

There is a flaw in TLB flush feature in KVM subsystem that an
unprivileged userspace inside a guest to compromise the guest kernel.

Fixed status
mainline: [6cd88243c7e03845a450795e134b488fc2afb736]
stable/5.15: [92343314d34e04da0923cefd3be67521d706fa35]

CVE-2022-XXXX: CVE-2022-race-VM_PFNMAP-stale-TLB-entry

CVE ID hasn't been assigned yet.
CVSS v3 score is not assigned.

YAML file is CVE-2022-race-VM_PFNMAP-stale-TLB-entry.yml.

A race between munmap() and unmap_mapping_range(), this will cause TLB
entries isn't flushed.

Fixed status
mainline: [b67fbebd4cf980aecbcc750e1462128bffe8ae15]

CVE-2022-21385: A flaw in net_rds_alloc_sgs() in Oracle Linux kernels
allows unprivileged local users to crash the machine.

CVSS V3 Score: 4.6 MEDIUM

A redundant copy_from_user() call will cause an unprivileged user crash machine.
Commit ea010070 ("net/rds: fix warn in rds_message_alloc_sgs") fixed
this bug. This commit was merged in 4.20.

Fixed status
mainline: [ea010070d0a7497253d5a6f919f6dd107450b31a]
stable/4.19: [5be4bb315de29ad3ae558a8f6b92f13a1b4bfb84]

CVE-2022-2663: netfilter: nf_conntrack_irc: Tighten matching on DCC message

CVSS v3 score is not assigned.

A bug in nf_conntrack_irc() that mishandles a message causes a
firewall may be able to be bypassed when users are using unencrypted
IRC with nf_conntrack_irc configured.

Fixed status
Patch is available in
https://lore.kernel.org/netfilter-devel/20220826045658.100360-1-dgl@dgl.cx/T/
but it hasn't been merged yet.

CVE-2022-3028: af_key: Do not call xfrm_probe_algs in parallel

A race condition bug was found in the XFRM subsystem when multiple
calls to xfrm_probe_algs occurred simultaneously.
This condition will cause out-of-bound write or out-of-bound read.

CVSS v3 score is not assigned.

Fixed status
mainline: [ba953a9d89a00c078b85f4b190bc1dde66fe16b5]
stable/5.10: [c5c4d4c9806dadac7bc82f9c29ef4e1b78894775]
stable/5.15: [103bd319c0fc90f1cb013c3a508615e6df8af823]
stable/5.19: [6901885656c029c976498290b52f67f2c251e6a0]

CVE-2022-3061: video: fbdev: i740fb: Error out if ''pixclock'' equals zero

CVSS v3 score is not assigned.

If a userspace application pass zero as pixclock value via ioctl, it
causes a divided zero error.

Fixed status
mainline: [15cf0b82271b1823fb02ab8c377badba614d95d5]

* Updated CVEs

CVE-2021-4159: bpf: Verifer, adjust_scalar_min_max_vals to always call
update_reg_bounds()

4.19 was fixed this week.

Fixed status
mainline: [294f2fc6da27620a506e6c050241655459ccd6bd]
stable/4.19: [6c6b84ef5ea8dc0ca3559ccf69810960e348c555]
stable/5.4: [7c1134c7da997523e2834dd516e2ddc51920699a]

CVE-2022-1679: Use-After-Free in ath9k_htc_probe_device() could cause
an escalation of privileges

4.14, 4.19, and 5.4 were fixed this week.

Fixed status
mainline: [0ac4827f78c7ffe8eef074bc010e7e34bc22f533]
stable/4.14: [62bc1ea5c7401d77eaf73d0c6a15f3d2e742856e]
stable/4.19: [ab7a0ddf5f1cdec63cb21840369873806fc36d80]
stable/5.10: [eccd7c3e2596b574241a7670b5b53f5322f470e5]
stable/5.15: [03ca957c5f7b55660957eda20b5db4110319ac7a]
stable/5.19: [b66ebac40f64336ae2d053883bee85261060bd27]
stable/5.4: [e9e21206b8ea62220b486310c61277e7ebfe7cec]

CVE-2022-2153: KVM: NULL pointer dereference in kvm_irq_delivery_to_apic_fast()

Added fixed commit to 4.14, 5.10, and 5.4.
Added 5cde0b9 and b8127a0 to 4.19.

Fixed status
mainline: [7ec37d1cbe17d8189d9562178d8b29167fe1c31a,
00b5f37189d24ac3ed46cb7f11742094778c46ce,
b1e34d325397a33d97d845e312d7cf2a8b646b44]
stable/4.14: [a4bd692a950ada6d9757dbb78a6aea129ff8a943,
bcf0a450fbaabe7e14d71f885525805b4f86e855,
3362843aa71898fc2850a90950debcef2897dd60]
stable/4.19: [2f4835b5188f3b73b2b048a761ae2553e845b027,
5cde0b9cc69fcbbf559674986c2d325ae4708036,
b8127a0fd21d70ab42d8177f8bb97df74f503cc1]
stable/4.9: [95d51d058680766130098287f680474bc55f1679]
stable/5.10: [09c771c45c1243e295470225aaee726693fdc242,
ac7de8c2ba1292856fdd4a4c0764669b9607cf0a,
4c85e207c1b58249ea521670df577324ad69442c]
stable/5.15: [569a229142e95610adc1041ae9ca1f417c4c6a3e,
0e5dbc0540baa89faf4c04ccc7e9c4fe6b1d7bf4,
ba6e8c2df52047a32953588b49d9addbd843a098]
stable/5.4: [8fb5e77604442926db8b779fa590af7709d754e9,
8cdba919acefdd6fea5dd2b77a119f54fb88ce11,
9e24d03dd4fee589da500861967d9fd9c0e6276d]

CVE-2022-2586: Linux kernel nf_tables cross-table reference UAF

4.19 and 5.4 were fixed.

Fixed status
mainline: [470ee20e069a6d05ae549f7d0ef2bdbcee6a81b2]
stable/4.19: [77d3b5038b7462318f5183e2ad704b01d57215a2]
stable/5.10: [1a4b18b1ff11ba26f9a852019d674fde9d1d1cff]
stable/5.15: [faafd9286f1355c76fe9ac3021c280297213330e]
stable/5.18: [f4fa03410f7c5f5bd8f90e9c11e9a8c4b526ff6f]
stable/5.19: [0d07039397527361850c554c192e749cfc879ea9]
stable/5.4: [fab2f61cc3b0e441b1749f017cfee75f9bbaded7]

CVE-2022-2588: Linux kernel cls_route UAF

Added fixed commit to 4.14, 4.19, 4.9, and 5.4.

Fixed status
mainline: [9ad36309e2719a884f946678e0296be10f0bb4c1]
stable/4.14: [d0cce31f328fa10e7256f314e6e044e13cdf6814]
stable/4.19: [73584dab72d0a826f286a45544305819b58f7b92]
stable/4.9: [34a475425612bef345634202dda8dac91820b6c8]
stable/5.10: [7018f03d97daf344e49b16200caf4363a1407cab]
stable/5.15: [57bbb691a93bd39d0644c5c879b354232d0e0eed]
stable/5.18: [e832c26e7edfa2ddbd2dcdd48016d13d747de6da]
stable/5.19: [ee3f18d90e80e79449d575fa3e7a6b775e9fc35e]
stable/5.4: [1fcd691cc2e7f808eca2e644adee1f1c6c1527fd]

CVE-2022-36946: kernel panic when sending nf_queue verdict with 1-byte
nfta_payload attribute

Added fixed commit to 4.14 and 4.9.

Fixed status
stable/4.14: [83636c64b796a7e44fa72f371777f803c1ef9e74]
stable/4.19: [f295d365b30626f82423a923695274024016380e]
stable/4.9: [3b3e2de462323d5fdeb85a3682334a4a3dd07400]
stable/5.10: [440dccd80f627e0e11ceb0429e4cdab61857d17e]
stable/5.15: [91c11008aab0282957b8b8ccb0707d90e74cc3b9]
stable/5.18: [883c20911d6261fc651820b63a77327b8c020264]
stable/5.4: [52be29e8b6455788a4d0f501bd87aa679ca3ba3c]

CVE-2022-2590: mm/gup: fix FOLL_FORCE COW security issue and remove FOLL_COW

The mainline and 5.19 were fixed. This bug was introduced in 5.16 so
that less than 5.16 kernels aren't affected.

Fixed status
mainline: [5535be3099717646781ce1540cf725965d680e7b]
stable/5.19: [9def52eb10baab3b700858003d462fcf17d62873]

Currently tracking CVEs

CVE-2021-31615: Unencrypted Bluetooth Low Energy baseband links in
Bluetooth Core Specifications 4.0 through 5.2

There is no fix information.

CVE-2020-26556: kernel: malleable commitment Bluetooth Mesh Provisioning

No fix information.

CVE-2020-26557: kernel: predictable Authvalue in Bluetooth Mesh
Provisioning Leads to MITM

No fix information.

CVE-2020-26559: kernel: Authvalue leak in Bluetooth Mesh Provisioning

No fix information.

CVE-2020-26560: kernel: impersonation attack in Bluetooth Mesh Provisioning

No fix information.

Regards,
--
Masami Ichikawa
Cybertrust Japan Co., Ltd.

Email :masami.ichikawa@...
:masami.ichikawa@...


Re: [PATCH 5.10.y-cip] drm: rcar-du: Fix Alpha blending issue on Gen3

Nobuhiro Iwamatsu
 

Hi,

-----Original Message-----
From: Biju Das <biju.das.jz@...>
Sent: Tuesday, August 30, 2022 11:22 PM
To: cip-dev@...; iwamatsu nobuhiro(岩松 信洋 □SWC◯A
CT) <nobuhiro1.iwamatsu@...>; Pavel Machek
<pavel@...>
Cc: Chris Paterson <chris.paterson2@...>; Biju Das
<biju.das.jz@...>; Prabhakar Mahadev Lad
<prabhakar.mahadev-lad.rj@...>
Subject: [PATCH 5.10.y-cip] drm: rcar-du: Fix Alpha blending issue on Gen3

From: LUU HOAI <hoai.luu.ub@...>

commit b7aaa61726cbc7b941007af14a9f991a828c67e4 upstream.

As per R-Car-Gen3_Common_OPC_Customer_Notifications_V30.1.pdf,
unexpected image output(such as incorrect colors or planes being
invisible) can happen on the below conditions, as PnALPHAR register is not
initialized by reset.

When alpha blending (PpMRm.PpSPIM=0b101) is performed and:
•two Planes are enabled on any DUn (n=0,1,2,3)
oDSPRn= 0x0000 0031 or 0x0000 0013
•or DU0 and DU1 is used for display at the same time
oDSPR0= 0x0000 0001 and DSPR1= 0x0000 0003
oDSPR0= 0x0000 0003 and DSPR1= 0x0000 0001
•or DU2 and DU3(H3 Only) is used for display at the same time
oDSPR2= 0x0000 0001 and DSPR3= 0x0000 0003
oDSPR2= 0x0000 0003 and DSPR3= 0x0000 0001

This patch set PnALPHAR register to 0 to avoid this issue.

Signed-off-by: LUU HOAI <hoai.luu.ub@...>
Signed-off-by: Biju Das <biju.das.jz@...>
Reviewed-by: Laurent Pinchart <laurent.pinchart@...>
Signed-off-by: Laurent Pinchart
<laurent.pinchart+renesas@...>
Signed-off-by: Biju Das <biju.das.jz@...>
---
drivers/gpu/drm/rcar-du/rcar_du_plane.c | 12 ++++++++++++
1 file changed, 12 insertions(+)
Looks good to me this patch.
If there are no other comments, I can apply.

Best regards,
Nobuhiro


[ANNOUNCE] Release v4.19.256-cip80 and v5.10.138-cip15

Nobuhiro Iwamatsu
 

Hi,

CIP kernel team has released Linux kernel v4.19.256-cip80 and v5.10.138-cip15.
The linux-4.19.y-cip tree has been updated base version from v4.19.255 to v4.19.256,
and the linux-5.10.y-cip tree has been updated base version from v5.10.136 to v5.10.138.
The 5.10.y-cip tree has applied small updates of Renesas ARM SoCs.

You can get this release via the git tree at:

v4.19.256-cip80:
repository:
https://git.kernel.org/pub/scm/linux/kernel/git/cip/linux-cip.git
branch:
linux-4.19.y-cip
commit hash:
e5c44c8629fdb37d31546d9544b68fef7292f810
Fixed CVEs:
- CVE-2022-2586: netfilter: nf_tables: do not allow SET_ID to refer to another table
- CVE-2022-1679: ath9k: fix use-after-free in ath9k_hif_usb_rx_cb
- CVE-2022-2588: net_sched: cls_route: remove from list when handle is 0
- CVE-2022-2153: KVM: x86: Avoid theoretical NULL pointer dereference in kvm_irq_delivery_to_apic_fast()
- CVE-2021-4159: bpf: Verifer, adjust_scalar_min_max_vals to always call update_reg_bounds()
added commits:
CIP: Bump version suffix to -cip80 after merge from stable

v5.10.138-cip15:
repository:
https://git.kernel.org/pub/scm/linux/kernel/git/cip/linux-cip.git
branch:
linux-5.10.y-cip
commit hash:
f2d94917db95e02bef61288aba5b06e0dfef3a73
Fixed CVEs:
- CVE-2022-2586: netfilter: nf_tables: do not allow SET_ID to refer to another table
- CVE-2022-2585: posix-cpu-timers: Cleanup CPU timers before freeing them during exec
- CVE-2022-1679: ath9k: fix use-after-free in ath9k_hif_usb_rx_cb
- CVE-2022-2588: net_sched: cls_route: remove from list when handle is 0
- CVE-2022-2153: KVM: x86: Avoid theoretical NULL pointer dereference in kvm_irq_delivery_to_apic_fast()
added commits:
CIP: Bump version suffix to -cip15 after merge from stable
PCI: Drop PCIE_RCAR config option
arm64: dts: renesas: r9a07g054l2-smarc: Correct SoC name in comment
clk: renesas: rzg2l: Fix reset status function

Best regards,
Nobuhiro


cip-gitlab/ci/iwamatsu/linux-5.10.y-cip-rc smc: 5 runs, 3 regressions (v5.10.138-cip15-90-gd4130d0ee3c7) #kernelci

kernelci.org bot <bot@...>
 

cip-gitlab/ci/iwamatsu/linux-5.10.y-cip-rc smc: 5 runs, 3 regressions (v5.10.138-cip15-90-gd4130d0ee3c7)

Regressions Summary
-------------------

platform | arch | lab | compiler | defconfig | regressions
-----------------------------+--------+---------------+----------+------------------------------+------------
hp-x360-12b-c...4020-octopus | x86_64 | lab-collabora | gcc-10 | x86_64_defcon...6-chromebook | 2
qemu_x86_64 | x86_64 | lab-collabora | gcc-10 | x86_64_defcon...6-chromebook | 1

Details: https://kernelci.org/test/job/cip-gitlab/branch/ci%2Fiwamatsu%2Flinux-5.10.y-cip-rc/kernel/v5.10.138-cip15-90-gd4130d0ee3c7/plan/smc/

Test: smc
Tree: cip-gitlab
Branch: ci/iwamatsu/linux-5.10.y-cip-rc
Describe: v5.10.138-cip15-90-gd4130d0ee3c7
URL: https://gitlab.com/cip-project/cip-kernel/linux-cip.git
SHA: d4130d0ee3c72fc50c48ae861863e85537802c47


Test Regressions
----------------


platform | arch | lab | compiler | defconfig | regressions
-----------------------------+--------+---------------+----------+------------------------------+------------
hp-x360-12b-c...4020-octopus | x86_64 | lab-collabora | gcc-10 | x86_64_defcon...6-chromebook | 2

Details: https://kernelci.org/test/plan/id/630fac786fb1c82783355657

Results: 14 PASS, 2 FAIL, 0 SKIP
Full config: x86_64_defconfig+x86-chromebook
Compiler: gcc-10 (gcc (Debian 10.2.1-6) 10.2.1 20210110)
Plain log: https://storage.kernelci.org//cip-gitlab/ci-iwamatsu-linux-5.10.y-cip-rc/v5.10.138-cip15-90-gd4130d0ee3c7/x86_64/x86_64_defconfig+x86-chromebook/gcc-10/lab-collabora/smc-hp-x360-12b-ca0010nr-n4020-octopus.txt
HTML log: https://storage.kernelci.org//cip-gitlab/ci-iwamatsu-linux-5.10.y-cip-rc/v5.10.138-cip15-90-gd4130d0ee3c7/x86_64/x86_64_defconfig+x86-chromebook/gcc-10/lab-collabora/smc-hp-x360-12b-ca0010nr-n4020-octopus.html
Rootfs: http://storage.kernelci.org/images/rootfs/buildroot/buildroot-baseline/20220805.0/x86/rootfs.cpio.gz


* smc.CVE-2018-3639: https://kernelci.org/test/case/id/630fac786fb1c82783355663
failing since 57 days (last pass: v5.10.121-cip9-287-ge9094c8446fc, first fail: v5.10.125-cip10-119-g603acbe1aceb)

2022-08-31T18:46:07.827976 <8>[ 12.414694] <LAVA_SIGNAL_TESTCASE TEST_CASE_ID=CVE-2018-3639 RESULT=fail>

* smc.CVE-2018-3640: https://kernelci.org/test/case/id/630fac786fb1c82783355664
failing since 57 days (last pass: v5.10.121-cip9-287-ge9094c8446fc, first fail: v5.10.125-cip10-119-g603acbe1aceb)

2022-08-31T18:46:07.809682 <8>[ 12.396672] <LAVA_SIGNAL_TESTCASE TEST_CASE_ID=CVE-2018-3640 RESULT=fail>



platform | arch | lab | compiler | defconfig | regressions
-----------------------------+--------+---------------+----------+------------------------------+------------
qemu_x86_64 | x86_64 | lab-collabora | gcc-10 | x86_64_defcon...6-chromebook | 1

Details: https://kernelci.org/test/plan/id/630f9b82aeec1b5ab9355682

Results: 15 PASS, 1 FAIL, 0 SKIP
Full config: x86_64_defconfig+x86-chromebook
Compiler: gcc-10 (gcc (Debian 10.2.1-6) 10.2.1 20210110)
Plain log: https://storage.kernelci.org//cip-gitlab/ci-iwamatsu-linux-5.10.y-cip-rc/v5.10.138-cip15-90-gd4130d0ee3c7/x86_64/x86_64_defconfig+x86-chromebook/gcc-10/lab-collabora/smc-qemu_x86_64.txt
HTML log: https://storage.kernelci.org//cip-gitlab/ci-iwamatsu-linux-5.10.y-cip-rc/v5.10.138-cip15-90-gd4130d0ee3c7/x86_64/x86_64_defconfig+x86-chromebook/gcc-10/lab-collabora/smc-qemu_x86_64.html
Rootfs: http://storage.kernelci.org/images/rootfs/buildroot/buildroot-baseline/20220805.0/x86/rootfs.cpio.gz


* smc.CVE-2020-0543: https://kernelci.org/test/case/id/630f9b82aeec1b5ab9355684
new failure (last pass: v5.10.136-cip14-542-g97767707d3d0)

2022-08-31T17:33:43.321822 <8>[ 2.588493] <LAVA_SIGNAL_TESTCASE TEST_CASE_ID=CVE-2020-0543 RESULT=fail>


cip-gitlab/ci/iwamatsu/linux-5.10.y-cip-rc kselftest-lkdtm: 3 runs, 1 regressions (v5.10.138-cip15-90-gd4130d0ee3c7) #kernelci

kernelci.org bot <bot@...>
 

cip-gitlab/ci/iwamatsu/linux-5.10.y-cip-rc kselftest-lkdtm: 3 runs, 1 regressions (v5.10.138-cip15-90-gd4130d0ee3c7)

Regressions Summary
-------------------

platform | arch | lab | compiler | defconfig | regressions
--------------------------+--------+---------------+----------+------------------------------+------------
asus-C433TA-AJ0005-rammus | x86_64 | lab-collabora | gcc-10 | x86_64_defcon...ok+kselftest | 1

Details: https://kernelci.org/test/job/cip-gitlab/branch/ci%2Fiwamatsu%2Flinux-5.10.y-cip-rc/kernel/v5.10.138-cip15-90-gd4130d0ee3c7/plan/kselftest-lkdtm/

Test: kselftest-lkdtm
Tree: cip-gitlab
Branch: ci/iwamatsu/linux-5.10.y-cip-rc
Describe: v5.10.138-cip15-90-gd4130d0ee3c7
URL: https://gitlab.com/cip-project/cip-kernel/linux-cip.git
SHA: d4130d0ee3c72fc50c48ae861863e85537802c47


Test Regressions
----------------


platform | arch | lab | compiler | defconfig | regressions
--------------------------+--------+---------------+----------+------------------------------+------------
asus-C433TA-AJ0005-rammus | x86_64 | lab-collabora | gcc-10 | x86_64_defcon...ok+kselftest | 1

Details: https://kernelci.org/test/plan/id/630f9cd72e773832ae355642

Results: 37 PASS, 17 FAIL, 25 SKIP
Full config: x86_64_defconfig+x86-chromebook+kselftest
Compiler: gcc-10 (gcc (Debian 10.2.1-6) 10.2.1 20210110)
Plain log: https://storage.kernelci.org//cip-gitlab/ci-iwamatsu-linux-5.10.y-cip-rc/v5.10.138-cip15-90-gd4130d0ee3c7/x86_64/x86_64_defconfig+x86-chromebook+kselftest/gcc-10/lab-collabora/kselftest-lkdtm-asus-C433TA-AJ0005-rammus.txt
HTML log: https://storage.kernelci.org//cip-gitlab/ci-iwamatsu-linux-5.10.y-cip-rc/v5.10.138-cip15-90-gd4130d0ee3c7/x86_64/x86_64_defconfig+x86-chromebook+kselftest/gcc-10/lab-collabora/kselftest-lkdtm-asus-C433TA-AJ0005-rammus.html
Rootfs: http://storage.kernelci.org/images/rootfs/debian/bullseye-kselftest/20220826.0/amd64/initrd.cpio.gz


* kselftest-lkdtm.lkdtm_USERCOPY_STACK_FRAME_FROM_sh: https://kernelci.org/test/case/id/630f9cd72e773832ae355653
failing since 68 days (last pass: v5.10.118-465-g0af29783a3c9, first fail: v5.10.121-cip9-272-g3fb28d4c623b)


cip-gitlab/ci/iwamatsu/linux-5.10.y-cip-rc kselftest-futex: 7 runs, 1 regressions (v5.10.138-cip15-90-gd4130d0ee3c7) #kernelci

kernelci.org bot <bot@...>
 

cip-gitlab/ci/iwamatsu/linux-5.10.y-cip-rc kselftest-futex: 7 runs, 1 regressions (v5.10.138-cip15-90-gd4130d0ee3c7)

Regressions Summary
-------------------

platform | arch | lab | compiler | defconfig | regressions
-----------------------------+-------+--------------+----------+-----------+------------
meson-g12b-a311d-khadas-vim3 | arm64 | lab-baylibre | gcc-10 | defconfig | 1

Details: https://kernelci.org/test/job/cip-gitlab/branch/ci%2Fiwamatsu%2Flinux-5.10.y-cip-rc/kernel/v5.10.138-cip15-90-gd4130d0ee3c7/plan/kselftest-futex/

Test: kselftest-futex
Tree: cip-gitlab
Branch: ci/iwamatsu/linux-5.10.y-cip-rc
Describe: v5.10.138-cip15-90-gd4130d0ee3c7
URL: https://gitlab.com/cip-project/cip-kernel/linux-cip.git
SHA: d4130d0ee3c72fc50c48ae861863e85537802c47


Test Regressions
----------------


platform | arch | lab | compiler | defconfig | regressions
-----------------------------+-------+--------------+----------+-----------+------------
meson-g12b-a311d-khadas-vim3 | arm64 | lab-baylibre | gcc-10 | defconfig | 1

Details: https://kernelci.org/test/plan/id/630fa5858173990934355642

Results: 0 PASS, 1 FAIL, 0 SKIP
Full config: defconfig
Compiler: gcc-10 (aarch64-linux-gnu-gcc (Debian 10.2.1-6) 10.2.1 20210110)
Plain log: https://storage.kernelci.org//cip-gitlab/ci-iwamatsu-linux-5.10.y-cip-rc/v5.10.138-cip15-90-gd4130d0ee3c7/arm64/defconfig/gcc-10/lab-baylibre/kselftest-futex-meson-g12b-a311d-khadas-vim3.txt
HTML log: https://storage.kernelci.org//cip-gitlab/ci-iwamatsu-linux-5.10.y-cip-rc/v5.10.138-cip15-90-gd4130d0ee3c7/arm64/defconfig/gcc-10/lab-baylibre/kselftest-futex-meson-g12b-a311d-khadas-vim3.html
Rootfs: http://storage.kernelci.org/images/rootfs/debian/bullseye-kselftest/20220826.0/arm64/initrd.cpio.gz


* kselftest-futex.login: https://kernelci.org/test/case/id/630fa5858173990934355643
failing since 27 days (last pass: v5.10.126-cip11-116-gef362fbbff528, first fail: v5.10.131-cip13-431-g420b8f43ddc46)


cip-gitlab/ci/iwamatsu/linux-5.10.y-cip-rc kselftest-filesystems: 8 runs, 1 regressions (v5.10.138-cip15-90-gd4130d0ee3c7) #kernelci

kernelci.org bot <bot@...>
 

cip-gitlab/ci/iwamatsu/linux-5.10.y-cip-rc kselftest-filesystems: 8 runs, 1 regressions (v5.10.138-cip15-90-gd4130d0ee3c7)

Regressions Summary
-------------------

platform | arch | lab | compiler | defconfig | regressions
-----------------------------+-------+--------------+----------+-----------+------------
meson-g12b-a311d-khadas-vim3 | arm64 | lab-baylibre | gcc-10 | defconfig | 1

Details: https://kernelci.org/test/job/cip-gitlab/branch/ci%2Fiwamatsu%2Flinux-5.10.y-cip-rc/kernel/v5.10.138-cip15-90-gd4130d0ee3c7/plan/kselftest-filesystems/

Test: kselftest-filesystems
Tree: cip-gitlab
Branch: ci/iwamatsu/linux-5.10.y-cip-rc
Describe: v5.10.138-cip15-90-gd4130d0ee3c7
URL: https://gitlab.com/cip-project/cip-kernel/linux-cip.git
SHA: d4130d0ee3c72fc50c48ae861863e85537802c47


Test Regressions
----------------


platform | arch | lab | compiler | defconfig | regressions
-----------------------------+-------+--------------+----------+-----------+------------
meson-g12b-a311d-khadas-vim3 | arm64 | lab-baylibre | gcc-10 | defconfig | 1

Details: https://kernelci.org/test/plan/id/630fa5c24138fb0f57355642

Results: 0 PASS, 1 FAIL, 0 SKIP
Full config: defconfig
Compiler: gcc-10 (aarch64-linux-gnu-gcc (Debian 10.2.1-6) 10.2.1 20210110)
Plain log: https://storage.kernelci.org//cip-gitlab/ci-iwamatsu-linux-5.10.y-cip-rc/v5.10.138-cip15-90-gd4130d0ee3c7/arm64/defconfig/gcc-10/lab-baylibre/kselftest-filesystems-meson-g12b-a311d-khadas-vim3.txt
HTML log: https://storage.kernelci.org//cip-gitlab/ci-iwamatsu-linux-5.10.y-cip-rc/v5.10.138-cip15-90-gd4130d0ee3c7/arm64/defconfig/gcc-10/lab-baylibre/kselftest-filesystems-meson-g12b-a311d-khadas-vim3.html
Rootfs: http://storage.kernelci.org/images/rootfs/debian/bullseye-kselftest/20220826.0/arm64/initrd.cpio.gz


* kselftest-filesystems.login: https://kernelci.org/test/case/id/630fa5c24138fb0f57355643
new failure (last pass: v5.10.136-cip14-542-g97767707d3d0)


cip-gitlab/ci/iwamatsu/linux-5.10.y-cip-rc baseline: 137 runs, 15 regressions (v5.10.138-cip15-90-gd4130d0ee3c7) #kernelci

kernelci.org bot <bot@...>
 

cip-gitlab/ci/iwamatsu/linux-5.10.y-cip-rc baseline: 137 runs, 15 regressions (v5.10.138-cip15-90-gd4130d0ee3c7)

Regressions Summary
-------------------

platform | arch | lab | compiler | defconfig | regressions
---------------------------+-------+---------------+----------+----------------------------+------------
qemu_arm64-virt-gicv2 | arm64 | lab-broonie | gcc-10 | defconfig+arm64-chromebook | 1
qemu_arm64-virt-gicv2 | arm64 | lab-broonie | gcc-10 | defconfig | 1
qemu_arm64-virt-gicv2 | arm64 | lab-collabora | gcc-10 | defconfig | 1
qemu_arm64-virt-gicv2-uefi | arm64 | lab-broonie | gcc-10 | defconfig+arm64-chromebook | 1
qemu_arm64-virt-gicv2-uefi | arm64 | lab-broonie | gcc-10 | defconfig | 1
qemu_arm64-virt-gicv2-uefi | arm64 | lab-collabora | gcc-10 | defconfig | 1
qemu_arm64-virt-gicv3 | arm64 | lab-broonie | gcc-10 | defconfig+arm64-chromebook | 1
qemu_arm64-virt-gicv3 | arm64 | lab-broonie | gcc-10 | defconfig | 1
qemu_arm64-virt-gicv3 | arm64 | lab-collabora | gcc-10 | defconfig | 1
qemu_arm64-virt-gicv3-uefi | arm64 | lab-broonie | gcc-10 | defconfig+arm64-chromebook | 1
qemu_arm64-virt-gicv3-uefi | arm64 | lab-broonie | gcc-10 | defconfig | 1
qemu_arm64-virt-gicv3-uefi | arm64 | lab-collabora | gcc-10 | defconfig+arm64-chromebook | 1
qemu_arm64-virt-gicv3-uefi | arm64 | lab-collabora | gcc-10 | defconfig | 1
r8a774a1-hihope-rzg2m-ex | arm64 | lab-cip | gcc-10 | defconfig+arm64-chromebook | 1
rk3399-gru-kevin | arm64 | lab-collabora | gcc-10 | defconfig+arm64-chromebook | 1

Details: https://kernelci.org/test/job/cip-gitlab/branch/ci%2Fiwamatsu%2Flinux-5.10.y-cip-rc/kernel/v5.10.138-cip15-90-gd4130d0ee3c7/plan/baseline/

Test: baseline
Tree: cip-gitlab
Branch: ci/iwamatsu/linux-5.10.y-cip-rc
Describe: v5.10.138-cip15-90-gd4130d0ee3c7
URL: https://gitlab.com/cip-project/cip-kernel/linux-cip.git
SHA: d4130d0ee3c72fc50c48ae861863e85537802c47


Test Regressions
----------------


platform | arch | lab | compiler | defconfig | regressions
---------------------------+-------+---------------+----------+----------------------------+------------
qemu_arm64-virt-gicv2 | arm64 | lab-broonie | gcc-10 | defconfig+arm64-chromebook | 1

Details: https://kernelci.org/test/plan/id/630fa42656c114f48d35566b

Results: 0 PASS, 1 FAIL, 0 SKIP
Full config: defconfig+arm64-chromebook
Compiler: gcc-10 (aarch64-linux-gnu-gcc (Debian 10.2.1-6) 10.2.1 20210110)
Plain log: https://storage.kernelci.org//cip-gitlab/ci-iwamatsu-linux-5.10.y-cip-rc/v5.10.138-cip15-90-gd4130d0ee3c7/arm64/defconfig+arm64-chromebook/gcc-10/lab-broonie/baseline-qemu_arm64-virt-gicv2.txt
HTML log: https://storage.kernelci.org//cip-gitlab/ci-iwamatsu-linux-5.10.y-cip-rc/v5.10.138-cip15-90-gd4130d0ee3c7/arm64/defconfig+arm64-chromebook/gcc-10/lab-broonie/baseline-qemu_arm64-virt-gicv2.html
Rootfs: http://storage.kernelci.org/images/rootfs/buildroot/buildroot-baseline/20220805.0/arm64/rootfs.cpio.gz


* baseline.login: https://kernelci.org/test/case/id/630fa42656c114f48d35566c
failing since 111 days (last pass: v5.10.112-cip6-88-gf3397cadb2dd6, first fail: v5.10.112-cip6-289-g2969e096d186)



platform | arch | lab | compiler | defconfig | regressions
---------------------------+-------+---------------+----------+----------------------------+------------
qemu_arm64-virt-gicv2 | arm64 | lab-broonie | gcc-10 | defconfig | 1

Details: https://kernelci.org/test/plan/id/630fa58f8173990934355647

Results: 0 PASS, 1 FAIL, 0 SKIP
Full config: defconfig
Compiler: gcc-10 (aarch64-linux-gnu-gcc (Debian 10.2.1-6) 10.2.1 20210110)
Plain log: https://storage.kernelci.org//cip-gitlab/ci-iwamatsu-linux-5.10.y-cip-rc/v5.10.138-cip15-90-gd4130d0ee3c7/arm64/defconfig/gcc-10/lab-broonie/baseline-qemu_arm64-virt-gicv2.txt
HTML log: https://storage.kernelci.org//cip-gitlab/ci-iwamatsu-linux-5.10.y-cip-rc/v5.10.138-cip15-90-gd4130d0ee3c7/arm64/defconfig/gcc-10/lab-broonie/baseline-qemu_arm64-virt-gicv2.html
Rootfs: http://storage.kernelci.org/images/rootfs/buildroot/buildroot-baseline/20220805.0/arm64/rootfs.cpio.gz


* baseline.login: https://kernelci.org/test/case/id/630fa58f8173990934355648
failing since 113 days (last pass: v5.10.112-cip6-88-gf3397cadb2dd6, first fail: v5.10.112-cip6-218-g8253434cd56a)



platform | arch | lab | compiler | defconfig | regressions
---------------------------+-------+---------------+----------+----------------------------+------------
qemu_arm64-virt-gicv2 | arm64 | lab-collabora | gcc-10 | defconfig | 1

Details: https://kernelci.org/test/plan/id/630f9f8113eb51b0f835565b

Results: 0 PASS, 1 FAIL, 0 SKIP
Full config: defconfig
Compiler: gcc-10 (aarch64-linux-gnu-gcc (Debian 10.2.1-6) 10.2.1 20210110)
Plain log: https://storage.kernelci.org//cip-gitlab/ci-iwamatsu-linux-5.10.y-cip-rc/v5.10.138-cip15-90-gd4130d0ee3c7/arm64/defconfig/gcc-10/lab-collabora/baseline-qemu_arm64-virt-gicv2.txt
HTML log: https://storage.kernelci.org//cip-gitlab/ci-iwamatsu-linux-5.10.y-cip-rc/v5.10.138-cip15-90-gd4130d0ee3c7/arm64/defconfig/gcc-10/lab-collabora/baseline-qemu_arm64-virt-gicv2.html
Rootfs: http://storage.kernelci.org/images/rootfs/buildroot/buildroot-baseline/20220805.0/arm64/rootfs.cpio.gz


* baseline.login: https://kernelci.org/test/case/id/630f9f8113eb51b0f835565c
failing since 113 days (last pass: v5.10.112-cip6-88-gf3397cadb2dd6, first fail: v5.10.112-cip6-218-g8253434cd56a)



platform | arch | lab | compiler | defconfig | regressions
---------------------------+-------+---------------+----------+----------------------------+------------
qemu_arm64-virt-gicv2-uefi | arm64 | lab-broonie | gcc-10 | defconfig+arm64-chromebook | 1

Details: https://kernelci.org/test/plan/id/630fa4005924654d6c355667

Results: 0 PASS, 1 FAIL, 0 SKIP
Full config: defconfig+arm64-chromebook
Compiler: gcc-10 (aarch64-linux-gnu-gcc (Debian 10.2.1-6) 10.2.1 20210110)
Plain log: https://storage.kernelci.org//cip-gitlab/ci-iwamatsu-linux-5.10.y-cip-rc/v5.10.138-cip15-90-gd4130d0ee3c7/arm64/defconfig+arm64-chromebook/gcc-10/lab-broonie/baseline-qemu_arm64-virt-gicv2-uefi.txt
HTML log: https://storage.kernelci.org//cip-gitlab/ci-iwamatsu-linux-5.10.y-cip-rc/v5.10.138-cip15-90-gd4130d0ee3c7/arm64/defconfig+arm64-chromebook/gcc-10/lab-broonie/baseline-qemu_arm64-virt-gicv2-uefi.html
Rootfs: http://storage.kernelci.org/images/rootfs/buildroot/buildroot-baseline/20220805.0/arm64/rootfs.cpio.gz


* baseline.login: https://kernelci.org/test/case/id/630fa4005924654d6c355668
failing since 111 days (last pass: v5.10.112-cip6-88-gf3397cadb2dd6, first fail: v5.10.112-cip6-289-g2969e096d186)



platform | arch | lab | compiler | defconfig | regressions
---------------------------+-------+---------------+----------+----------------------------+------------
qemu_arm64-virt-gicv2-uefi | arm64 | lab-broonie | gcc-10 | defconfig | 1

Details: https://kernelci.org/test/plan/id/630fa57b22af62cd8f355651

Results: 0 PASS, 1 FAIL, 0 SKIP
Full config: defconfig
Compiler: gcc-10 (aarch64-linux-gnu-gcc (Debian 10.2.1-6) 10.2.1 20210110)
Plain log: https://storage.kernelci.org//cip-gitlab/ci-iwamatsu-linux-5.10.y-cip-rc/v5.10.138-cip15-90-gd4130d0ee3c7/arm64/defconfig/gcc-10/lab-broonie/baseline-qemu_arm64-virt-gicv2-uefi.txt
HTML log: https://storage.kernelci.org//cip-gitlab/ci-iwamatsu-linux-5.10.y-cip-rc/v5.10.138-cip15-90-gd4130d0ee3c7/arm64/defconfig/gcc-10/lab-broonie/baseline-qemu_arm64-virt-gicv2-uefi.html
Rootfs: http://storage.kernelci.org/images/rootfs/buildroot/buildroot-baseline/20220805.0/arm64/rootfs.cpio.gz


* baseline.login: https://kernelci.org/test/case/id/630fa57b22af62cd8f355652
failing since 113 days (last pass: v5.10.112-cip6-88-gf3397cadb2dd6, first fail: v5.10.112-cip6-218-g8253434cd56a)



platform | arch | lab | compiler | defconfig | regressions
---------------------------+-------+---------------+----------+----------------------------+------------
qemu_arm64-virt-gicv2-uefi | arm64 | lab-collabora | gcc-10 | defconfig | 1

Details: https://kernelci.org/test/plan/id/630f9f6c77322caa86355678

Results: 0 PASS, 1 FAIL, 0 SKIP
Full config: defconfig
Compiler: gcc-10 (aarch64-linux-gnu-gcc (Debian 10.2.1-6) 10.2.1 20210110)
Plain log: https://storage.kernelci.org//cip-gitlab/ci-iwamatsu-linux-5.10.y-cip-rc/v5.10.138-cip15-90-gd4130d0ee3c7/arm64/defconfig/gcc-10/lab-collabora/baseline-qemu_arm64-virt-gicv2-uefi.txt
HTML log: https://storage.kernelci.org//cip-gitlab/ci-iwamatsu-linux-5.10.y-cip-rc/v5.10.138-cip15-90-gd4130d0ee3c7/arm64/defconfig/gcc-10/lab-collabora/baseline-qemu_arm64-virt-gicv2-uefi.html
Rootfs: http://storage.kernelci.org/images/rootfs/buildroot/buildroot-baseline/20220805.0/arm64/rootfs.cpio.gz


* baseline.login: https://kernelci.org/test/case/id/630f9f6c77322caa86355679
failing since 113 days (last pass: v5.10.112-cip6-88-gf3397cadb2dd6, first fail: v5.10.112-cip6-218-g8253434cd56a)



platform | arch | lab | compiler | defconfig | regressions
---------------------------+-------+---------------+----------+----------------------------+------------
qemu_arm64-virt-gicv3 | arm64 | lab-broonie | gcc-10 | defconfig+arm64-chromebook | 1

Details: https://kernelci.org/test/plan/id/630fa41356c114f48d355657

Results: 0 PASS, 1 FAIL, 0 SKIP
Full config: defconfig+arm64-chromebook
Compiler: gcc-10 (aarch64-linux-gnu-gcc (Debian 10.2.1-6) 10.2.1 20210110)
Plain log: https://storage.kernelci.org//cip-gitlab/ci-iwamatsu-linux-5.10.y-cip-rc/v5.10.138-cip15-90-gd4130d0ee3c7/arm64/defconfig+arm64-chromebook/gcc-10/lab-broonie/baseline-qemu_arm64-virt-gicv3.txt
HTML log: https://storage.kernelci.org//cip-gitlab/ci-iwamatsu-linux-5.10.y-cip-rc/v5.10.138-cip15-90-gd4130d0ee3c7/arm64/defconfig+arm64-chromebook/gcc-10/lab-broonie/baseline-qemu_arm64-virt-gicv3.html
Rootfs: http://storage.kernelci.org/images/rootfs/buildroot/buildroot-baseline/20220805.0/arm64/rootfs.cpio.gz


* baseline.login: https://kernelci.org/test/case/id/630fa41356c114f48d355658
failing since 111 days (last pass: v5.10.112-cip6-88-gf3397cadb2dd6, first fail: v5.10.112-cip6-289-g2969e096d186)



platform | arch | lab | compiler | defconfig | regressions
---------------------------+-------+---------------+----------+----------------------------+------------
qemu_arm64-virt-gicv3 | arm64 | lab-broonie | gcc-10 | defconfig | 1

Details: https://kernelci.org/test/plan/id/630fa56822af62cd8f35564a

Results: 0 PASS, 1 FAIL, 0 SKIP
Full config: defconfig
Compiler: gcc-10 (aarch64-linux-gnu-gcc (Debian 10.2.1-6) 10.2.1 20210110)
Plain log: https://storage.kernelci.org//cip-gitlab/ci-iwamatsu-linux-5.10.y-cip-rc/v5.10.138-cip15-90-gd4130d0ee3c7/arm64/defconfig/gcc-10/lab-broonie/baseline-qemu_arm64-virt-gicv3.txt
HTML log: https://storage.kernelci.org//cip-gitlab/ci-iwamatsu-linux-5.10.y-cip-rc/v5.10.138-cip15-90-gd4130d0ee3c7/arm64/defconfig/gcc-10/lab-broonie/baseline-qemu_arm64-virt-gicv3.html
Rootfs: http://storage.kernelci.org/images/rootfs/buildroot/buildroot-baseline/20220805.0/arm64/rootfs.cpio.gz


* baseline.login: https://kernelci.org/test/case/id/630fa56822af62cd8f35564b
failing since 113 days (last pass: v5.10.112-cip6-88-gf3397cadb2dd6, first fail: v5.10.112-cip6-218-g8253434cd56a)



platform | arch | lab | compiler | defconfig | regressions
---------------------------+-------+---------------+----------+----------------------------+------------
qemu_arm64-virt-gicv3 | arm64 | lab-collabora | gcc-10 | defconfig | 1

Details: https://kernelci.org/test/plan/id/630f9f6bcd1a4ac093355647

Results: 0 PASS, 1 FAIL, 0 SKIP
Full config: defconfig
Compiler: gcc-10 (aarch64-linux-gnu-gcc (Debian 10.2.1-6) 10.2.1 20210110)
Plain log: https://storage.kernelci.org//cip-gitlab/ci-iwamatsu-linux-5.10.y-cip-rc/v5.10.138-cip15-90-gd4130d0ee3c7/arm64/defconfig/gcc-10/lab-collabora/baseline-qemu_arm64-virt-gicv3.txt
HTML log: https://storage.kernelci.org//cip-gitlab/ci-iwamatsu-linux-5.10.y-cip-rc/v5.10.138-cip15-90-gd4130d0ee3c7/arm64/defconfig/gcc-10/lab-collabora/baseline-qemu_arm64-virt-gicv3.html
Rootfs: http://storage.kernelci.org/images/rootfs/buildroot/buildroot-baseline/20220805.0/arm64/rootfs.cpio.gz


* baseline.login: https://kernelci.org/test/case/id/630f9f6bcd1a4ac093355648
failing since 113 days (last pass: v5.10.112-cip6-88-gf3397cadb2dd6, first fail: v5.10.112-cip6-218-g8253434cd56a)



platform | arch | lab | compiler | defconfig | regressions
---------------------------+-------+---------------+----------+----------------------------+------------
qemu_arm64-virt-gicv3-uefi | arm64 | lab-broonie | gcc-10 | defconfig+arm64-chromebook | 1

Details: https://kernelci.org/test/plan/id/630fa3fefc859b04a0355693

Results: 0 PASS, 1 FAIL, 0 SKIP
Full config: defconfig+arm64-chromebook
Compiler: gcc-10 (aarch64-linux-gnu-gcc (Debian 10.2.1-6) 10.2.1 20210110)
Plain log: https://storage.kernelci.org//cip-gitlab/ci-iwamatsu-linux-5.10.y-cip-rc/v5.10.138-cip15-90-gd4130d0ee3c7/arm64/defconfig+arm64-chromebook/gcc-10/lab-broonie/baseline-qemu_arm64-virt-gicv3-uefi.txt
HTML log: https://storage.kernelci.org//cip-gitlab/ci-iwamatsu-linux-5.10.y-cip-rc/v5.10.138-cip15-90-gd4130d0ee3c7/arm64/defconfig+arm64-chromebook/gcc-10/lab-broonie/baseline-qemu_arm64-virt-gicv3-uefi.html
Rootfs: http://storage.kernelci.org/images/rootfs/buildroot/buildroot-baseline/20220805.0/arm64/rootfs.cpio.gz


* baseline.login: https://kernelci.org/test/case/id/630fa3fefc859b04a0355694
failing since 111 days (last pass: v5.10.112-cip6-88-gf3397cadb2dd6, first fail: v5.10.112-cip6-289-g2969e096d186)



platform | arch | lab | compiler | defconfig | regressions
---------------------------+-------+---------------+----------+----------------------------+------------
qemu_arm64-virt-gicv3-uefi | arm64 | lab-broonie | gcc-10 | defconfig | 1

Details: https://kernelci.org/test/plan/id/630fa693aeaaf0f76d355643

Results: 0 PASS, 1 FAIL, 0 SKIP
Full config: defconfig
Compiler: gcc-10 (aarch64-linux-gnu-gcc (Debian 10.2.1-6) 10.2.1 20210110)
Plain log: https://storage.kernelci.org//cip-gitlab/ci-iwamatsu-linux-5.10.y-cip-rc/v5.10.138-cip15-90-gd4130d0ee3c7/arm64/defconfig/gcc-10/lab-broonie/baseline-qemu_arm64-virt-gicv3-uefi.txt
HTML log: https://storage.kernelci.org//cip-gitlab/ci-iwamatsu-linux-5.10.y-cip-rc/v5.10.138-cip15-90-gd4130d0ee3c7/arm64/defconfig/gcc-10/lab-broonie/baseline-qemu_arm64-virt-gicv3-uefi.html
Rootfs: http://storage.kernelci.org/images/rootfs/buildroot/buildroot-baseline/20220805.0/arm64/rootfs.cpio.gz


* baseline.login: https://kernelci.org/test/case/id/630fa693aeaaf0f76d355644
failing since 113 days (last pass: v5.10.112-cip6-88-gf3397cadb2dd6, first fail: v5.10.112-cip6-218-g8253434cd56a)



platform | arch | lab | compiler | defconfig | regressions
---------------------------+-------+---------------+----------+----------------------------+------------
qemu_arm64-virt-gicv3-uefi | arm64 | lab-collabora | gcc-10 | defconfig+arm64-chromebook | 1

Details: https://kernelci.org/test/plan/id/630f9cfe2e773832ae3556b4

Results: 0 PASS, 1 FAIL, 0 SKIP
Full config: defconfig+arm64-chromebook
Compiler: gcc-10 (aarch64-linux-gnu-gcc (Debian 10.2.1-6) 10.2.1 20210110)
Plain log: https://storage.kernelci.org//cip-gitlab/ci-iwamatsu-linux-5.10.y-cip-rc/v5.10.138-cip15-90-gd4130d0ee3c7/arm64/defconfig+arm64-chromebook/gcc-10/lab-collabora/baseline-qemu_arm64-virt-gicv3-uefi.txt
HTML log: https://storage.kernelci.org//cip-gitlab/ci-iwamatsu-linux-5.10.y-cip-rc/v5.10.138-cip15-90-gd4130d0ee3c7/arm64/defconfig+arm64-chromebook/gcc-10/lab-collabora/baseline-qemu_arm64-virt-gicv3-uefi.html
Rootfs: http://storage.kernelci.org/images/rootfs/buildroot/buildroot-baseline/20220805.0/arm64/rootfs.cpio.gz


* baseline.login: https://kernelci.org/test/case/id/630f9cfe2e773832ae3556b5
failing since 111 days (last pass: v5.10.112-cip6-88-gf3397cadb2dd6, first fail: v5.10.112-cip6-289-g2969e096d186)



platform | arch | lab | compiler | defconfig | regressions
---------------------------+-------+---------------+----------+----------------------------+------------
qemu_arm64-virt-gicv3-uefi | arm64 | lab-collabora | gcc-10 | defconfig | 1

Details: https://kernelci.org/test/plan/id/630f9f7f13eb51b0f8355652

Results: 0 PASS, 1 FAIL, 0 SKIP
Full config: defconfig
Compiler: gcc-10 (aarch64-linux-gnu-gcc (Debian 10.2.1-6) 10.2.1 20210110)
Plain log: https://storage.kernelci.org//cip-gitlab/ci-iwamatsu-linux-5.10.y-cip-rc/v5.10.138-cip15-90-gd4130d0ee3c7/arm64/defconfig/gcc-10/lab-collabora/baseline-qemu_arm64-virt-gicv3-uefi.txt
HTML log: https://storage.kernelci.org//cip-gitlab/ci-iwamatsu-linux-5.10.y-cip-rc/v5.10.138-cip15-90-gd4130d0ee3c7/arm64/defconfig/gcc-10/lab-collabora/baseline-qemu_arm64-virt-gicv3-uefi.html
Rootfs: http://storage.kernelci.org/images/rootfs/buildroot/buildroot-baseline/20220805.0/arm64/rootfs.cpio.gz


* baseline.login: https://kernelci.org/test/case/id/630f9f7f13eb51b0f8355653
failing since 113 days (last pass: v5.10.112-cip6-88-gf3397cadb2dd6, first fail: v5.10.112-cip6-218-g8253434cd56a)



platform | arch | lab | compiler | defconfig | regressions
---------------------------+-------+---------------+----------+----------------------------+------------
r8a774a1-hihope-rzg2m-ex | arm64 | lab-cip | gcc-10 | defconfig+arm64-chromebook | 1

Details: https://kernelci.org/test/plan/id/630fa57810f9597327355652

Results: 0 PASS, 1 FAIL, 0 SKIP
Full config: defconfig+arm64-chromebook
Compiler: gcc-10 (aarch64-linux-gnu-gcc (Debian 10.2.1-6) 10.2.1 20210110)
Plain log: https://storage.kernelci.org//cip-gitlab/ci-iwamatsu-linux-5.10.y-cip-rc/v5.10.138-cip15-90-gd4130d0ee3c7/arm64/defconfig+arm64-chromebook/gcc-10/lab-cip/baseline-r8a774a1-hihope-rzg2m-ex.txt
HTML log: https://storage.kernelci.org//cip-gitlab/ci-iwamatsu-linux-5.10.y-cip-rc/v5.10.138-cip15-90-gd4130d0ee3c7/arm64/defconfig+arm64-chromebook/gcc-10/lab-cip/baseline-r8a774a1-hihope-rzg2m-ex.html
Rootfs: http://storage.kernelci.org/images/rootfs/buildroot/buildroot-baseline/20220805.0/arm64/rootfs.cpio.gz


* baseline.login: https://kernelci.org/test/case/id/630fa57810f9597327355653
failing since 41 days (last pass: v5.10.109-cip5-899-g234e7e7d5bd3, first fail: v5.10.129-cip12-12-ge4e007863cc76)



platform | arch | lab | compiler | defconfig | regressions
---------------------------+-------+---------------+----------+----------------------------+------------
rk3399-gru-kevin | arm64 | lab-collabora | gcc-10 | defconfig+arm64-chromebook | 1

Details: https://kernelci.org/test/plan/id/630f9e8e7c2fc714f335564d

Results: 90 PASS, 2 FAIL, 0 SKIP
Full config: defconfig+arm64-chromebook
Compiler: gcc-10 (aarch64-linux-gnu-gcc (Debian 10.2.1-6) 10.2.1 20210110)
Plain log: https://storage.kernelci.org//cip-gitlab/ci-iwamatsu-linux-5.10.y-cip-rc/v5.10.138-cip15-90-gd4130d0ee3c7/arm64/defconfig+arm64-chromebook/gcc-10/lab-collabora/baseline-rk3399-gru-kevin.txt
HTML log: https://storage.kernelci.org//cip-gitlab/ci-iwamatsu-linux-5.10.y-cip-rc/v5.10.138-cip15-90-gd4130d0ee3c7/arm64/defconfig+arm64-chromebook/gcc-10/lab-collabora/baseline-rk3399-gru-kevin.html
Rootfs: http://storage.kernelci.org/images/rootfs/buildroot/buildroot-baseline/20220805.0/arm64/rootfs.cpio.gz


* baseline.bootrr.rockchip-i2s1-probed: https://kernelci.org/test/case/id/630f9e8e7c2fc714f3355675
failing since 175 days (last pass: v5.10.100-cip2-319-gcbff87047566, first fail: v5.10.100-cip2-425-g0a0d92194f39)

2022-08-31T17:46:34.697013 /lava-7153178/1/../bin/lava-test-case
2022-08-31T17:46:34.708323 <8>[ 33.859191] <LAVA_SIGNAL_TESTCASE TEST_CASE_ID=rockchip-i2s1-probed RESULT=fail>


cip-gitlab/ci/iwamatsu/linux-5.10.y-cip-rc baseline-nfs: 22 runs, 3 regressions (v5.10.138-cip15-90-gd4130d0ee3c7) #kernelci

kernelci.org bot <bot@...>
 

cip-gitlab/ci/iwamatsu/linux-5.10.y-cip-rc baseline-nfs: 22 runs, 3 regressions (v5.10.138-cip15-90-gd4130d0ee3c7)

Regressions Summary
-------------------

platform | arch | lab | compiler | defconfig | regressions
-----------------------------+-------+---------------+----------+----------------------------+------------
meson-g12b-a311d-khadas-vim3 | arm64 | lab-baylibre | gcc-10 | defconfig | 1
meson-gxm-khadas-vim2 | arm64 | lab-baylibre | gcc-10 | defconfig | 1
rk3399-gru-kevin | arm64 | lab-collabora | gcc-10 | defconfig+arm64-chromebook | 1

Details: https://kernelci.org/test/job/cip-gitlab/branch/ci%2Fiwamatsu%2Flinux-5.10.y-cip-rc/kernel/v5.10.138-cip15-90-gd4130d0ee3c7/plan/baseline-nfs/

Test: baseline-nfs
Tree: cip-gitlab
Branch: ci/iwamatsu/linux-5.10.y-cip-rc
Describe: v5.10.138-cip15-90-gd4130d0ee3c7
URL: https://gitlab.com/cip-project/cip-kernel/linux-cip.git
SHA: d4130d0ee3c72fc50c48ae861863e85537802c47


Test Regressions
----------------


platform | arch | lab | compiler | defconfig | regressions
-----------------------------+-------+---------------+----------+----------------------------+------------
meson-g12b-a311d-khadas-vim3 | arm64 | lab-baylibre | gcc-10 | defconfig | 1

Details: https://kernelci.org/test/plan/id/630fa43287917f19d8355667

Results: 0 PASS, 1 FAIL, 0 SKIP
Full config: defconfig
Compiler: gcc-10 (aarch64-linux-gnu-gcc (Debian 10.2.1-6) 10.2.1 20210110)
Plain log: https://storage.kernelci.org//cip-gitlab/ci-iwamatsu-linux-5.10.y-cip-rc/v5.10.138-cip15-90-gd4130d0ee3c7/arm64/defconfig/gcc-10/lab-baylibre/baseline-nfs-meson-g12b-a311d-khadas-vim3.txt
HTML log: https://storage.kernelci.org//cip-gitlab/ci-iwamatsu-linux-5.10.y-cip-rc/v5.10.138-cip15-90-gd4130d0ee3c7/arm64/defconfig/gcc-10/lab-baylibre/baseline-nfs-meson-g12b-a311d-khadas-vim3.html
Rootfs: http://storage.kernelci.org/images/rootfs/debian/bullseye/20220826.0/arm64/initrd.cpio.gz


* baseline-nfs.login: https://kernelci.org/test/case/id/630fa43287917f19d8355668
new failure (last pass: v5.10.136-cip14-542-g97767707d3d0)



platform | arch | lab | compiler | defconfig | regressions
-----------------------------+-------+---------------+----------+----------------------------+------------
meson-gxm-khadas-vim2 | arm64 | lab-baylibre | gcc-10 | defconfig | 1

Details: https://kernelci.org/test/plan/id/630f9f95be57e3b46b355644

Results: 0 PASS, 1 FAIL, 0 SKIP
Full config: defconfig
Compiler: gcc-10 (aarch64-linux-gnu-gcc (Debian 10.2.1-6) 10.2.1 20210110)
Plain log: https://storage.kernelci.org//cip-gitlab/ci-iwamatsu-linux-5.10.y-cip-rc/v5.10.138-cip15-90-gd4130d0ee3c7/arm64/defconfig/gcc-10/lab-baylibre/baseline-nfs-meson-gxm-khadas-vim2.txt
HTML log: https://storage.kernelci.org//cip-gitlab/ci-iwamatsu-linux-5.10.y-cip-rc/v5.10.138-cip15-90-gd4130d0ee3c7/arm64/defconfig/gcc-10/lab-baylibre/baseline-nfs-meson-gxm-khadas-vim2.html
Rootfs: http://storage.kernelci.org/images/rootfs/debian/bullseye/20220826.0/arm64/initrd.cpio.gz


* baseline-nfs.login: https://kernelci.org/test/case/id/630f9f95be57e3b46b355645
failing since 27 days (last pass: v5.10.100-cip2-484-gede5006fb276, first fail: v5.10.131-cip13-431-g420b8f43ddc46)



platform | arch | lab | compiler | defconfig | regressions
-----------------------------+-------+---------------+----------+----------------------------+------------
rk3399-gru-kevin | arm64 | lab-collabora | gcc-10 | defconfig+arm64-chromebook | 1

Details: https://kernelci.org/test/plan/id/630f9ef2781784d59b355680

Results: 84 PASS, 4 FAIL, 0 SKIP
Full config: defconfig+arm64-chromebook
Compiler: gcc-10 (aarch64-linux-gnu-gcc (Debian 10.2.1-6) 10.2.1 20210110)
Plain log: https://storage.kernelci.org//cip-gitlab/ci-iwamatsu-linux-5.10.y-cip-rc/v5.10.138-cip15-90-gd4130d0ee3c7/arm64/defconfig+arm64-chromebook/gcc-10/lab-collabora/baseline-nfs-rk3399-gru-kevin.txt
HTML log: https://storage.kernelci.org//cip-gitlab/ci-iwamatsu-linux-5.10.y-cip-rc/v5.10.138-cip15-90-gd4130d0ee3c7/arm64/defconfig+arm64-chromebook/gcc-10/lab-collabora/baseline-nfs-rk3399-gru-kevin.html
Rootfs: http://storage.kernelci.org/images/rootfs/debian/bullseye/20220826.0/arm64/initrd.cpio.gz


* baseline-nfs.bootrr.rockchip-i2s1-probed: https://kernelci.org/test/case/id/630f9ef2781784d59b3556a6
failing since 175 days (last pass: v5.10.100-cip2-319-gcbff87047566, first fail: v5.10.100-cip2-425-g0a0d92194f39)

2022-08-31T17:48:28.024305 <4>[ 37.732869] cdn-dp fec00000.dp: Direct firmware load for rockchip/dptx.bin failed with error -2
2022-08-31T17:48:28.034084 <4>[ 37.743300] cdn-dp fec00000.dp: Falling back to sysfs fallback for: rockchip/dptx.bin
2022-08-31T17:48:28.620531 /lava-7153180/1/../bin/lava-test-case
2022-08-31T17:48:28.653413 <8>[ 38.362511] <LAVA_SIGNAL_TESTCASE TEST_CASE_ID=rockchip-i2s1-probed RESULT=fail>


cip-gitlab/ci/iwamatsu/linux-5.10.y-cip-rc baseline-cip-nfs: 7 runs, 1 regressions (v5.10.138-cip15-90-gd4130d0ee3c7) #kernelci

kernelci.org bot <bot@...>
 

cip-gitlab/ci/iwamatsu/linux-5.10.y-cip-rc baseline-cip-nfs: 7 runs, 1 regressions (v5.10.138-cip15-90-gd4130d0ee3c7)

Regressions Summary
-------------------

platform | arch | lab | compiler | defconfig | regressions
---------------+-------+---------+----------+----------------------------+------------
r8a774c0-ek874 | arm64 | lab-cip | gcc-10 | defconfig+arm64-chromebook | 1

Details: https://kernelci.org/test/job/cip-gitlab/branch/ci%2Fiwamatsu%2Flinux-5.10.y-cip-rc/kernel/v5.10.138-cip15-90-gd4130d0ee3c7/plan/baseline-cip-nfs/

Test: baseline-cip-nfs
Tree: cip-gitlab
Branch: ci/iwamatsu/linux-5.10.y-cip-rc
Describe: v5.10.138-cip15-90-gd4130d0ee3c7
URL: https://gitlab.com/cip-project/cip-kernel/linux-cip.git
SHA: d4130d0ee3c72fc50c48ae861863e85537802c47


Test Regressions
----------------


platform | arch | lab | compiler | defconfig | regressions
---------------+-------+---------+----------+----------------------------+------------
r8a774c0-ek874 | arm64 | lab-cip | gcc-10 | defconfig+arm64-chromebook | 1

Details: https://kernelci.org/test/plan/id/630f9d4037583745cd35564a

Results: 0 PASS, 1 FAIL, 0 SKIP
Full config: defconfig+arm64-chromebook
Compiler: gcc-10 (aarch64-linux-gnu-gcc (Debian 10.2.1-6) 10.2.1 20210110)
Plain log: https://storage.kernelci.org//cip-gitlab/ci-iwamatsu-linux-5.10.y-cip-rc/v5.10.138-cip15-90-gd4130d0ee3c7/arm64/defconfig+arm64-chromebook/gcc-10/lab-cip/baseline-cip-nfs-r8a774c0-ek874.txt
HTML log: https://storage.kernelci.org//cip-gitlab/ci-iwamatsu-linux-5.10.y-cip-rc/v5.10.138-cip15-90-gd4130d0ee3c7/arm64/defconfig+arm64-chromebook/gcc-10/lab-cip/baseline-cip-nfs-r8a774c0-ek874.html
Rootfs: https://storage.kernelci.org/images/rootfs/cip/20211105/qemu-arm64/cip-core-image-kernelci-cip-core-buster-qemu-arm64-initrd.img.gz


* baseline-cip-nfs.login: https://kernelci.org/test/case/id/630f9d4037583745cd35564b
new failure (last pass: v5.10.136-cip14-542-g97767707d3d0)


cip-gitlab/ci/iwamatsu/linux-5.10.y-cip-rc build: 190 builds: 3 failed, 187 passed, 4 errors, 10 warnings (v5.10.138-cip15-90-gd4130d0ee3c7) #kernelci

kernelci.org bot <bot@...>
 

cip-gitlab/ci/iwamatsu/linux-5.10.y-cip-rc build: 190 builds: 3 failed, 187 passed, 4 errors, 10 warnings (v5.10.138-cip15-90-gd4130d0ee3c7)

Full Build Summary: https://kernelci.org/build/cip-gitlab/branch/ci%2Fiwamatsu%2Flinux-5.10.y-cip-rc/kernel/v5.10.138-cip15-90-gd4130d0ee3c7/

Tree: cip-gitlab
Branch: ci/iwamatsu/linux-5.10.y-cip-rc
Git Describe: v5.10.138-cip15-90-gd4130d0ee3c7
Git Commit: d4130d0ee3c72fc50c48ae861863e85537802c47
Git URL: https://gitlab.com/cip-project/cip-kernel/linux-cip.git
Built: 7 unique architectures

Build Failures Detected:

arm:
rpc_defconfig: (gcc-10) FAIL

mips:
ip27_defconfig: (gcc-10) FAIL
ip28_defconfig: (gcc-10) FAIL

Errors and Warnings Detected:

arc:

arm64:

arm:
rpc_defconfig (gcc-10): 4 errors

i386:

mips:
32r2el_defconfig (gcc-10): 1 warning
decstation_64_defconfig (gcc-10): 1 warning
decstation_defconfig (gcc-10): 1 warning
decstation_r4k_defconfig (gcc-10): 1 warning
lemote2f_defconfig (gcc-10): 1 warning
rm200_defconfig (gcc-10): 1 warning

riscv:
rv32_defconfig (gcc-10): 4 warnings

x86_64:

Errors summary:

2 arm-linux-gnueabihf-gcc: error: unrecognized -march target: armv3m
2 arm-linux-gnueabihf-gcc: error: missing argument to ‘-march=’

Warnings summary:

3 kernel/rcu/tasks.h:710:13: warning: ‘show_rcu_tasks_rude_gp_kthread’ defined but not used [-Wunused-function]
2 <stdin>:830:2: warning: #warning syscall fstat64 not implemented [-Wcpp]
2 <stdin>:1127:2: warning: #warning syscall fstatat64 not implemented [-Wcpp]
1 net/mac80211/mlme.c:4349:1: warning: the frame size of 1040 bytes is larger than 1024 bytes [-Wframe-larger-than=]
1 drivers/block/paride/bpck.c:32: warning: "PC" redefined
1 WARNING: modpost: Symbol info of vmlinux is missing. Unresolved symbol check will be entirely skipped.

Section mismatches summary:

1 WARNING: modpost: vmlinux.o(___ksymtab_gpl+ixp4xx_irq_init+0x0): Section mismatch in reference from the variable __ksymtab_ixp4xx_irq_init to the function .init.text:ixp4xx_irq_init()
1 WARNING: modpost: vmlinux.o(___ksymtab+prom_init_numa_memory+0x0): Section mismatch in reference from the variable __ksymtab_prom_init_numa_memory to the function .init.text:prom_init_numa_memory()

================================================================================

Detailed per-defconfig build reports:

--------------------------------------------------------------------------------
32r2el_defconfig (mips, gcc-10) — PASS, 0 errors, 1 warning, 0 section mismatches

Warnings:
WARNING: modpost: Symbol info of vmlinux is missing. Unresolved symbol check will be entirely skipped.

--------------------------------------------------------------------------------
allnoconfig (i386, gcc-10) — PASS, 0 errors, 0 warnings, 0 section mismatches

--------------------------------------------------------------------------------
allnoconfig (arc, gcc-10) — PASS, 0 errors, 0 warnings, 0 section mismatches

--------------------------------------------------------------------------------
allnoconfig (x86_64, gcc-10) — PASS, 0 errors, 0 warnings, 0 section mismatches

--------------------------------------------------------------------------------
am200epdkit_defconfig (arm, gcc-10) — PASS, 0 errors, 0 warnings, 0 section mismatches

--------------------------------------------------------------------------------
ar7_defconfig (mips, gcc-10) — PASS, 0 errors, 0 warnings, 0 section mismatches

--------------------------------------------------------------------------------
aspeed_g4_defconfig (arm, gcc-10) — PASS, 0 errors, 0 warnings, 0 section mismatches

--------------------------------------------------------------------------------
aspeed_g5_defconfig (arm, gcc-10) — PASS, 0 errors, 0 warnings, 0 section mismatches

--------------------------------------------------------------------------------
assabet_defconfig (arm, gcc-10) — PASS, 0 errors, 0 warnings, 0 section mismatches

--------------------------------------------------------------------------------
at91_dt_defconfig (arm, gcc-10) — PASS, 0 errors, 0 warnings, 0 section mismatches

--------------------------------------------------------------------------------
ath25_defconfig (mips, gcc-10) — PASS, 0 errors, 0 warnings, 0 section mismatches

--------------------------------------------------------------------------------
ath79_defconfig (mips, gcc-10) — PASS, 0 errors, 0 warnings, 0 section mismatches

--------------------------------------------------------------------------------
axm55xx_defconfig (arm, gcc-10) — PASS, 0 errors, 0 warnings, 0 section mismatches

--------------------------------------------------------------------------------
axs103_defconfig (arc, gcc-10) — PASS, 0 errors, 0 warnings, 0 section mismatches

--------------------------------------------------------------------------------
axs103_smp_defconfig (arc, gcc-10) — PASS, 0 errors, 0 warnings, 0 section mismatches

--------------------------------------------------------------------------------
badge4_defconfig (arm, gcc-10) — PASS, 0 errors, 0 warnings, 0 section mismatches

--------------------------------------------------------------------------------
bcm2835_defconfig (arm, gcc-10) — PASS, 0 errors, 0 warnings, 0 section mismatches

--------------------------------------------------------------------------------
bcm47xx_defconfig (mips, gcc-10) — PASS, 0 errors, 0 warnings, 0 section mismatches

--------------------------------------------------------------------------------
bcm63xx_defconfig (mips, gcc-10) — PASS, 0 errors, 0 warnings, 0 section mismatches

--------------------------------------------------------------------------------
bigsur_defconfig (mips, gcc-10) — PASS, 0 errors, 0 warnings, 0 section mismatches

--------------------------------------------------------------------------------
bmips_be_defconfig (mips, gcc-10) — PASS, 0 errors, 0 warnings, 0 section mismatches

--------------------------------------------------------------------------------
bmips_stb_defconfig (mips, gcc-10) — PASS, 0 errors, 0 warnings, 0 section mismatches

--------------------------------------------------------------------------------
capcella_defconfig (mips, gcc-10) — PASS, 0 errors, 0 warnings, 0 section mismatches

--------------------------------------------------------------------------------
cavium_octeon_defconfig (mips, gcc-10) — PASS, 0 errors, 0 warnings, 0 section mismatches

--------------------------------------------------------------------------------
cerfcube_defconfig (arm, gcc-10) — PASS, 0 errors, 0 warnings, 0 section mismatches

--------------------------------------------------------------------------------
ci20_defconfig (mips, gcc-10) — PASS, 0 errors, 0 warnings, 0 section mismatches

--------------------------------------------------------------------------------
cm_x300_defconfig (arm, gcc-10) — PASS, 0 errors, 0 warnings, 0 section mismatches

--------------------------------------------------------------------------------
cobalt_defconfig (mips, gcc-10) — PASS, 0 errors, 0 warnings, 0 section mismatches

--------------------------------------------------------------------------------
colibri_pxa270_defconfig (arm, gcc-10) — PASS, 0 errors, 0 warnings, 0 section mismatches

--------------------------------------------------------------------------------
colibri_pxa300_defconfig (arm, gcc-10) — PASS, 0 errors, 0 warnings, 0 section mismatches

--------------------------------------------------------------------------------
collie_defconfig (arm, gcc-10) — PASS, 0 errors, 0 warnings, 0 section mismatches

--------------------------------------------------------------------------------
corgi_defconfig (arm, gcc-10) — PASS, 0 errors, 0 warnings, 0 section mismatches

--------------------------------------------------------------------------------
cu1000-neo_defconfig (mips, gcc-10) — PASS, 0 errors, 0 warnings, 0 section mismatches

--------------------------------------------------------------------------------
cu1830-neo_defconfig (mips, gcc-10) — PASS, 0 errors, 0 warnings, 0 section mismatches

--------------------------------------------------------------------------------
davinci_all_defconfig (arm, gcc-10) — PASS, 0 errors, 0 warnings, 0 section mismatches

--------------------------------------------------------------------------------
db1xxx_defconfig (mips, gcc-10) — PASS, 0 errors, 0 warnings, 0 section mismatches

--------------------------------------------------------------------------------
decstation_64_defconfig (mips, gcc-10) — PASS, 0 errors, 1 warning, 0 section mismatches

Warnings:
kernel/rcu/tasks.h:710:13: warning: ‘show_rcu_tasks_rude_gp_kthread’ defined but not used [-Wunused-function]

--------------------------------------------------------------------------------
decstation_defconfig (mips, gcc-10) — PASS, 0 errors, 1 warning, 0 section mismatches

Warnings:
kernel/rcu/tasks.h:710:13: warning: ‘show_rcu_tasks_rude_gp_kthread’ defined but not used [-Wunused-function]

--------------------------------------------------------------------------------
decstation_r4k_defconfig (mips, gcc-10) — PASS, 0 errors, 1 warning, 0 section mismatches

Warnings:
kernel/rcu/tasks.h:710:13: warning: ‘show_rcu_tasks_rude_gp_kthread’ defined but not used [-Wunused-function]

--------------------------------------------------------------------------------
defconfig (riscv, gcc-10) — PASS, 0 errors, 0 warnings, 0 section mismatches

--------------------------------------------------------------------------------
defconfig (arm64, gcc-10) — PASS, 0 errors, 0 warnings, 0 section mismatches

--------------------------------------------------------------------------------
defconfig+arm64-chromebook (arm64, gcc-10) — PASS, 0 errors, 0 warnings, 0 section mismatches

--------------------------------------------------------------------------------
defconfig+arm64-chromebook+kselftest (arm64, gcc-10) — PASS, 0 errors, 0 warnings, 0 section mismatches

--------------------------------------------------------------------------------
defconfig+kselftest (arm64, gcc-10) — PASS, 0 errors, 0 warnings, 0 section mismatches

--------------------------------------------------------------------------------
dove_defconfig (arm, gcc-10) — PASS, 0 errors, 0 warnings, 0 section mismatches

--------------------------------------------------------------------------------
e55_defconfig (mips, gcc-10) — PASS, 0 errors, 0 warnings, 0 section mismatches

--------------------------------------------------------------------------------
ebsa110_defconfig (arm, gcc-10) — PASS, 0 errors, 0 warnings, 0 section mismatches

--------------------------------------------------------------------------------
efm32_defconfig (arm, gcc-10) — PASS, 0 errors, 0 warnings, 0 section mismatches

--------------------------------------------------------------------------------
ep93xx_defconfig (arm, gcc-10) — PASS, 0 errors, 0 warnings, 0 section mismatches

--------------------------------------------------------------------------------
eseries_pxa_defconfig (arm, gcc-10) — PASS, 0 errors, 0 warnings, 0 section mismatches

--------------------------------------------------------------------------------
exynos_defconfig (arm, gcc-10) — PASS, 0 errors, 0 warnings, 0 section mismatches

--------------------------------------------------------------------------------
ezx_defconfig (arm, gcc-10) — PASS, 0 errors, 0 warnings, 0 section mismatches

--------------------------------------------------------------------------------
footbridge_defconfig (arm, gcc-10) — PASS, 0 errors, 0 warnings, 0 section mismatches

--------------------------------------------------------------------------------
fuloong2e_defconfig (mips, gcc-10) — PASS, 0 errors, 0 warnings, 0 section mismatches

--------------------------------------------------------------------------------
gcw0_defconfig (mips, gcc-10) — PASS, 0 errors, 0 warnings, 0 section mismatches

--------------------------------------------------------------------------------
gemini_defconfig (arm, gcc-10) — PASS, 0 errors, 0 warnings, 0 section mismatches

--------------------------------------------------------------------------------
gpr_defconfig (mips, gcc-10) — PASS, 0 errors, 0 warnings, 0 section mismatches

--------------------------------------------------------------------------------
h3600_defconfig (arm, gcc-10) — PASS, 0 errors, 0 warnings, 0 section mismatches

--------------------------------------------------------------------------------
h5000_defconfig (arm, gcc-10) — PASS, 0 errors, 0 warnings, 0 section mismatches

--------------------------------------------------------------------------------
hackkit_defconfig (arm, gcc-10) — PASS, 0 errors, 0 warnings, 0 section mismatches

--------------------------------------------------------------------------------
haps_hs_defconfig (arc, gcc-10) — PASS, 0 errors, 0 warnings, 0 section mismatches

--------------------------------------------------------------------------------
haps_hs_smp_defconfig (arc, gcc-10) — PASS, 0 errors, 0 warnings, 0 section mismatches

--------------------------------------------------------------------------------
hisi_defconfig (arm, gcc-10) — PASS, 0 errors, 0 warnings, 0 section mismatches

--------------------------------------------------------------------------------
hsdk_defconfig (arc, gcc-10) — PASS, 0 errors, 0 warnings, 0 section mismatches

--------------------------------------------------------------------------------
i386_defconfig (i386, gcc-10) — PASS, 0 errors, 0 warnings, 0 section mismatches

--------------------------------------------------------------------------------
imote2_defconfig (arm, gcc-10) — PASS, 0 errors, 0 warnings, 0 section mismatches

--------------------------------------------------------------------------------
imx_v4_v5_defconfig (arm, gcc-10) — PASS, 0 errors, 0 warnings, 0 section mismatches

--------------------------------------------------------------------------------
imx_v6_v7_defconfig (arm, gcc-10) — PASS, 0 errors, 0 warnings, 0 section mismatches

--------------------------------------------------------------------------------
integrator_defconfig (arm, gcc-10) — PASS, 0 errors, 0 warnings, 0 section mismatches

--------------------------------------------------------------------------------
iop32x_defconfig (arm, gcc-10) — PASS, 0 errors, 0 warnings, 0 section mismatches

--------------------------------------------------------------------------------
ip22_defconfig (mips, gcc-10) — PASS, 0 errors, 0 warnings, 0 section mismatches

--------------------------------------------------------------------------------
ip27_defconfig (mips, gcc-10) — FAIL, 0 errors, 0 warnings, 0 section mismatches

--------------------------------------------------------------------------------
ip28_defconfig (mips, gcc-10) — FAIL, 0 errors, 0 warnings, 0 section mismatches

--------------------------------------------------------------------------------
ip32_defconfig (mips, gcc-10) — PASS, 0 errors, 0 warnings, 0 section mismatches

--------------------------------------------------------------------------------
ixp4xx_defconfig (arm, gcc-10) — PASS, 0 errors, 0 warnings, 0 section mismatches

Section mismatches:
WARNING: modpost: vmlinux.o(___ksymtab_gpl+ixp4xx_irq_init+0x0): Section mismatch in reference from the variable __ksymtab_ixp4xx_irq_init to the function .init.text:ixp4xx_irq_init()

--------------------------------------------------------------------------------
jazz_defconfig (mips, gcc-10) — PASS, 0 errors, 0 warnings, 0 section mismatches

--------------------------------------------------------------------------------
jmr3927_defconfig (mips, gcc-10) — PASS, 0 errors, 0 warnings, 0 section mismatches

--------------------------------------------------------------------------------
jornada720_defconfig (arm, gcc-10) — PASS, 0 errors, 0 warnings, 0 section mismatches

--------------------------------------------------------------------------------
keystone_defconfig (arm, gcc-10) — PASS, 0 errors, 0 warnings, 0 section mismatches

--------------------------------------------------------------------------------
lart_defconfig (arm, gcc-10) — PASS, 0 errors, 0 warnings, 0 section mismatches

--------------------------------------------------------------------------------
lemote2f_defconfig (mips, gcc-10) — PASS, 0 errors, 1 warning, 0 section mismatches

Warnings:
net/mac80211/mlme.c:4349:1: warning: the frame size of 1040 bytes is larger than 1024 bytes [-Wframe-larger-than=]

--------------------------------------------------------------------------------
loongson1b_defconfig (mips, gcc-10) — PASS, 0 errors, 0 warnings, 0 section mismatches

--------------------------------------------------------------------------------
loongson1c_defconfig (mips, gcc-10) — PASS, 0 errors, 0 warnings, 0 section mismatches

--------------------------------------------------------------------------------
loongson3_defconfig (mips, gcc-10) — PASS, 0 errors, 0 warnings, 0 section mismatches

Section mismatches:
WARNING: modpost: vmlinux.o(___ksymtab+prom_init_numa_memory+0x0): Section mismatch in reference from the variable __ksymtab_prom_init_numa_memory to the function .init.text:prom_init_numa_memory()

--------------------------------------------------------------------------------
lpc18xx_defconfig (arm, gcc-10) — PASS, 0 errors, 0 warnings, 0 section mismatches

--------------------------------------------------------------------------------
lpc32xx_defconfig (arm, gcc-10) — PASS, 0 errors, 0 warnings, 0 section mismatches

--------------------------------------------------------------------------------
lpd270_defconfig (arm, gcc-10) — PASS, 0 errors, 0 warnings, 0 section mismatches

--------------------------------------------------------------------------------
lubbock_defconfig (arm, gcc-10) — PASS, 0 errors, 0 warnings, 0 section mismatches

--------------------------------------------------------------------------------
magician_defconfig (arm, gcc-10) — PASS, 0 errors, 0 warnings, 0 section mismatches

--------------------------------------------------------------------------------
mainstone_defconfig (arm, gcc-10) — PASS, 0 errors, 0 warnings, 0 section mismatches

--------------------------------------------------------------------------------
malta_defconfig (mips, gcc-10) — PASS, 0 errors, 0 warnings, 0 section mismatches

--------------------------------------------------------------------------------
malta_kvm_defconfig (mips, gcc-10) — PASS, 0 errors, 0 warnings, 0 section mismatches

--------------------------------------------------------------------------------
malta_kvm_guest_defconfig (mips, gcc-10) — PASS, 0 errors, 0 warnings, 0 section mismatches

--------------------------------------------------------------------------------
malta_qemu_32r6_defconfig (mips, gcc-10) — PASS, 0 errors, 0 warnings, 0 section mismatches

--------------------------------------------------------------------------------
maltaaprp_defconfig (mips, gcc-10) — PASS, 0 errors, 0 warnings, 0 section mismatches

--------------------------------------------------------------------------------
maltasmvp_defconfig (mips, gcc-10) — PASS, 0 errors, 0 warnings, 0 section mismatches

--------------------------------------------------------------------------------
maltasmvp_eva_defconfig (mips, gcc-10) — PASS, 0 errors, 0 warnings, 0 section mismatches

--------------------------------------------------------------------------------
maltaup_defconfig (mips, gcc-10) — PASS, 0 errors, 0 warnings, 0 section mismatches

--------------------------------------------------------------------------------
maltaup_xpa_defconfig (mips, gcc-10) — PASS, 0 errors, 0 warnings, 0 section mismatches

--------------------------------------------------------------------------------
milbeaut_m10v_defconfig (arm, gcc-10) — PASS, 0 errors, 0 warnings, 0 section mismatches

--------------------------------------------------------------------------------
mini2440_defconfig (arm, gcc-10) — PASS, 0 errors, 0 warnings, 0 section mismatches

--------------------------------------------------------------------------------
mmp2_defconfig (arm, gcc-10) — PASS, 0 errors, 0 warnings, 0 section mismatches

--------------------------------------------------------------------------------
moxart_defconfig (arm, gcc-10) — PASS, 0 errors, 0 warnings, 0 section mismatches

--------------------------------------------------------------------------------
mpc30x_defconfig (mips, gcc-10) — PASS, 0 errors, 0 warnings, 0 section mismatches

--------------------------------------------------------------------------------
mps2_defconfig (arm, gcc-10) — PASS, 0 errors, 0 warnings, 0 section mismatches

--------------------------------------------------------------------------------
mtx1_defconfig (mips, gcc-10) — PASS, 0 errors, 0 warnings, 0 section mismatches

--------------------------------------------------------------------------------
multi_v4t_defconfig (arm, gcc-10) — PASS, 0 errors, 0 warnings, 0 section mismatches

--------------------------------------------------------------------------------
multi_v5_defconfig (arm, gcc-10) — PASS, 0 errors, 0 warnings, 0 section mismatches

--------------------------------------------------------------------------------
multi_v7_defconfig (arm, gcc-10) — PASS, 0 errors, 0 warnings, 0 section mismatches

--------------------------------------------------------------------------------
multi_v7_defconfig+kselftest (arm, gcc-10) — PASS, 0 errors, 0 warnings, 0 section mismatches

--------------------------------------------------------------------------------
mvebu_v5_defconfig (arm, gcc-10) — PASS, 0 errors, 0 warnings, 0 section mismatches

--------------------------------------------------------------------------------
mvebu_v7_defconfig (arm, gcc-10) — PASS, 0 errors, 0 warnings, 0 section mismatches

--------------------------------------------------------------------------------
mxs_defconfig (arm, gcc-10) — PASS, 0 errors, 0 warnings, 0 section mismatches

--------------------------------------------------------------------------------
neponset_defconfig (arm, gcc-10) — PASS, 0 errors, 0 warnings, 0 section mismatches

--------------------------------------------------------------------------------
netwinder_defconfig (arm, gcc-10) — PASS, 0 errors, 0 warnings, 0 section mismatches

--------------------------------------------------------------------------------
nhk8815_defconfig (arm, gcc-10) — PASS, 0 errors, 0 warnings, 0 section mismatches

--------------------------------------------------------------------------------
nlm_xlp_defconfig (mips, gcc-10) — PASS, 0 errors, 0 warnings, 0 section mismatches

--------------------------------------------------------------------------------
nlm_xlr_defconfig (mips, gcc-10) — PASS, 0 errors, 0 warnings, 0 section mismatches

--------------------------------------------------------------------------------
nommu_k210_defconfig (riscv, gcc-10) — PASS, 0 errors, 0 warnings, 0 section mismatches

--------------------------------------------------------------------------------
nsimosci_hs_defconfig (arc, gcc-10) — PASS, 0 errors, 0 warnings, 0 section mismatches

--------------------------------------------------------------------------------
nsimosci_hs_smp_defconfig (arc, gcc-10) — PASS, 0 errors, 0 warnings, 0 section mismatches

--------------------------------------------------------------------------------
omap1_defconfig (arm, gcc-10) — PASS, 0 errors, 0 warnings, 0 section mismatches

--------------------------------------------------------------------------------
omap2plus_defconfig (arm, gcc-10) — PASS, 0 errors, 0 warnings, 0 section mismatches

--------------------------------------------------------------------------------
omega2p_defconfig (mips, gcc-10) — PASS, 0 errors, 0 warnings, 0 section mismatches

--------------------------------------------------------------------------------
orion5x_defconfig (arm, gcc-10) — PASS, 0 errors, 0 warnings, 0 section mismatches

--------------------------------------------------------------------------------
oxnas_v6_defconfig (arm, gcc-10) — PASS, 0 errors, 0 warnings, 0 section mismatches

--------------------------------------------------------------------------------
palmz72_defconfig (arm, gcc-10) — PASS, 0 errors, 0 warnings, 0 section mismatches

--------------------------------------------------------------------------------
pcm027_defconfig (arm, gcc-10) — PASS, 0 errors, 0 warnings, 0 section mismatches

--------------------------------------------------------------------------------
pic32mzda_defconfig (mips, gcc-10) — PASS, 0 errors, 0 warnings, 0 section mismatches

--------------------------------------------------------------------------------
pistachio_defconfig (mips, gcc-10) — PASS, 0 errors, 0 warnings, 0 section mismatches

--------------------------------------------------------------------------------
pleb_defconfig (arm, gcc-10) — PASS, 0 errors, 0 warnings, 0 section mismatches

--------------------------------------------------------------------------------
prima2_defconfig (arm, gcc-10) — PASS, 0 errors, 0 warnings, 0 section mismatches

--------------------------------------------------------------------------------
pxa168_defconfig (arm, gcc-10) — PASS, 0 errors, 0 warnings, 0 section mismatches

--------------------------------------------------------------------------------
pxa255-idp_defconfig (arm, gcc-10) — PASS, 0 errors, 0 warnings, 0 section mismatches

--------------------------------------------------------------------------------
pxa3xx_defconfig (arm, gcc-10) — PASS, 0 errors, 0 warnings, 0 section mismatches

--------------------------------------------------------------------------------
pxa910_defconfig (arm, gcc-10) — PASS, 0 errors, 0 warnings, 0 section mismatches

--------------------------------------------------------------------------------
pxa_defconfig (arm, gcc-10) — PASS, 0 errors, 0 warnings, 0 section mismatches

--------------------------------------------------------------------------------
qcom_defconfig (arm, gcc-10) — PASS, 0 errors, 0 warnings, 0 section mismatches

--------------------------------------------------------------------------------
qi_lb60_defconfig (mips, gcc-10) — PASS, 0 errors, 0 warnings, 0 section mismatches

--------------------------------------------------------------------------------
rb532_defconfig (mips, gcc-10) — PASS, 0 errors, 0 warnings, 0 section mismatches

--------------------------------------------------------------------------------
rbtx49xx_defconfig (mips, gcc-10) — PASS, 0 errors, 0 warnings, 0 section mismatches

--------------------------------------------------------------------------------
realview_defconfig (arm, gcc-10) — PASS, 0 errors, 0 warnings, 0 section mismatches

--------------------------------------------------------------------------------
rm200_defconfig (mips, gcc-10) — PASS, 0 errors, 1 warning, 0 section mismatches

Warnings:
drivers/block/paride/bpck.c:32: warning: "PC" redefined

--------------------------------------------------------------------------------
rpc_defconfig (arm, gcc-10) — FAIL, 4 errors, 0 warnings, 0 section mismatches

Errors:
arm-linux-gnueabihf-gcc: error: unrecognized -march target: armv3m
arm-linux-gnueabihf-gcc: error: missing argument to ‘-march=’
arm-linux-gnueabihf-gcc: error: unrecognized -march target: armv3m
arm-linux-gnueabihf-gcc: error: missing argument to ‘-march=’

--------------------------------------------------------------------------------
rs90_defconfig (mips, gcc-10) — PASS, 0 errors, 0 warnings, 0 section mismatches

--------------------------------------------------------------------------------
rt305x_defconfig (mips, gcc-10) — PASS, 0 errors, 0 warnings, 0 section mismatches

--------------------------------------------------------------------------------
rv32_defconfig (riscv, gcc-10) — PASS, 0 errors, 4 warnings, 0 section mismatches

Warnings:
<stdin>:830:2: warning: #warning syscall fstat64 not implemented [-Wcpp]
<stdin>:1127:2: warning: #warning syscall fstatat64 not implemented [-Wcpp]
<stdin>:830:2: warning: #warning syscall fstat64 not implemented [-Wcpp]
<stdin>:1127:2: warning: #warning syscall fstatat64 not implemented [-Wcpp]

--------------------------------------------------------------------------------
s3c2410_defconfig (arm, gcc-10) — PASS, 0 errors, 0 warnings, 0 section mismatches

--------------------------------------------------------------------------------
s3c6400_defconfig (arm, gcc-10) — PASS, 0 errors, 0 warnings, 0 section mismatches

--------------------------------------------------------------------------------
s5pv210_defconfig (arm, gcc-10) — PASS, 0 errors, 0 warnings, 0 section mismatches

--------------------------------------------------------------------------------
sama5_defconfig (arm, gcc-10) — PASS, 0 errors, 0 warnings, 0 section mismatches

--------------------------------------------------------------------------------
sb1250_swarm_defconfig (mips, gcc-10) — PASS, 0 errors, 0 warnings, 0 section mismatches

--------------------------------------------------------------------------------
shannon_defconfig (arm, gcc-10) — PASS, 0 errors, 0 warnings, 0 section mismatches

--------------------------------------------------------------------------------
shmobile_defconfig (arm, gcc-10) — PASS, 0 errors, 0 warnings, 0 section mismatches

--------------------------------------------------------------------------------
simpad_defconfig (arm, gcc-10) — PASS, 0 errors, 0 warnings, 0 section mismatches

--------------------------------------------------------------------------------
socfpga_defconfig (arm, gcc-10) — PASS, 0 errors, 0 warnings, 0 section mismatches

--------------------------------------------------------------------------------
spear13xx_defconfig (arm, gcc-10) — PASS, 0 errors, 0 warnings, 0 section mismatches

--------------------------------------------------------------------------------
spear3xx_defconfig (arm, gcc-10) — PASS, 0 errors, 0 warnings, 0 section mismatches

--------------------------------------------------------------------------------
spear6xx_defconfig (arm, gcc-10) — PASS, 0 errors, 0 warnings, 0 section mismatches

--------------------------------------------------------------------------------
spitz_defconfig (arm, gcc-10) — PASS, 0 errors, 0 warnings, 0 section mismatches

--------------------------------------------------------------------------------
stm32_defconfig (arm, gcc-10) — PASS, 0 errors, 0 warnings, 0 section mismatches

--------------------------------------------------------------------------------
sunxi_defconfig (arm, gcc-10) — PASS, 0 errors, 0 warnings, 0 section mismatches

--------------------------------------------------------------------------------
tango4_defconfig (arm, gcc-10) — PASS, 0 errors, 0 warnings, 0 section mismatches

--------------------------------------------------------------------------------
tb0219_defconfig (mips, gcc-10) — PASS, 0 errors, 0 warnings, 0 section mismatches

--------------------------------------------------------------------------------
tb0226_defconfig (mips, gcc-10) — PASS, 0 errors, 0 warnings, 0 section mismatches

--------------------------------------------------------------------------------
tb0287_defconfig (mips, gcc-10) — PASS, 0 errors, 0 warnings, 0 section mismatches

--------------------------------------------------------------------------------
tct_hammer_defconfig (arm, gcc-10) — PASS, 0 errors, 0 warnings, 0 section mismatches

--------------------------------------------------------------------------------
tegra_defconfig (arm, gcc-10) — PASS, 0 errors, 0 warnings, 0 section mismatches

--------------------------------------------------------------------------------
tinyconfig (i386, gcc-10) — PASS, 0 errors, 0 warnings, 0 section mismatches

--------------------------------------------------------------------------------
tinyconfig (x86_64, gcc-10) — PASS, 0 errors, 0 warnings, 0 section mismatches

--------------------------------------------------------------------------------
tinyconfig (arc, gcc-10) — PASS, 0 errors, 0 warnings, 0 section mismatches

--------------------------------------------------------------------------------
trizeps4_defconfig (arm, gcc-10) — PASS, 0 errors, 0 warnings, 0 section mismatches

--------------------------------------------------------------------------------
u300_defconfig (arm, gcc-10) — PASS, 0 errors, 0 warnings, 0 section mismatches

--------------------------------------------------------------------------------
u8500_defconfig (arm, gcc-10) — PASS, 0 errors, 0 warnings, 0 section mismatches

--------------------------------------------------------------------------------
vdk_hs38_defconfig (arc, gcc-10) — PASS, 0 errors, 0 warnings, 0 section mismatches

--------------------------------------------------------------------------------
vdk_hs38_smp_defconfig (arc, gcc-10) — PASS, 0 errors, 0 warnings, 0 section mismatches

--------------------------------------------------------------------------------
versatile_defconfig (arm, gcc-10) — PASS, 0 errors, 0 warnings, 0 section mismatches

--------------------------------------------------------------------------------
vexpress_defconfig (arm, gcc-10) — PASS, 0 errors, 0 warnings, 0 section mismatches

--------------------------------------------------------------------------------
vf610m4_defconfig (arm, gcc-10) — PASS, 0 errors, 0 warnings, 0 section mismatches

--------------------------------------------------------------------------------
viper_defconfig (arm, gcc-10) — PASS, 0 errors, 0 warnings, 0 section mismatches

--------------------------------------------------------------------------------
vocore2_defconfig (mips, gcc-10) — PASS, 0 errors, 0 warnings, 0 section mismatches

--------------------------------------------------------------------------------
vt8500_v6_v7_defconfig (arm, gcc-10) — PASS, 0 errors, 0 warnings, 0 section mismatches

--------------------------------------------------------------------------------
workpad_defconfig (mips, gcc-10) — PASS, 0 errors, 0 warnings, 0 section mismatches

--------------------------------------------------------------------------------
x86_64_defconfig (x86_64, gcc-10) — PASS, 0 errors, 0 warnings, 0 section mismatches

--------------------------------------------------------------------------------
x86_64_defconfig+kselftest (x86_64, gcc-10) — PASS, 0 errors, 0 warnings, 0 section mismatches

--------------------------------------------------------------------------------
x86_64_defconfig+x86-chromebook (x86_64, gcc-10) — PASS, 0 errors, 0 warnings, 0 section mismatches

--------------------------------------------------------------------------------
x86_64_defconfig+x86-chromebook+kselftest (x86_64, gcc-10) — PASS, 0 errors, 0 warnings, 0 section mismatches

--------------------------------------------------------------------------------
xcep_defconfig (arm, gcc-10) — PASS, 0 errors, 0 warnings, 0 section mismatches

--------------------------------------------------------------------------------
zeus_defconfig (arm, gcc-10) — PASS, 0 errors, 0 warnings, 0 section mismatches

--------------------------------------------------------------------------------
zx_defconfig (arm, gcc-10) — PASS, 0 errors, 0 warnings, 0 section mismatches

---
For more info write to <info@...>


[PATCH 5.10.y-cip 26/26] arm64: dts: renesas: rzg2ul-smarc-som: Enable Ethernet on SMARC platform

Biju Das
 

commit 6494e4f90503cb4027632dfcedcb7a683d829db0 upstream.

Enable Ethernet{0,1} interfaces on RZ/G2UL SMARC EVK.

Ethernet0 pins are muxed with CAN0, CAN1, SSI1 and RSPI1 pins and Ethernet0
device selection is based on the SW1[3] switch position.

Set SW1[3] to position OFF for selecting CAN0, CAN1, SSI1 and RSPI1.
Set SW1[3] to position ON for selecting Ethernet0.

This patch disables Ethernet0 on RZ/G2UL SMARC platform by default.

Signed-off-by: Biju Das <biju.das.jz@...>
Reviewed-by: Lad Prabhakar <prabhakar.mahadev-lad.rj@...>
Link: https://lore.kernel.org/r/20220402081328.26292-8-biju.das.jz@bp.renesas.com
Signed-off-by: Geert Uytterhoeven <geert+renesas@...>
Signed-off-by: Biju Das <biju.das.jz@...>
---
.../boot/dts/renesas/rzg2ul-smarc-som.dtsi | 97 ++++++++++++++++++-
arch/arm64/boot/dts/renesas/rzg2ul-smarc.dtsi | 2 +
2 files changed, 98 insertions(+), 1 deletion(-)

diff --git a/arch/arm64/boot/dts/renesas/rzg2ul-smarc-som.dtsi b/arch/arm64/boot/dts/renesas/rzg2ul-smarc-som.dtsi
index 0d6fc0d84783..b0822679a55b 100644
--- a/arch/arm64/boot/dts/renesas/rzg2ul-smarc-som.dtsi
+++ b/arch/arm64/boot/dts/renesas/rzg2ul-smarc-som.dtsi
@@ -9,8 +9,13 @@
#include <dt-bindings/pinctrl/rzg2l-pinctrl.h>

/ {
+ aliases {
+ ethernet0 = &eth0;
+ ethernet1 = &eth1;
+ };
+
chosen {
- bootargs = "ignore_loglevel";
+ bootargs = "ignore_loglevel rw root=/dev/nfs ip=on";
};

memory@48000000 {
@@ -52,11 +57,101 @@ vccq_sdhi0: regulator-vccq-sdhi0 {
#endif
};

+#if (!SW_ET0_EN_N)
+&eth0 {
+ pinctrl-0 = <&eth0_pins>;
+ pinctrl-names = "default";
+ phy-handle = <&phy0>;
+ phy-mode = "rgmii-id";
+ status = "okay";
+
+ phy0: ethernet-phy@7 {
+ compatible = "ethernet-phy-id0022.1640",
+ "ethernet-phy-ieee802.3-c22";
+ reg = <7>;
+ rxc-skew-psec = <2400>;
+ txc-skew-psec = <2400>;
+ rxdv-skew-psec = <0>;
+ txdv-skew-psec = <0>;
+ rxd0-skew-psec = <0>;
+ rxd1-skew-psec = <0>;
+ rxd2-skew-psec = <0>;
+ rxd3-skew-psec = <0>;
+ txd0-skew-psec = <0>;
+ txd1-skew-psec = <0>;
+ txd2-skew-psec = <0>;
+ txd3-skew-psec = <0>;
+ };
+};
+#endif
+
+&eth1 {
+ pinctrl-0 = <&eth1_pins>;
+ pinctrl-names = "default";
+ phy-handle = <&phy1>;
+ phy-mode = "rgmii-id";
+ status = "okay";
+
+ phy1: ethernet-phy@7 {
+ compatible = "ethernet-phy-id0022.1640",
+ "ethernet-phy-ieee802.3-c22";
+ reg = <7>;
+ rxc-skew-psec = <2400>;
+ txc-skew-psec = <2400>;
+ rxdv-skew-psec = <0>;
+ txdv-skew-psec = <0>;
+ rxd0-skew-psec = <0>;
+ rxd1-skew-psec = <0>;
+ rxd2-skew-psec = <0>;
+ rxd3-skew-psec = <0>;
+ txd0-skew-psec = <0>;
+ txd1-skew-psec = <0>;
+ txd2-skew-psec = <0>;
+ txd3-skew-psec = <0>;
+ };
+};
+
&extal_clk {
clock-frequency = <24000000>;
};

&pinctrl {
+ eth0_pins: eth0 {
+ pinmux = <RZG2L_PORT_PINMUX(4, 5, 1)>, /* ET0_LINKSTA */
+ <RZG2L_PORT_PINMUX(4, 3, 1)>, /* ET0_MDC */
+ <RZG2L_PORT_PINMUX(4, 4, 1)>, /* ET0_MDIO */
+ <RZG2L_PORT_PINMUX(1, 0, 1)>, /* ET0_TXC */
+ <RZG2L_PORT_PINMUX(1, 1, 1)>, /* ET0_TX_CTL */
+ <RZG2L_PORT_PINMUX(1, 2, 1)>, /* ET0_TXD0 */
+ <RZG2L_PORT_PINMUX(1, 3, 1)>, /* ET0_TXD1 */
+ <RZG2L_PORT_PINMUX(1, 4, 1)>, /* ET0_TXD2 */
+ <RZG2L_PORT_PINMUX(2, 0, 1)>, /* ET0_TXD3 */
+ <RZG2L_PORT_PINMUX(3, 0, 1)>, /* ET0_RXC */
+ <RZG2L_PORT_PINMUX(3, 1, 1)>, /* ET0_RX_CTL */
+ <RZG2L_PORT_PINMUX(3, 2, 1)>, /* ET0_RXD0 */
+ <RZG2L_PORT_PINMUX(3, 3, 1)>, /* ET0_RXD1 */
+ <RZG2L_PORT_PINMUX(4, 0, 1)>, /* ET0_RXD2 */
+ <RZG2L_PORT_PINMUX(4, 1, 1)>; /* ET0_RXD3 */
+ };
+
+ eth1_pins: eth1 {
+ pinmux = <RZG2L_PORT_PINMUX(10, 4, 1)>, /* ET1_LINKSTA */
+ <RZG2L_PORT_PINMUX(10, 2, 1)>, /* ET1_MDC */
+ <RZG2L_PORT_PINMUX(10, 3, 1)>, /* ET1_MDIO */
+ <RZG2L_PORT_PINMUX(7, 0, 1)>, /* ET1_TXC */
+ <RZG2L_PORT_PINMUX(7, 1, 1)>, /* ET1_TX_CTL */
+ <RZG2L_PORT_PINMUX(7, 2, 1)>, /* ET1_TXD0 */
+ <RZG2L_PORT_PINMUX(7, 3, 1)>, /* ET1_TXD1 */
+ <RZG2L_PORT_PINMUX(7, 4, 1)>, /* ET1_TXD2 */
+ <RZG2L_PORT_PINMUX(8, 0, 1)>, /* ET1_TXD3 */
+ <RZG2L_PORT_PINMUX(8, 4, 1)>, /* ET1_RXC */
+ <RZG2L_PORT_PINMUX(9, 0, 1)>, /* ET1_RX_CTL */
+ <RZG2L_PORT_PINMUX(9, 1, 1)>, /* ET1_RXD0 */
+ <RZG2L_PORT_PINMUX(9, 2, 1)>, /* ET1_RXD1 */
+ <RZG2L_PORT_PINMUX(9, 3, 1)>, /* ET1_RXD2 */
+ <RZG2L_PORT_PINMUX(10, 0, 1)>; /* ET1_RXD3 */
+ };
+
sdhi0_emmc_pins: sd0emmc {
sd0_emmc_data {
pins = "SD0_DATA0", "SD0_DATA1", "SD0_DATA2", "SD0_DATA3",
diff --git a/arch/arm64/boot/dts/renesas/rzg2ul-smarc.dtsi b/arch/arm64/boot/dts/renesas/rzg2ul-smarc.dtsi
index f8c90ff676fe..056a77369c8d 100644
--- a/arch/arm64/boot/dts/renesas/rzg2ul-smarc.dtsi
+++ b/arch/arm64/boot/dts/renesas/rzg2ul-smarc.dtsi
@@ -9,9 +9,11 @@
* DIP-Switch SW1 setting
* 1 : High; 0: Low
* SW1-2 : SW_SD0_DEV_SEL (0: uSD; 1: eMMC)
+ * SW1-3 : SW_ET0_EN_N (0: ETHER0; 1: CAN0, CAN1, SSI1, RSPI1)
* Please change below macros according to SW1 setting
*/
#define SW_SW0_DEV_SEL 1
+#define SW_ET0_EN_N 1

#include "rzg2ul-smarc-som.dtsi"
#include "rzg2ul-smarc-pinfunction.dtsi"
--
2.25.1


[PATCH 5.10.y-cip 25/26] arm64: dts: renesas: rzg2ul-smarc-som: Enable eMMC on SMARC platform

Biju Das
 

commit ed8efe50b76e751791a9aa4ce1f95fe3d9d794ac upstream.

RZ/G2UL SoM has both 64GB eMMC and microSD connected to SDHI0.

Both these interfaces are mutually exclusive and the SD0 device
selection is based on SW1[2] on SoM module.

Set SW1[2] to position OFF for selecting eMMC
Set SW1[2] to position ON for selecting microSD

This patch enables eMMC on RZ/G2UL SMARC platform by default.

Signed-off-by: Biju Das <biju.das.jz@...>
Reviewed-by: Lad Prabhakar <prabhakar.mahadev-lad.rj@...>
Link: https://lore.kernel.org/r/20220402081328.26292-7-biju.das.jz@bp.renesas.com
Signed-off-by: Geert Uytterhoeven <geert+renesas@...>
Signed-off-by: Biju Das <biju.das.jz@...>
---
.../boot/dts/renesas/rzg2ul-smarc-som.dtsi | 104 ++++++++++++++++++
arch/arm64/boot/dts/renesas/rzg2ul-smarc.dtsi | 8 ++
2 files changed, 112 insertions(+)

diff --git a/arch/arm64/boot/dts/renesas/rzg2ul-smarc-som.dtsi b/arch/arm64/boot/dts/renesas/rzg2ul-smarc-som.dtsi
index 8ecc650099a7..0d6fc0d84783 100644
--- a/arch/arm64/boot/dts/renesas/rzg2ul-smarc-som.dtsi
+++ b/arch/arm64/boot/dts/renesas/rzg2ul-smarc-som.dtsi
@@ -19,6 +19,15 @@ memory@48000000 {
reg = <0x0 0x48000000 0x0 0x38000000>;
};

+ reg_1p8v: regulator0 {
+ compatible = "regulator-fixed";
+ regulator-name = "fixed-1.8V";
+ regulator-min-microvolt = <1800000>;
+ regulator-max-microvolt = <1800000>;
+ regulator-boot-on;
+ regulator-always-on;
+ };
+
reg_3p3v: regulator1 {
compatible = "regulator-fixed";
regulator-name = "fixed-3.3V";
@@ -27,8 +36,103 @@ reg_3p3v: regulator1 {
regulator-boot-on;
regulator-always-on;
};
+
+#if !(SW_SW0_DEV_SEL)
+ vccq_sdhi0: regulator-vccq-sdhi0 {
+ compatible = "regulator-gpio";
+
+ regulator-name = "SDHI0 VccQ";
+ regulator-min-microvolt = <1800000>;
+ regulator-max-microvolt = <3300000>;
+ states = <3300000 1>, <1800000 0>;
+ regulator-boot-on;
+ gpios = <&pinctrl RZG2L_GPIO(6, 2) GPIO_ACTIVE_HIGH>;
+ regulator-always-on;
+ };
+#endif
};

&extal_clk {
clock-frequency = <24000000>;
};
+
+&pinctrl {
+ sdhi0_emmc_pins: sd0emmc {
+ sd0_emmc_data {
+ pins = "SD0_DATA0", "SD0_DATA1", "SD0_DATA2", "SD0_DATA3",
+ "SD0_DATA4", "SD0_DATA5", "SD0_DATA6", "SD0_DATA7";
+ power-source = <1800>;
+ };
+
+ sd0_emmc_ctrl {
+ pins = "SD0_CLK", "SD0_CMD";
+ power-source = <1800>;
+ };
+
+ sd0_emmc_rst {
+ pins = "SD0_RST#";
+ power-source = <1800>;
+ };
+ };
+
+ sdhi0_pins: sd0 {
+ sd0_data {
+ pins = "SD0_DATA0", "SD0_DATA1", "SD0_DATA2", "SD0_DATA3";
+ power-source = <3300>;
+ };
+
+ sd0_ctrl {
+ pins = "SD0_CLK", "SD0_CMD";
+ power-source = <3300>;
+ };
+
+ sd0_mux {
+ pinmux = <RZG2L_PORT_PINMUX(0, 0, 1)>; /* SD0_CD */
+ };
+ };
+
+ sdhi0_pins_uhs: sd0_uhs {
+ sd0_data_uhs {
+ pins = "SD0_DATA0", "SD0_DATA1", "SD0_DATA2", "SD0_DATA3";
+ power-source = <1800>;
+ };
+
+ sd0_ctrl_uhs {
+ pins = "SD0_CLK", "SD0_CMD";
+ power-source = <1800>;
+ };
+
+ sd0_mux_uhs {
+ pinmux = <RZG2L_PORT_PINMUX(0, 0, 1)>; /* SD0_CD */
+ };
+ };
+};
+
+#if (SW_SW0_DEV_SEL)
+&sdhi0 {
+ pinctrl-0 = <&sdhi0_emmc_pins>;
+ pinctrl-1 = <&sdhi0_emmc_pins>;
+ pinctrl-names = "default", "state_uhs";
+
+ vmmc-supply = <&reg_3p3v>;
+ vqmmc-supply = <&reg_1p8v>;
+ bus-width = <8>;
+ mmc-hs200-1_8v;
+ non-removable;
+ fixed-emmc-driver-type = <1>;
+ status = "okay";
+};
+#else
+&sdhi0 {
+ pinctrl-0 = <&sdhi0_pins>;
+ pinctrl-1 = <&sdhi0_pins_uhs>;
+ pinctrl-names = "default", "state_uhs";
+
+ vmmc-supply = <&reg_3p3v>;
+ vqmmc-supply = <&vccq_sdhi0>;
+ bus-width = <4>;
+ sd-uhs-sdr50;
+ sd-uhs-sdr104;
+ status = "okay";
+};
+#endif
diff --git a/arch/arm64/boot/dts/renesas/rzg2ul-smarc.dtsi b/arch/arm64/boot/dts/renesas/rzg2ul-smarc.dtsi
index f47b4e2e0feb..f8c90ff676fe 100644
--- a/arch/arm64/boot/dts/renesas/rzg2ul-smarc.dtsi
+++ b/arch/arm64/boot/dts/renesas/rzg2ul-smarc.dtsi
@@ -5,6 +5,14 @@
* Copyright (C) 2022 Renesas Electronics Corp.
*/

+/*
+ * DIP-Switch SW1 setting
+ * 1 : High; 0: Low
+ * SW1-2 : SW_SD0_DEV_SEL (0: uSD; 1: eMMC)
+ * Please change below macros according to SW1 setting
+ */
+#define SW_SW0_DEV_SEL 1
+
#include "rzg2ul-smarc-som.dtsi"
#include "rzg2ul-smarc-pinfunction.dtsi"
#include "rz-smarc-common.dtsi"
--
2.25.1


[PATCH 5.10.y-cip 24/26] arm64: dts: renesas: rzg2ul-smarc: Enable microSD on SMARC platform

Biju Das
 

commit a74a0bf3f329415008c1a374118d27023a3d4735 upstream.

Enable the microSD card slot connected to SDHI1 on the RZ/G2UL SMARC
platform by removing the sdhi1 override which disabled it, and by adding
the necessary pinmux required for SDHI1.

This patch also adds gpios property to vccq_sdhi1 regulator.

Signed-off-by: Biju Das <biju.das.jz@...>
Reviewed-by: Lad Prabhakar <prabhakar.mahadev-lad.rj@...>
Link: https://lore.kernel.org/r/20220402081328.26292-6-biju.das.jz@bp.renesas.com
Signed-off-by: Geert Uytterhoeven <geert+renesas@...>
Signed-off-by: Biju Das <biju.das.jz@...>
---
.../boot/dts/renesas/r9a07g043u11-smarc.dts | 12 +-----
.../dts/renesas/rzg2ul-smarc-pinfunction.dtsi | 39 +++++++++++++++++++
.../boot/dts/renesas/rzg2ul-smarc-som.dtsi | 9 +++++
arch/arm64/boot/dts/renesas/rzg2ul-smarc.dtsi | 14 +++++++
4 files changed, 63 insertions(+), 11 deletions(-)
create mode 100644 arch/arm64/boot/dts/renesas/rzg2ul-smarc.dtsi

diff --git a/arch/arm64/boot/dts/renesas/r9a07g043u11-smarc.dts b/arch/arm64/boot/dts/renesas/r9a07g043u11-smarc.dts
index 64370faf8f6d..08a0404c6f0b 100644
--- a/arch/arm64/boot/dts/renesas/r9a07g043u11-smarc.dts
+++ b/arch/arm64/boot/dts/renesas/r9a07g043u11-smarc.dts
@@ -7,9 +7,7 @@

/dts-v1/;
#include "r9a07g043.dtsi"
-#include "rzg2ul-smarc-som.dtsi"
-#include "rzg2ul-smarc-pinfunction.dtsi"
-#include "rz-smarc-common.dtsi"
+#include "rzg2ul-smarc.dtsi"

/ {
model = "Renesas SMARC EVK based on r9a07g043u11";
@@ -74,14 +72,6 @@ &phyrst {
status = "disabled";
};

-&sdhi1 {
- /delete-property/ pinctrl-0;
- /delete-property/ pinctrl-1;
- /delete-property/ pinctrl-names;
- /delete-property/ vmmc-supply;
- status = "disabled";
-};
-
&spi1 {
/delete-property/ pinctrl-0;
/delete-property/ pinctrl-names;
diff --git a/arch/arm64/boot/dts/renesas/rzg2ul-smarc-pinfunction.dtsi b/arch/arm64/boot/dts/renesas/rzg2ul-smarc-pinfunction.dtsi
index 2db9c92cf01f..b515748e6a9a 100644
--- a/arch/arm64/boot/dts/renesas/rzg2ul-smarc-pinfunction.dtsi
+++ b/arch/arm64/boot/dts/renesas/rzg2ul-smarc-pinfunction.dtsi
@@ -17,6 +17,45 @@ scif0_pins: scif0 {
<RZG2L_PORT_PINMUX(6, 3, 6)>; /* RxD */
};

+ sd1-pwr-en-hog {
+ gpio-hog;
+ gpios = <RZG2L_GPIO(0, 3) GPIO_ACTIVE_HIGH>;
+ output-high;
+ line-name = "sd1_pwr_en";
+ };
+
+ sdhi1_pins: sd1 {
+ sd1_data {
+ pins = "SD1_DATA0", "SD1_DATA1", "SD1_DATA2", "SD1_DATA3";
+ power-source = <3300>;
+ };
+
+ sd1_ctrl {
+ pins = "SD1_CLK", "SD1_CMD";
+ power-source = <3300>;
+ };
+
+ sd1_mux {
+ pinmux = <RZG2L_PORT_PINMUX(0, 2, 1)>; /* SD1_CD */
+ };
+ };
+
+ sdhi1_pins_uhs: sd1_uhs {
+ sd1_data_uhs {
+ pins = "SD1_DATA0", "SD1_DATA1", "SD1_DATA2", "SD1_DATA3";
+ power-source = <1800>;
+ };
+
+ sd1_ctrl_uhs {
+ pins = "SD1_CLK", "SD1_CMD";
+ power-source = <1800>;
+ };
+
+ sd1_mux_uhs {
+ pinmux = <RZG2L_PORT_PINMUX(0, 2, 1)>; /* SD1_CD */
+ };
+ };
+
sound_clk_pins: sound_clk {
pins = "AUDIO_CLK1", "AUDIO_CLK2";
input-enable;
diff --git a/arch/arm64/boot/dts/renesas/rzg2ul-smarc-som.dtsi b/arch/arm64/boot/dts/renesas/rzg2ul-smarc-som.dtsi
index 3bbb8fcd604c..8ecc650099a7 100644
--- a/arch/arm64/boot/dts/renesas/rzg2ul-smarc-som.dtsi
+++ b/arch/arm64/boot/dts/renesas/rzg2ul-smarc-som.dtsi
@@ -18,6 +18,15 @@ memory@48000000 {
/* first 128MB is reserved for secure area. */
reg = <0x0 0x48000000 0x0 0x38000000>;
};
+
+ reg_3p3v: regulator1 {
+ compatible = "regulator-fixed";
+ regulator-name = "fixed-3.3V";
+ regulator-min-microvolt = <3300000>;
+ regulator-max-microvolt = <3300000>;
+ regulator-boot-on;
+ regulator-always-on;
+ };
};

&extal_clk {
diff --git a/arch/arm64/boot/dts/renesas/rzg2ul-smarc.dtsi b/arch/arm64/boot/dts/renesas/rzg2ul-smarc.dtsi
new file mode 100644
index 000000000000..f47b4e2e0feb
--- /dev/null
+++ b/arch/arm64/boot/dts/renesas/rzg2ul-smarc.dtsi
@@ -0,0 +1,14 @@
+// SPDX-License-Identifier: (GPL-2.0-only OR BSD-2-Clause)
+/*
+ * Device Tree Source for the RZ/G2UL Type-1 SMARC EVK parts
+ *
+ * Copyright (C) 2022 Renesas Electronics Corp.
+ */
+
+#include "rzg2ul-smarc-som.dtsi"
+#include "rzg2ul-smarc-pinfunction.dtsi"
+#include "rz-smarc-common.dtsi"
+
+&vccq_sdhi1 {
+ gpios = <&pinctrl RZG2L_GPIO(6, 1) GPIO_ACTIVE_HIGH>;
+};
--
2.25.1


[PATCH 5.10.y-cip 23/26] arm64: defconfig: Enable ARCH_R9A07G043

Biju Das
 

commit 5c40b3ba9e9de22cc5c6a1edef54e4ec52fcf845 upstream.

Enable support for the Renesas RZ/G2UL SoC.

Signed-off-by: Biju Das <biju.das.jz@...>
Link: https://lore.kernel.org/r/20220423130206.114032-1-biju.das.jz@bp.renesas.com
Signed-off-by: Geert Uytterhoeven <geert+renesas@...>
Signed-off-by: Biju Das <biju.das.jz@...>
---
arch/arm64/configs/defconfig | 1 +
1 file changed, 1 insertion(+)

diff --git a/arch/arm64/configs/defconfig b/arch/arm64/configs/defconfig
index 7975a4b6a84a..1f1b96906f38 100644
--- a/arch/arm64/configs/defconfig
+++ b/arch/arm64/configs/defconfig
@@ -962,6 +962,7 @@ CONFIG_ARCH_R8A77970=y
CONFIG_ARCH_R8A77980=y
CONFIG_ARCH_R8A77990=y
CONFIG_ARCH_R8A77995=y
+CONFIG_ARCH_R9A07G043=y
CONFIG_ARCH_R9A07G044=y
CONFIG_ARCH_R9A07G054=y
CONFIG_ROCKCHIP_PM_DOMAINS=y
--
2.25.1


[PATCH 5.10.y-cip 22/26] arm64: dts: renesas: r9a07g043: Add GbEthernet nodes

Biju Das
 

commit 13ea8b3584c09f0ab94d5447ff2965d255329a88 upstream.

Add Gigabit Ethernet{0,1} nodes to SoC DTSI.

Signed-off-by: Biju Das <biju.das.jz@...>
Reviewed-by: Lad Prabhakar <prabhakar.mahadev-lad.rj@...>
Link: https://lore.kernel.org/r/20220402081328.26292-5-biju.das.jz@bp.renesas.com
Signed-off-by: Geert Uytterhoeven <geert+renesas@...>
Signed-off-by: Biju Das <biju.das.jz@...>
---
arch/arm64/boot/dts/renesas/r9a07g043.dtsi | 40 ++++++++++++++++++++++
1 file changed, 40 insertions(+)

diff --git a/arch/arm64/boot/dts/renesas/r9a07g043.dtsi b/arch/arm64/boot/dts/renesas/r9a07g043.dtsi
index c013d4fbe9f7..c8aadbe55278 100644
--- a/arch/arm64/boot/dts/renesas/r9a07g043.dtsi
+++ b/arch/arm64/boot/dts/renesas/r9a07g043.dtsi
@@ -365,6 +365,46 @@ sdhi1: mmc@11c10000 {
status = "disabled";
};

+ eth0: ethernet@11c20000 {
+ compatible = "renesas,r9a07g043-gbeth",
+ "renesas,rzg2l-gbeth";
+ reg = <0 0x11c20000 0 0x10000>;
+ interrupts = <GIC_SPI 84 IRQ_TYPE_LEVEL_HIGH>,
+ <GIC_SPI 85 IRQ_TYPE_LEVEL_HIGH>,
+ <GIC_SPI 86 IRQ_TYPE_LEVEL_HIGH>;
+ interrupt-names = "mux", "fil", "arp_ns";
+ phy-mode = "rgmii";
+ clocks = <&cpg CPG_MOD R9A07G043_ETH0_CLK_AXI>,
+ <&cpg CPG_MOD R9A07G043_ETH0_CLK_CHI>,
+ <&cpg CPG_CORE R9A07G043_CLK_HP>;
+ clock-names = "axi", "chi", "refclk";
+ resets = <&cpg R9A07G043_ETH0_RST_HW_N>;
+ power-domains = <&cpg>;
+ #address-cells = <1>;
+ #size-cells = <0>;
+ status = "disabled";
+ };
+
+ eth1: ethernet@11c30000 {
+ compatible = "renesas,r9a07g043-gbeth",
+ "renesas,rzg2l-gbeth";
+ reg = <0 0x11c30000 0 0x10000>;
+ interrupts = <GIC_SPI 87 IRQ_TYPE_LEVEL_HIGH>,
+ <GIC_SPI 88 IRQ_TYPE_LEVEL_HIGH>,
+ <GIC_SPI 89 IRQ_TYPE_LEVEL_HIGH>;
+ interrupt-names = "mux", "fil", "arp_ns";
+ phy-mode = "rgmii";
+ clocks = <&cpg CPG_MOD R9A07G043_ETH1_CLK_AXI>,
+ <&cpg CPG_MOD R9A07G043_ETH1_CLK_CHI>,
+ <&cpg CPG_CORE R9A07G043_CLK_HP>;
+ clock-names = "axi", "chi", "refclk";
+ resets = <&cpg R9A07G043_ETH1_RST_HW_N>;
+ power-domains = <&cpg>;
+ #address-cells = <1>;
+ #size-cells = <0>;
+ status = "disabled";
+ };
+
phyrst: usbphy-ctrl@11c40000 {
reg = <0 0x11c40000 0 0x10000>;
/* place holder */
--
2.25.1

201 - 220 of 9599