Date   

cip-gitlab/ci/pavel/linux-test build: 187 builds: 5 failed, 182 passed, 6 errors, 199 warnings (v4.4-st5-586-geb97410e0086c) #kernelci

kernelci.org bot <bot@...>
 

cip-gitlab/ci/pavel/linux-test build: 187 builds: 5 failed, 182 passed, 6 errors, 199 warnings (v4.4-st5-586-geb97410e0086c)

Full Build Summary: https://kernelci.org/build/cip-gitlab/branch/ci%2Fpavel%2Flinux-test/kernel/v4.4-st5-586-geb97410e0086c/

Tree: cip-gitlab
Branch: ci/pavel/linux-test
Git Describe: v4.4-st5-586-geb97410e0086c
Git Commit: eb97410e0086c865c804bdc822e061764810486c
Git URL: https://gitlab.com/cip-project/cip-kernel/linux-cip.git
Built: 6 unique architectures

Build Failures Detected:

arm:
rpc_defconfig: (gcc-10) FAIL

mips:
fuloong2e_defconfig: (gcc-10) FAIL
ip27_defconfig: (gcc-10) FAIL
ip28_defconfig: (gcc-10) FAIL
lemote2f_defconfig: (gcc-10) FAIL

Errors and Warnings Detected:

arc:
axs103_defconfig (gcc-10): 1 warning
axs103_smp_defconfig (gcc-10): 1 warning
nsim_hs_defconfig (gcc-10): 1 warning
nsim_hs_smp_defconfig (gcc-10): 1 warning
nsimosci_hs_defconfig (gcc-10): 1 warning
nsimosci_hs_smp_defconfig (gcc-10): 1 warning
vdk_hs38_defconfig (gcc-10): 1 warning
vdk_hs38_smp_defconfig (gcc-10): 1 warning

arm64:
defconfig (gcc-10): 2 warnings
defconfig+arm64-chromebook (gcc-10): 2 warnings

arm:
acs5k_defconfig (gcc-10): 1 warning
acs5k_tiny_defconfig (gcc-10): 1 warning
am200epdkit_defconfig (gcc-10): 1 warning
assabet_defconfig (gcc-10): 1 warning
at91_dt_defconfig (gcc-10): 1 warning
axm55xx_defconfig (gcc-10): 1 warning
badge4_defconfig (gcc-10): 1 warning
bcm2835_defconfig (gcc-10): 1 warning
bcm_defconfig (gcc-10): 1 warning
cerfcube_defconfig (gcc-10): 1 warning
clps711x_defconfig (gcc-10): 2 warnings
cm_x2xx_defconfig (gcc-10): 1 warning
cm_x300_defconfig (gcc-10): 1 warning
colibri_pxa270_defconfig (gcc-10): 1 warning
colibri_pxa300_defconfig (gcc-10): 1 warning
collie_defconfig (gcc-10): 1 warning
corgi_defconfig (gcc-10): 1 warning
davinci_all_defconfig (gcc-10): 2 warnings
dove_defconfig (gcc-10): 1 warning
ebsa110_defconfig (gcc-10): 1 warning
efm32_defconfig (gcc-10): 1 warning
em_x270_defconfig (gcc-10): 1 warning
ep93xx_defconfig (gcc-10): 1 warning
eseries_pxa_defconfig (gcc-10): 1 warning
exynos_defconfig (gcc-10): 1 warning
ezx_defconfig (gcc-10): 1 warning
footbridge_defconfig (gcc-10): 1 warning
h3600_defconfig (gcc-10): 1 warning
h5000_defconfig (gcc-10): 1 warning
hackkit_defconfig (gcc-10): 1 warning
hisi_defconfig (gcc-10): 1 warning
imote2_defconfig (gcc-10): 1 warning
imx_v4_v5_defconfig (gcc-10): 1 warning
imx_v6_v7_defconfig (gcc-10): 1 warning
integrator_defconfig (gcc-10): 1 warning
iop13xx_defconfig (gcc-10): 1 warning
iop32x_defconfig (gcc-10): 1 warning
iop33x_defconfig (gcc-10): 1 warning
ixp4xx_defconfig (gcc-10): 1 warning
jornada720_defconfig (gcc-10): 1 warning
keystone_defconfig (gcc-10): 1 warning
ks8695_defconfig (gcc-10): 1 warning
lart_defconfig (gcc-10): 1 warning
lpc18xx_defconfig (gcc-10): 1 warning
lpc32xx_defconfig (gcc-10): 2 warnings
lpd270_defconfig (gcc-10): 1 warning
lubbock_defconfig (gcc-10): 1 warning
magician_defconfig (gcc-10): 1 warning
mainstone_defconfig (gcc-10): 1 warning
mini2440_defconfig (gcc-10): 2 warnings
mmp2_defconfig (gcc-10): 1 warning
multi_v5_defconfig (gcc-10): 1 warning
multi_v7_defconfig (gcc-10): 1 warning
mv78xx0_defconfig (gcc-10): 1 warning
mvebu_v5_defconfig (gcc-10): 1 warning
mvebu_v7_defconfig (gcc-10): 1 warning
mxs_defconfig (gcc-10): 2 warnings
neponset_defconfig (gcc-10): 1 warning
netwinder_defconfig (gcc-10): 1 warning
netx_defconfig (gcc-10): 1 warning
nhk8815_defconfig (gcc-10): 1 warning
omap1_defconfig (gcc-10): 2 warnings
omap2plus_defconfig (gcc-10): 1 warning
orion5x_defconfig (gcc-10): 1 warning
palmz72_defconfig (gcc-10): 1 warning
pcm027_defconfig (gcc-10): 1 warning
pleb_defconfig (gcc-10): 1 warning
pxa168_defconfig (gcc-10): 1 warning
pxa255-idp_defconfig (gcc-10): 1 warning
pxa3xx_defconfig (gcc-10): 1 warning
pxa910_defconfig (gcc-10): 1 warning
qcom_defconfig (gcc-10): 1 warning
raumfeld_defconfig (gcc-10): 1 warning
realview-smp_defconfig (gcc-10): 1 warning
realview_defconfig (gcc-10): 1 warning
rpc_defconfig (gcc-10): 2 errors
s3c2410_defconfig (gcc-10): 2 warnings
s3c6400_defconfig (gcc-10): 2 warnings
sama5_defconfig (gcc-10): 1 warning
shannon_defconfig (gcc-10): 1 warning
shmobile_defconfig (gcc-10): 1 warning
simpad_defconfig (gcc-10): 1 warning
socfpga_defconfig (gcc-10): 1 warning
spear13xx_defconfig (gcc-10): 1 warning
spitz_defconfig (gcc-10): 1 warning
sunxi_defconfig (gcc-10): 1 warning
tegra_defconfig (gcc-10): 1 warning
trizeps4_defconfig (gcc-10): 1 warning
u8500_defconfig (gcc-10): 1 warning
versatile_defconfig (gcc-10): 1 warning
vexpress_defconfig (gcc-10): 1 warning
viper_defconfig (gcc-10): 1 warning
vt8500_v6_v7_defconfig (gcc-10): 1 warning
xcep_defconfig (gcc-10): 1 warning
zeus_defconfig (gcc-10): 1 warning

i386:
i386_defconfig (gcc-10): 5 warnings

mips:
ar7_defconfig (gcc-10): 1 warning
ath79_defconfig (gcc-10): 1 warning
bcm47xx_defconfig (gcc-10): 1 warning
bcm63xx_defconfig (gcc-10): 1 warning
bigsur_defconfig (gcc-10): 1 warning
bmips_be_defconfig (gcc-10): 1 warning
bmips_stb_defconfig (gcc-10): 1 warning
capcella_defconfig (gcc-10): 1 warning
cavium_octeon_defconfig (gcc-10): 1 warning
ci20_defconfig (gcc-10): 1 warning
cobalt_defconfig (gcc-10): 1 warning
db1xxx_defconfig (gcc-10): 1 warning
decstation_defconfig (gcc-10): 1 warning
fuloong2e_defconfig (gcc-10): 2 errors
gpr_defconfig (gcc-10): 1 warning
ip22_defconfig (gcc-10): 2 warnings
ip32_defconfig (gcc-10): 1 warning
jazz_defconfig (gcc-10): 1 warning
jmr3927_defconfig (gcc-10): 1 warning
lasat_defconfig (gcc-10): 1 warning
lemote2f_defconfig (gcc-10): 2 errors
loongson3_defconfig (gcc-10): 1 warning
ls1b_defconfig (gcc-10): 1 warning
malta_defconfig (gcc-10): 1 warning
malta_kvm_defconfig (gcc-10): 1 warning
malta_kvm_guest_defconfig (gcc-10): 1 warning
malta_qemu_32r6_defconfig (gcc-10): 1 warning
maltaaprp_defconfig (gcc-10): 1 warning
maltasmvp_defconfig (gcc-10): 1 warning
maltasmvp_eva_defconfig (gcc-10): 1 warning
maltaup_defconfig (gcc-10): 1 warning
maltaup_xpa_defconfig (gcc-10): 1 warning
markeins_defconfig (gcc-10): 1 warning
mips_paravirt_defconfig (gcc-10): 1 warning
mpc30x_defconfig (gcc-10): 1 warning
msp71xx_defconfig (gcc-10): 1 warning
mtx1_defconfig (gcc-10): 4 warnings
nlm_xlp_defconfig (gcc-10): 1 warning
nlm_xlr_defconfig (gcc-10): 1 warning
pnx8335_stb225_defconfig (gcc-10): 1 warning
qi_lb60_defconfig (gcc-10): 1 warning
rb532_defconfig (gcc-10): 1 warning
rbtx49xx_defconfig (gcc-10): 1 warning
rm200_defconfig (gcc-10): 1 warning
rt305x_defconfig (gcc-10): 1 warning
sb1250_swarm_defconfig (gcc-10): 1 warning
sead3_defconfig (gcc-10): 1 warning
sead3micro_defconfig (gcc-10): 1 warning
tb0219_defconfig (gcc-10): 1 warning
tb0226_defconfig (gcc-10): 1 warning
tb0287_defconfig (gcc-10): 1 warning
workpad_defconfig (gcc-10): 1 warning
xway_defconfig (gcc-10): 1 warning

x86_64:
allnoconfig (gcc-10): 4 warnings
tinyconfig (gcc-10): 3 warnings
x86_64_defconfig (gcc-10): 9 warnings
x86_64_defconfig+x86-chromebook (gcc-10): 9 warnings

Errors summary:

4 cc1: error: ‘-mloongson-mmi’ must be used with ‘-mhard-float’
1 arm-linux-gnueabihf-gcc: error: unrecognized -march target: armv3
1 arm-linux-gnueabihf-gcc: error: missing argument to ‘-march=’

Warnings summary:

149 net/ipv4/inet_hashtables.c:608:68: warning: suggest parentheses around ‘+’ in operand of ‘&’ [-Wparentheses]
8 net/ipv4/inet_hashtables.c:608:68: warning: suggest parentheses around '+' in operand of '&' [-Wparentheses]
7 arch/x86/kernel/process.c:456: Warning: no instruction mnemonic suffix given and no register operands; using default for `btr'
4 arch/x86/entry/entry_64.S:487: Warning: no instruction mnemonic suffix given and no register operands; using default for `btr'
4 arch/x86/entry/entry_64.S:1642: Warning: no instruction mnemonic suffix given and no register operands; using default for `sysret'
3 ld: warning: creating DT_TEXTREL in a PIE
3 drivers/tty/serial/samsung.c:1776:34: warning: array ‘s3c24xx_uart_dt_match’ assumed to have one element
3 WARNING: vmlinux.o (.discard.retpoline_safe): unexpected non-allocatable section.
3 WARNING: vmlinux.o (.discard.nospec): unexpected non-allocatable section.
2 sound/pci/echoaudio/echoaudio_dsp.c:647:9: warning: iteration 1073741824 invokes undefined behavior [-Waggressive-loop-optimizations]
2 ld: arch/x86/boot/compressed/head_64.o: warning: relocation in read-only section `.head.text'
2 drivers/net/ethernet/apm/xgene/xgene_enet_main.c:32:36: warning: array ‘xgene_enet_acpi_match’ assumed to have one element
1 sound/pci/echoaudio/echoaudio_dsp.c:658:9: warning: iteration 1073741824 invokes undefined behavior [-Waggressive-loop-optimizations]
1 ld: arch/x86/boot/compressed/head_32.o: warning: relocation in read-only section `.head.text'
1 drivers/net/ethernet/seeq/sgiseeq.c:804:26: warning: passing argument 5 of ‘dma_free_attrs’ makes pointer from integer without a cast [-Wint-conversion]
1 drivers/mmc/host/sdhci-s3c.c:429:34: warning: array ‘sdhci_s3c_dt_match’ assumed to have one element
1 drivers/gpio/gpio-omap.c:1161:34: warning: array ‘omap_gpio_match’ assumed to have one element
1 arch/arm/mach-mxs/mach-mxs.c:285:26: warning: duplicate ‘const’ declaration specifier [-Wduplicate-decl-specifier]
1 arch/arm/mach-lpc32xx/phy3250.c:215:36: warning: duplicate ‘const’ declaration specifier [-Wduplicate-decl-specifier]
1 arch/arm/mach-davinci/da8xx-dt.c:23:34: warning: duplicate ‘const’ declaration specifier [-Wduplicate-decl-specifier]
1 arch/arm/mach-clps711x/board-autcpu12.c:163:26: warning: duplicate ‘const’ declaration specifier [-Wduplicate-decl-specifier]

Section mismatches summary:

55 WARNING: modpost: Found 1 section mismatch(es).
7 WARNING: modpost: Found 2 section mismatch(es).
1 WARNING: vmlinux.o(___ksymtab_gpl+of_fixed_factor_clk_setup+0x0): Section mismatch in reference from the variable __ksymtab_of_fixed_factor_clk_setup to the function .init.text:of_fixed_factor_clk_setup()
1 WARNING: drivers/clk/built-in.o(___ksymtab_gpl+of_fixed_factor_clk_setup+0x0): Section mismatch in reference from the variable __ksymtab_of_fixed_factor_clk_setup to the function .init.text:of_fixed_factor_clk_setup()
1 WARNING: drivers/built-in.o(___ksymtab_gpl+of_fixed_factor_clk_setup+0x0): Section mismatch in reference from the variable __ksymtab_of_fixed_factor_clk_setup to the function .init.text:of_fixed_factor_clk_setup()

================================================================================

Detailed per-defconfig build reports:

--------------------------------------------------------------------------------
acs5k_defconfig (arm, gcc-10) — PASS, 0 errors, 1 warning, 0 section mismatches

Warnings:
net/ipv4/inet_hashtables.c:608:68: warning: suggest parentheses around ‘+’ in operand of ‘&’ [-Wparentheses]

--------------------------------------------------------------------------------
acs5k_tiny_defconfig (arm, gcc-10) — PASS, 0 errors, 1 warning, 0 section mismatches

Warnings:
net/ipv4/inet_hashtables.c:608:68: warning: suggest parentheses around ‘+’ in operand of ‘&’ [-Wparentheses]

--------------------------------------------------------------------------------
allnoconfig (arm, gcc-10) — PASS, 0 errors, 0 warnings, 0 section mismatches

--------------------------------------------------------------------------------
allnoconfig (x86_64, gcc-10) — PASS, 0 errors, 4 warnings, 0 section mismatches

Warnings:
arch/x86/entry/entry_64.S:487: Warning: no instruction mnemonic suffix given and no register operands; using default for `btr'
arch/x86/entry/entry_64.S:1642: Warning: no instruction mnemonic suffix given and no register operands; using default for `sysret'
arch/x86/kernel/process.c:456: Warning: no instruction mnemonic suffix given and no register operands; using default for `btr'
arch/x86/kernel/process.c:456: Warning: no instruction mnemonic suffix given and no register operands; using default for `btr'

--------------------------------------------------------------------------------
allnoconfig (arc, gcc-10) — PASS, 0 errors, 0 warnings, 0 section mismatches

--------------------------------------------------------------------------------
allnoconfig (i386, gcc-10) — PASS, 0 errors, 0 warnings, 0 section mismatches

--------------------------------------------------------------------------------
allnoconfig (mips, gcc-10) — PASS, 0 errors, 0 warnings, 0 section mismatches

--------------------------------------------------------------------------------
am200epdkit_defconfig (arm, gcc-10) — PASS, 0 errors, 1 warning, 0 section mismatches

Warnings:
net/ipv4/inet_hashtables.c:608:68: warning: suggest parentheses around ‘+’ in operand of ‘&’ [-Wparentheses]

--------------------------------------------------------------------------------
ar7_defconfig (mips, gcc-10) — PASS, 0 errors, 1 warning, 0 section mismatches

Warnings:
net/ipv4/inet_hashtables.c:608:68: warning: suggest parentheses around ‘+’ in operand of ‘&’ [-Wparentheses]

--------------------------------------------------------------------------------
assabet_defconfig (arm, gcc-10) — PASS, 0 errors, 1 warning, 0 section mismatches

Warnings:
net/ipv4/inet_hashtables.c:608:68: warning: suggest parentheses around ‘+’ in operand of ‘&’ [-Wparentheses]

--------------------------------------------------------------------------------
at91_dt_defconfig (arm, gcc-10) — PASS, 0 errors, 1 warning, 0 section mismatches

Warnings:
net/ipv4/inet_hashtables.c:608:68: warning: suggest parentheses around ‘+’ in operand of ‘&’ [-Wparentheses]

Section mismatches:
WARNING: modpost: Found 1 section mismatch(es).

--------------------------------------------------------------------------------
ath79_defconfig (mips, gcc-10) — PASS, 0 errors, 1 warning, 0 section mismatches

Warnings:
net/ipv4/inet_hashtables.c:608:68: warning: suggest parentheses around ‘+’ in operand of ‘&’ [-Wparentheses]

Section mismatches:
WARNING: modpost: Found 1 section mismatch(es).

--------------------------------------------------------------------------------
axm55xx_defconfig (arm, gcc-10) — PASS, 0 errors, 1 warning, 0 section mismatches

Warnings:
net/ipv4/inet_hashtables.c:608:68: warning: suggest parentheses around ‘+’ in operand of ‘&’ [-Wparentheses]

Section mismatches:
WARNING: modpost: Found 1 section mismatch(es).

--------------------------------------------------------------------------------
axs103_defconfig (arc, gcc-10) — PASS, 0 errors, 1 warning, 0 section mismatches

Warnings:
net/ipv4/inet_hashtables.c:608:68: warning: suggest parentheses around '+' in operand of '&' [-Wparentheses]

Section mismatches:
WARNING: modpost: Found 1 section mismatch(es).

--------------------------------------------------------------------------------
axs103_smp_defconfig (arc, gcc-10) — PASS, 0 errors, 1 warning, 0 section mismatches

Warnings:
net/ipv4/inet_hashtables.c:608:68: warning: suggest parentheses around '+' in operand of '&' [-Wparentheses]

Section mismatches:
WARNING: modpost: Found 1 section mismatch(es).

--------------------------------------------------------------------------------
badge4_defconfig (arm, gcc-10) — PASS, 0 errors, 1 warning, 0 section mismatches

Warnings:
net/ipv4/inet_hashtables.c:608:68: warning: suggest parentheses around ‘+’ in operand of ‘&’ [-Wparentheses]

--------------------------------------------------------------------------------
bcm2835_defconfig (arm, gcc-10) — PASS, 0 errors, 1 warning, 0 section mismatches

Warnings:
net/ipv4/inet_hashtables.c:608:68: warning: suggest parentheses around ‘+’ in operand of ‘&’ [-Wparentheses]

--------------------------------------------------------------------------------
bcm47xx_defconfig (mips, gcc-10) — PASS, 0 errors, 1 warning, 0 section mismatches

Warnings:
net/ipv4/inet_hashtables.c:608:68: warning: suggest parentheses around ‘+’ in operand of ‘&’ [-Wparentheses]

--------------------------------------------------------------------------------
bcm63xx_defconfig (mips, gcc-10) — PASS, 0 errors, 1 warning, 0 section mismatches

Warnings:
net/ipv4/inet_hashtables.c:608:68: warning: suggest parentheses around ‘+’ in operand of ‘&’ [-Wparentheses]

--------------------------------------------------------------------------------
bcm_defconfig (arm, gcc-10) — PASS, 0 errors, 1 warning, 0 section mismatches

Warnings:
net/ipv4/inet_hashtables.c:608:68: warning: suggest parentheses around ‘+’ in operand of ‘&’ [-Wparentheses]

Section mismatches:
WARNING: modpost: Found 1 section mismatch(es).

--------------------------------------------------------------------------------
bigsur_defconfig (mips, gcc-10) — PASS, 0 errors, 1 warning, 0 section mismatches

Warnings:
net/ipv4/inet_hashtables.c:608:68: warning: suggest parentheses around ‘+’ in operand of ‘&’ [-Wparentheses]

--------------------------------------------------------------------------------
bmips_be_defconfig (mips, gcc-10) — PASS, 0 errors, 1 warning, 0 section mismatches

Warnings:
net/ipv4/inet_hashtables.c:608:68: warning: suggest parentheses around ‘+’ in operand of ‘&’ [-Wparentheses]

--------------------------------------------------------------------------------
bmips_stb_defconfig (mips, gcc-10) — PASS, 0 errors, 1 warning, 0 section mismatches

Warnings:
net/ipv4/inet_hashtables.c:608:68: warning: suggest parentheses around ‘+’ in operand of ‘&’ [-Wparentheses]

--------------------------------------------------------------------------------
capcella_defconfig (mips, gcc-10) — PASS, 0 errors, 1 warning, 0 section mismatches

Warnings:
net/ipv4/inet_hashtables.c:608:68: warning: suggest parentheses around ‘+’ in operand of ‘&’ [-Wparentheses]

--------------------------------------------------------------------------------
cavium_octeon_defconfig (mips, gcc-10) — PASS, 0 errors, 1 warning, 0 section mismatches

Warnings:
net/ipv4/inet_hashtables.c:608:68: warning: suggest parentheses around ‘+’ in operand of ‘&’ [-Wparentheses]

--------------------------------------------------------------------------------
cerfcube_defconfig (arm, gcc-10) — PASS, 0 errors, 1 warning, 0 section mismatches

Warnings:
net/ipv4/inet_hashtables.c:608:68: warning: suggest parentheses around ‘+’ in operand of ‘&’ [-Wparentheses]

--------------------------------------------------------------------------------
ci20_defconfig (mips, gcc-10) — PASS, 0 errors, 1 warning, 0 section mismatches

Warnings:
net/ipv4/inet_hashtables.c:608:68: warning: suggest parentheses around ‘+’ in operand of ‘&’ [-Wparentheses]

--------------------------------------------------------------------------------
clps711x_defconfig (arm, gcc-10) — PASS, 0 errors, 2 warnings, 0 section mismatches

Warnings:
arch/arm/mach-clps711x/board-autcpu12.c:163:26: warning: duplicate ‘const’ declaration specifier [-Wduplicate-decl-specifier]
net/ipv4/inet_hashtables.c:608:68: warning: suggest parentheses around ‘+’ in operand of ‘&’ [-Wparentheses]

--------------------------------------------------------------------------------
cm_x2xx_defconfig (arm, gcc-10) — PASS, 0 errors, 1 warning, 0 section mismatches

Warnings:
net/ipv4/inet_hashtables.c:608:68: warning: suggest parentheses around ‘+’ in operand of ‘&’ [-Wparentheses]

--------------------------------------------------------------------------------
cm_x300_defconfig (arm, gcc-10) — PASS, 0 errors, 1 warning, 0 section mismatches

Warnings:
net/ipv4/inet_hashtables.c:608:68: warning: suggest parentheses around ‘+’ in operand of ‘&’ [-Wparentheses]

--------------------------------------------------------------------------------
cobalt_defconfig (mips, gcc-10) — PASS, 0 errors, 1 warning, 0 section mismatches

Warnings:
net/ipv4/inet_hashtables.c:608:68: warning: suggest parentheses around ‘+’ in operand of ‘&’ [-Wparentheses]

--------------------------------------------------------------------------------
colibri_pxa270_defconfig (arm, gcc-10) — PASS, 0 errors, 1 warning, 0 section mismatches

Warnings:
net/ipv4/inet_hashtables.c:608:68: warning: suggest parentheses around ‘+’ in operand of ‘&’ [-Wparentheses]

--------------------------------------------------------------------------------
colibri_pxa300_defconfig (arm, gcc-10) — PASS, 0 errors, 1 warning, 0 section mismatches

Warnings:
net/ipv4/inet_hashtables.c:608:68: warning: suggest parentheses around ‘+’ in operand of ‘&’ [-Wparentheses]

--------------------------------------------------------------------------------
collie_defconfig (arm, gcc-10) — PASS, 0 errors, 1 warning, 0 section mismatches

Warnings:
net/ipv4/inet_hashtables.c:608:68: warning: suggest parentheses around ‘+’ in operand of ‘&’ [-Wparentheses]

--------------------------------------------------------------------------------
corgi_defconfig (arm, gcc-10) — PASS, 0 errors, 1 warning, 0 section mismatches

Warnings:
net/ipv4/inet_hashtables.c:608:68: warning: suggest parentheses around ‘+’ in operand of ‘&’ [-Wparentheses]

--------------------------------------------------------------------------------
davinci_all_defconfig (arm, gcc-10) — PASS, 0 errors, 2 warnings, 0 section mismatches

Warnings:
arch/arm/mach-davinci/da8xx-dt.c:23:34: warning: duplicate ‘const’ declaration specifier [-Wduplicate-decl-specifier]
net/ipv4/inet_hashtables.c:608:68: warning: suggest parentheses around ‘+’ in operand of ‘&’ [-Wparentheses]

--------------------------------------------------------------------------------
db1xxx_defconfig (mips, gcc-10) — PASS, 0 errors, 1 warning, 0 section mismatches

Warnings:
net/ipv4/inet_hashtables.c:608:68: warning: suggest parentheses around ‘+’ in operand of ‘&’ [-Wparentheses]

--------------------------------------------------------------------------------
decstation_defconfig (mips, gcc-10) — PASS, 0 errors, 1 warning, 0 section mismatches

Warnings:
net/ipv4/inet_hashtables.c:608:68: warning: suggest parentheses around ‘+’ in operand of ‘&’ [-Wparentheses]

--------------------------------------------------------------------------------
defconfig (arm64, gcc-10) — PASS, 0 errors, 2 warnings, 0 section mismatches

Warnings:
net/ipv4/inet_hashtables.c:608:68: warning: suggest parentheses around ‘+’ in operand of ‘&’ [-Wparentheses]
drivers/net/ethernet/apm/xgene/xgene_enet_main.c:32:36: warning: array ‘xgene_enet_acpi_match’ assumed to have one element

Section mismatches:
WARNING: modpost: Found 1 section mismatch(es).

--------------------------------------------------------------------------------
defconfig+arm64-chromebook (arm64, gcc-10) — PASS, 0 errors, 2 warnings, 0 section mismatches

Warnings:
net/ipv4/inet_hashtables.c:608:68: warning: suggest parentheses around ‘+’ in operand of ‘&’ [-Wparentheses]
drivers/net/ethernet/apm/xgene/xgene_enet_main.c:32:36: warning: array ‘xgene_enet_acpi_match’ assumed to have one element

Section mismatches:
WARNING: modpost: Found 1 section mismatch(es).

--------------------------------------------------------------------------------
dove_defconfig (arm, gcc-10) — PASS, 0 errors, 1 warning, 0 section mismatches

Warnings:
net/ipv4/inet_hashtables.c:608:68: warning: suggest parentheses around ‘+’ in operand of ‘&’ [-Wparentheses]

--------------------------------------------------------------------------------
e55_defconfig (mips, gcc-10) — PASS, 0 errors, 0 warnings, 0 section mismatches

--------------------------------------------------------------------------------
ebsa110_defconfig (arm, gcc-10) — PASS, 0 errors, 1 warning, 0 section mismatches

Warnings:
net/ipv4/inet_hashtables.c:608:68: warning: suggest parentheses around ‘+’ in operand of ‘&’ [-Wparentheses]

--------------------------------------------------------------------------------
efm32_defconfig (arm, gcc-10) — PASS, 0 errors, 1 warning, 0 section mismatches

Warnings:
net/ipv4/inet_hashtables.c:608:68: warning: suggest parentheses around ‘+’ in operand of ‘&’ [-Wparentheses]

--------------------------------------------------------------------------------
em_x270_defconfig (arm, gcc-10) — PASS, 0 errors, 1 warning, 0 section mismatches

Warnings:
net/ipv4/inet_hashtables.c:608:68: warning: suggest parentheses around ‘+’ in operand of ‘&’ [-Wparentheses]

--------------------------------------------------------------------------------
ep93xx_defconfig (arm, gcc-10) — PASS, 0 errors, 1 warning, 0 section mismatches

Warnings:
net/ipv4/inet_hashtables.c:608:68: warning: suggest parentheses around ‘+’ in operand of ‘&’ [-Wparentheses]

Section mismatches:
WARNING: modpost: Found 1 section mismatch(es).

--------------------------------------------------------------------------------
eseries_pxa_defconfig (arm, gcc-10) — PASS, 0 errors, 1 warning, 0 section mismatches

Warnings:
net/ipv4/inet_hashtables.c:608:68: warning: suggest parentheses around ‘+’ in operand of ‘&’ [-Wparentheses]

--------------------------------------------------------------------------------
exynos_defconfig (arm, gcc-10) — PASS, 0 errors, 1 warning, 0 section mismatches

Warnings:
net/ipv4/inet_hashtables.c:608:68: warning: suggest parentheses around ‘+’ in operand of ‘&’ [-Wparentheses]

Section mismatches:
WARNING: modpost: Found 1 section mismatch(es).

--------------------------------------------------------------------------------
ezx_defconfig (arm, gcc-10) — PASS, 0 errors, 1 warning, 0 section mismatches

Warnings:
net/ipv4/inet_hashtables.c:608:68: warning: suggest parentheses around ‘+’ in operand of ‘&’ [-Wparentheses]

--------------------------------------------------------------------------------
footbridge_defconfig (arm, gcc-10) — PASS, 0 errors, 1 warning, 0 section mismatches

Warnings:
net/ipv4/inet_hashtables.c:608:68: warning: suggest parentheses around ‘+’ in operand of ‘&’ [-Wparentheses]

--------------------------------------------------------------------------------
fuloong2e_defconfig (mips, gcc-10) — FAIL, 2 errors, 0 warnings, 0 section mismatches

Errors:
cc1: error: ‘-mloongson-mmi’ must be used with ‘-mhard-float’
cc1: error: ‘-mloongson-mmi’ must be used with ‘-mhard-float’

--------------------------------------------------------------------------------
gpr_defconfig (mips, gcc-10) — PASS, 0 errors, 1 warning, 0 section mismatches

Warnings:
net/ipv4/inet_hashtables.c:608:68: warning: suggest parentheses around ‘+’ in operand of ‘&’ [-Wparentheses]

--------------------------------------------------------------------------------
h3600_defconfig (arm, gcc-10) — PASS, 0 errors, 1 warning, 0 section mismatches

Warnings:
net/ipv4/inet_hashtables.c:608:68: warning: suggest parentheses around ‘+’ in operand of ‘&’ [-Wparentheses]

--------------------------------------------------------------------------------
h5000_defconfig (arm, gcc-10) — PASS, 0 errors, 1 warning, 0 section mismatches

Warnings:
net/ipv4/inet_hashtables.c:608:68: warning: suggest parentheses around ‘+’ in operand of ‘&’ [-Wparentheses]

--------------------------------------------------------------------------------
hackkit_defconfig (arm, gcc-10) — PASS, 0 errors, 1 warning, 0 section mismatches

Warnings:
net/ipv4/inet_hashtables.c:608:68: warning: suggest parentheses around ‘+’ in operand of ‘&’ [-Wparentheses]

--------------------------------------------------------------------------------
hisi_defconfig (arm, gcc-10) — PASS, 0 errors, 1 warning, 0 section mismatches

Warnings:
net/ipv4/inet_hashtables.c:608:68: warning: suggest parentheses around ‘+’ in operand of ‘&’ [-Wparentheses]

--------------------------------------------------------------------------------
i386_defconfig (i386, gcc-10) — PASS, 0 errors, 5 warnings, 0 section mismatches

Warnings:
net/ipv4/inet_hashtables.c:608:68: warning: suggest parentheses around ‘+’ in operand of ‘&’ [-Wparentheses]
WARNING: vmlinux.o (.discard.nospec): unexpected non-allocatable section.
WARNING: vmlinux.o (.discard.retpoline_safe): unexpected non-allocatable section.
ld: arch/x86/boot/compressed/head_32.o: warning: relocation in read-only section `.head.text'
ld: warning: creating DT_TEXTREL in a PIE

--------------------------------------------------------------------------------
imote2_defconfig (arm, gcc-10) — PASS, 0 errors, 1 warning, 0 section mismatches

Warnings:
net/ipv4/inet_hashtables.c:608:68: warning: suggest parentheses around ‘+’ in operand of ‘&’ [-Wparentheses]

--------------------------------------------------------------------------------
imx_v4_v5_defconfig (arm, gcc-10) — PASS, 0 errors, 1 warning, 0 section mismatches

Warnings:
net/ipv4/inet_hashtables.c:608:68: warning: suggest parentheses around ‘+’ in operand of ‘&’ [-Wparentheses]

Section mismatches:
WARNING: modpost: Found 1 section mismatch(es).

--------------------------------------------------------------------------------
imx_v6_v7_defconfig (arm, gcc-10) — PASS, 0 errors, 1 warning, 0 section mismatches

Warnings:
net/ipv4/inet_hashtables.c:608:68: warning: suggest parentheses around ‘+’ in operand of ‘&’ [-Wparentheses]

Section mismatches:
WARNING: modpost: Found 1 section mismatch(es).

--------------------------------------------------------------------------------
integrator_defconfig (arm, gcc-10) — PASS, 0 errors, 1 warning, 0 section mismatches

Warnings:
net/ipv4/inet_hashtables.c:608:68: warning: suggest parentheses around ‘+’ in operand of ‘&’ [-Wparentheses]

Section mismatches:
WARNING: modpost: Found 2 section mismatch(es).

--------------------------------------------------------------------------------
iop13xx_defconfig (arm, gcc-10) — PASS, 0 errors, 1 warning, 0 section mismatches

Warnings:
net/ipv4/inet_hashtables.c:608:68: warning: suggest parentheses around ‘+’ in operand of ‘&’ [-Wparentheses]

--------------------------------------------------------------------------------
iop32x_defconfig (arm, gcc-10) — PASS, 0 errors, 1 warning, 0 section mismatches

Warnings:
net/ipv4/inet_hashtables.c:608:68: warning: suggest parentheses around ‘+’ in operand of ‘&’ [-Wparentheses]

--------------------------------------------------------------------------------
iop33x_defconfig (arm, gcc-10) — PASS, 0 errors, 1 warning, 0 section mismatches

Warnings:
net/ipv4/inet_hashtables.c:608:68: warning: suggest parentheses around ‘+’ in operand of ‘&’ [-Wparentheses]

--------------------------------------------------------------------------------
ip22_defconfig (mips, gcc-10) — PASS, 0 errors, 2 warnings, 0 section mismatches

Warnings:
drivers/net/ethernet/seeq/sgiseeq.c:804:26: warning: passing argument 5 of ‘dma_free_attrs’ makes pointer from integer without a cast [-Wint-conversion]
net/ipv4/inet_hashtables.c:608:68: warning: suggest parentheses around ‘+’ in operand of ‘&’ [-Wparentheses]

--------------------------------------------------------------------------------
ip27_defconfig (mips, gcc-10) — FAIL, 0 errors, 0 warnings, 0 section mismatches

--------------------------------------------------------------------------------
ip28_defconfig (mips, gcc-10) — FAIL, 0 errors, 0 warnings, 0 section mismatches

--------------------------------------------------------------------------------
ip32_defconfig (mips, gcc-10) — PASS, 0 errors, 1 warning, 0 section mismatches

Warnings:
net/ipv4/inet_hashtables.c:608:68: warning: suggest parentheses around ‘+’ in operand of ‘&’ [-Wparentheses]

--------------------------------------------------------------------------------
ixp4xx_defconfig (arm, gcc-10) — PASS, 0 errors, 1 warning, 0 section mismatches

Warnings:
net/ipv4/inet_hashtables.c:608:68: warning: suggest parentheses around ‘+’ in operand of ‘&’ [-Wparentheses]

--------------------------------------------------------------------------------
jazz_defconfig (mips, gcc-10) — PASS, 0 errors, 1 warning, 0 section mismatches

Warnings:
net/ipv4/inet_hashtables.c:608:68: warning: suggest parentheses around ‘+’ in operand of ‘&’ [-Wparentheses]

--------------------------------------------------------------------------------
jmr3927_defconfig (mips, gcc-10) — PASS, 0 errors, 1 warning, 0 section mismatches

Warnings:
net/ipv4/inet_hashtables.c:608:68: warning: suggest parentheses around ‘+’ in operand of ‘&’ [-Wparentheses]

--------------------------------------------------------------------------------
jornada720_defconfig (arm, gcc-10) — PASS, 0 errors, 1 warning, 0 section mismatches

Warnings:
net/ipv4/inet_hashtables.c:608:68: warning: suggest parentheses around ‘+’ in operand of ‘&’ [-Wparentheses]

--------------------------------------------------------------------------------
keystone_defconfig (arm, gcc-10) — PASS, 0 errors, 1 warning, 0 section mismatches

Warnings:
net/ipv4/inet_hashtables.c:608:68: warning: suggest parentheses around ‘+’ in operand of ‘&’ [-Wparentheses]

Section mismatches:
WARNING: modpost: Found 1 section mismatch(es).

--------------------------------------------------------------------------------
ks8695_defconfig (arm, gcc-10) — PASS, 0 errors, 1 warning, 0 section mismatches

Warnings:
net/ipv4/inet_hashtables.c:608:68: warning: suggest parentheses around ‘+’ in operand of ‘&’ [-Wparentheses]

--------------------------------------------------------------------------------
lart_defconfig (arm, gcc-10) — PASS, 0 errors, 1 warning, 0 section mismatches

Warnings:
net/ipv4/inet_hashtables.c:608:68: warning: suggest parentheses around ‘+’ in operand of ‘&’ [-Wparentheses]

--------------------------------------------------------------------------------
lasat_defconfig (mips, gcc-10) — PASS, 0 errors, 1 warning, 0 section mismatches

Warnings:
net/ipv4/inet_hashtables.c:608:68: warning: suggest parentheses around ‘+’ in operand of ‘&’ [-Wparentheses]

--------------------------------------------------------------------------------
lemote2f_defconfig (mips, gcc-10) — FAIL, 2 errors, 0 warnings, 0 section mismatches

Errors:
cc1: error: ‘-mloongson-mmi’ must be used with ‘-mhard-float’
cc1: error: ‘-mloongson-mmi’ must be used with ‘-mhard-float’

--------------------------------------------------------------------------------
loongson3_defconfig (mips, gcc-10) — PASS, 0 errors, 1 warning, 0 section mismatches

Warnings:
net/ipv4/inet_hashtables.c:608:68: warning: suggest parentheses around ‘+’ in operand of ‘&’ [-Wparentheses]

--------------------------------------------------------------------------------
lpc18xx_defconfig (arm, gcc-10) — PASS, 0 errors, 1 warning, 0 section mismatches

Warnings:
net/ipv4/inet_hashtables.c:608:68: warning: suggest parentheses around ‘+’ in operand of ‘&’ [-Wparentheses]

--------------------------------------------------------------------------------
lpc32xx_defconfig (arm, gcc-10) — PASS, 0 errors, 2 warnings, 0 section mismatches

Warnings:
arch/arm/mach-lpc32xx/phy3250.c:215:36: warning: duplicate ‘const’ declaration specifier [-Wduplicate-decl-specifier]
net/ipv4/inet_hashtables.c:608:68: warning: suggest parentheses around ‘+’ in operand of ‘&’ [-Wparentheses]

--------------------------------------------------------------------------------
lpd270_defconfig (arm, gcc-10) — PASS, 0 errors, 1 warning, 0 section mismatches

Warnings:
net/ipv4/inet_hashtables.c:608:68: warning: suggest parentheses around ‘+’ in operand of ‘&’ [-Wparentheses]

--------------------------------------------------------------------------------
ls1b_defconfig (mips, gcc-10) — PASS, 0 errors, 1 warning, 0 section mismatches

Warnings:
net/ipv4/inet_hashtables.c:608:68: warning: suggest parentheses around ‘+’ in operand of ‘&’ [-Wparentheses]

--------------------------------------------------------------------------------
lubbock_defconfig (arm, gcc-10) — PASS, 0 errors, 1 warning, 0 section mismatches

Warnings:
net/ipv4/inet_hashtables.c:608:68: warning: suggest parentheses around ‘+’ in operand of ‘&’ [-Wparentheses]

--------------------------------------------------------------------------------
magician_defconfig (arm, gcc-10) — PASS, 0 errors, 1 warning, 0 section mismatches

Warnings:
net/ipv4/inet_hashtables.c:608:68: warning: suggest parentheses around ‘+’ in operand of ‘&’ [-Wparentheses]

--------------------------------------------------------------------------------
mainstone_defconfig (arm, gcc-10) — PASS, 0 errors, 1 warning, 0 section mismatches

Warnings:
net/ipv4/inet_hashtables.c:608:68: warning: suggest parentheses around ‘+’ in operand of ‘&’ [-Wparentheses]

--------------------------------------------------------------------------------
malta_defconfig (mips, gcc-10) — PASS, 0 errors, 1 warning, 0 section mismatches

Warnings:
net/ipv4/inet_hashtables.c:608:68: warning: suggest parentheses around ‘+’ in operand of ‘&’ [-Wparentheses]

Section mismatches:
WARNING: modpost: Found 1 section mismatch(es).
WARNING: modpost: Found 1 section mismatch(es).

--------------------------------------------------------------------------------
malta_kvm_defconfig (mips, gcc-10) — PASS, 0 errors, 1 warning, 0 section mismatches

Warnings:
net/ipv4/inet_hashtables.c:608:68: warning: suggest parentheses around ‘+’ in operand of ‘&’ [-Wparentheses]

Section mismatches:
WARNING: modpost: Found 1 section mismatch(es).
WARNING: modpost: Found 1 section mismatch(es).

--------------------------------------------------------------------------------
malta_kvm_guest_defconfig (mips, gcc-10) — PASS, 0 errors, 1 warning, 0 section mismatches

Warnings:
net/ipv4/inet_hashtables.c:608:68: warning: suggest parentheses around ‘+’ in operand of ‘&’ [-Wparentheses]

Section mismatches:
WARNING: modpost: Found 1 section mismatch(es).
WARNING: modpost: Found 1 section mismatch(es).

--------------------------------------------------------------------------------
malta_qemu_32r6_defconfig (mips, gcc-10) — PASS, 0 errors, 1 warning, 0 section mismatches

Warnings:
net/ipv4/inet_hashtables.c:608:68: warning: suggest parentheses around ‘+’ in operand of ‘&’ [-Wparentheses]

Section mismatches:
WARNING: modpost: Found 1 section mismatch(es).
WARNING: modpost: Found 1 section mismatch(es).

--------------------------------------------------------------------------------
maltaaprp_defconfig (mips, gcc-10) — PASS, 0 errors, 1 warning, 0 section mismatches

Warnings:
net/ipv4/inet_hashtables.c:608:68: warning: suggest parentheses around ‘+’ in operand of ‘&’ [-Wparentheses]

Section mismatches:
WARNING: modpost: Found 1 section mismatch(es).
WARNING: modpost: Found 1 section mismatch(es).

--------------------------------------------------------------------------------
maltasmvp_defconfig (mips, gcc-10) — PASS, 0 errors, 1 warning, 0 section mismatches

Warnings:
net/ipv4/inet_hashtables.c:608:68: warning: suggest parentheses around ‘+’ in operand of ‘&’ [-Wparentheses]

Section mismatches:
WARNING: modpost: Found 1 section mismatch(es).
WARNING: modpost: Found 1 section mismatch(es).

--------------------------------------------------------------------------------
maltasmvp_eva_defconfig (mips, gcc-10) — PASS, 0 errors, 1 warning, 0 section mismatches

Warnings:
net/ipv4/inet_hashtables.c:608:68: warning: suggest parentheses around ‘+’ in operand of ‘&’ [-Wparentheses]

Section mismatches:
WARNING: modpost: Found 1 section mismatch(es).
WARNING: modpost: Found 1 section mismatch(es).

--------------------------------------------------------------------------------
maltaup_defconfig (mips, gcc-10) — PASS, 0 errors, 1 warning, 0 section mismatches

Warnings:
net/ipv4/inet_hashtables.c:608:68: warning: suggest parentheses around ‘+’ in operand of ‘&’ [-Wparentheses]

Section mismatches:
WARNING: modpost: Found 1 section mismatch(es).
WARNING: modpost: Found 1 section mismatch(es).

--------------------------------------------------------------------------------
maltaup_xpa_defconfig (mips, gcc-10) — PASS, 0 errors, 1 warning, 0 section mismatches

Warnings:
net/ipv4/inet_hashtables.c:608:68: warning: suggest parentheses around ‘+’ in operand of ‘&’ [-Wparentheses]

Section mismatches:
WARNING: modpost: Found 1 section mismatch(es).
WARNING: modpost: Found 1 section mismatch(es).

--------------------------------------------------------------------------------
markeins_defconfig (mips, gcc-10) — PASS, 0 errors, 1 warning, 0 section mismatches

Warnings:
net/ipv4/inet_hashtables.c:608:68: warning: suggest parentheses around ‘+’ in operand of ‘&’ [-Wparentheses]

--------------------------------------------------------------------------------
mini2440_defconfig (arm, gcc-10) — PASS, 0 errors, 2 warnings, 0 section mismatches

Warnings:
drivers/tty/serial/samsung.c:1776:34: warning: array ‘s3c24xx_uart_dt_match’ assumed to have one element
net/ipv4/inet_hashtables.c:608:68: warning: suggest parentheses around ‘+’ in operand of ‘&’ [-Wparentheses]

--------------------------------------------------------------------------------
mips_paravirt_defconfig (mips, gcc-10) — PASS, 0 errors, 1 warning, 0 section mismatches

Warnings:
net/ipv4/inet_hashtables.c:608:68: warning: suggest parentheses around ‘+’ in operand of ‘&’ [-Wparentheses]

--------------------------------------------------------------------------------
mmp2_defconfig (arm, gcc-10) — PASS, 0 errors, 1 warning, 0 section mismatches

Warnings:
net/ipv4/inet_hashtables.c:608:68: warning: suggest parentheses around ‘+’ in operand of ‘&’ [-Wparentheses]

--------------------------------------------------------------------------------
mpc30x_defconfig (mips, gcc-10) — PASS, 0 errors, 1 warning, 0 section mismatches

Warnings:
net/ipv4/inet_hashtables.c:608:68: warning: suggest parentheses around ‘+’ in operand of ‘&’ [-Wparentheses]

--------------------------------------------------------------------------------
msp71xx_defconfig (mips, gcc-10) — PASS, 0 errors, 1 warning, 0 section mismatches

Warnings:
net/ipv4/inet_hashtables.c:608:68: warning: suggest parentheses around ‘+’ in operand of ‘&’ [-Wparentheses]

--------------------------------------------------------------------------------
mtx1_defconfig (mips, gcc-10) — PASS, 0 errors, 4 warnings, 0 section mismatches

Warnings:
net/ipv4/inet_hashtables.c:608:68: warning: suggest parentheses around ‘+’ in operand of ‘&’ [-Wparentheses]
sound/pci/echoaudio/echoaudio_dsp.c:647:9: warning: iteration 1073741824 invokes undefined behavior [-Waggressive-loop-optimizations]
sound/pci/echoaudio/echoaudio_dsp.c:658:9: warning: iteration 1073741824 invokes undefined behavior [-Waggressive-loop-optimizations]
sound/pci/echoaudio/echoaudio_dsp.c:647:9: warning: iteration 1073741824 invokes undefined behavior [-Waggressive-loop-optimizations]

--------------------------------------------------------------------------------
multi_v5_defconfig (arm, gcc-10) — PASS, 0 errors, 1 warning, 0 section mismatches

Warnings:
net/ipv4/inet_hashtables.c:608:68: warning: suggest parentheses around ‘+’ in operand of ‘&’ [-Wparentheses]

Section mismatches:
WARNING: modpost: Found 2 section mismatch(es).

--------------------------------------------------------------------------------
multi_v7_defconfig (arm, gcc-10) — PASS, 0 errors, 1 warning, 0 section mismatches

Warnings:
net/ipv4/inet_hashtables.c:608:68: warning: suggest parentheses around ‘+’ in operand of ‘&’ [-Wparentheses]

Section mismatches:
WARNING: modpost: Found 1 section mismatch(es).

--------------------------------------------------------------------------------
mv78xx0_defconfig (arm, gcc-10) — PASS, 0 errors, 1 warning, 0 section mismatches

Warnings:
net/ipv4/inet_hashtables.c:608:68: warning: suggest parentheses around ‘+’ in operand of ‘&’ [-Wparentheses]

--------------------------------------------------------------------------------
mvebu_v5_defconfig (arm, gcc-10) — PASS, 0 errors, 1 warning, 0 section mismatches

Warnings:
net/ipv4/inet_hashtables.c:608:68: warning: suggest parentheses around ‘+’ in operand of ‘&’ [-Wparentheses]

Section mismatches:
WARNING: modpost: Found 1 section mismatch(es).

--------------------------------------------------------------------------------
mvebu_v7_defconfig (arm, gcc-10) — PASS, 0 errors, 1 warning, 0 section mismatches

Warnings:
net/ipv4/inet_hashtables.c:608:68: warning: suggest parentheses around ‘+’ in operand of ‘&’ [-Wparentheses]

Section mismatches:
WARNING: modpost: Found 1 section mismatch(es).

--------------------------------------------------------------------------------
mxs_defconfig (arm, gcc-10) — PASS, 0 errors, 2 warnings, 0 section mismatches

Warnings:
arch/arm/mach-mxs/mach-mxs.c:285:26: warning: duplicate ‘const’ declaration specifier [-Wduplicate-decl-specifier]
net/ipv4/inet_hashtables.c:608:68: warning: suggest parentheses around ‘+’ in operand of ‘&’ [-Wparentheses]

Section mismatches:
WARNING: modpost: Found 1 section mismatch(es).

--------------------------------------------------------------------------------
neponset_defconfig (arm, gcc-10) — PASS, 0 errors, 1 warning, 0 section mismatches

Warnings:
net/ipv4/inet_hashtables.c:608:68: warning: suggest parentheses around ‘+’ in operand of ‘&’ [-Wparentheses]

--------------------------------------------------------------------------------
netwinder_defconfig (arm, gcc-10) — PASS, 0 errors, 1 warning, 0 section mismatches

Warnings:
net/ipv4/inet_hashtables.c:608:68: warning: suggest parentheses around ‘+’ in operand of ‘&’ [-Wparentheses]

--------------------------------------------------------------------------------
netx_defconfig (arm, gcc-10) — PASS, 0 errors, 1 warning, 0 section mismatches

Warnings:
net/ipv4/inet_hashtables.c:608:68: warning: suggest parentheses around ‘+’ in operand of ‘&’ [-Wparentheses]

Section mismatches:
WARNING: modpost: Found 1 section mismatch(es).

--------------------------------------------------------------------------------
nhk8815_defconfig (arm, gcc-10) — PASS, 0 errors, 1 warning, 0 section mismatches

Warnings:
net/ipv4/inet_hashtables.c:608:68: warning: suggest parentheses around ‘+’ in operand of ‘&’ [-Wparentheses]

Section mismatches:
WARNING: modpost: Found 2 section mismatch(es).

--------------------------------------------------------------------------------
nlm_xlp_defconfig (mips, gcc-10) — PASS, 0 errors, 1 warning, 0 section mismatches

Warnings:
net/ipv4/inet_hashtables.c:608:68: warning: suggest parentheses around ‘+’ in operand of ‘&’ [-Wparentheses]

--------------------------------------------------------------------------------
nlm_xlr_defconfig (mips, gcc-10) — PASS, 0 errors, 1 warning, 0 section mismatches

Warnings:
net/ipv4/inet_hashtables.c:608:68: warning: suggest parentheses around ‘+’ in operand of ‘&’ [-Wparentheses]

--------------------------------------------------------------------------------
nsim_hs_defconfig (arc, gcc-10) — PASS, 0 errors, 1 warning, 0 section mismatches

Warnings:
net/ipv4/inet_hashtables.c:608:68: warning: suggest parentheses around '+' in operand of '&' [-Wparentheses]

Section mismatches:
WARNING: modpost: Found 1 section mismatch(es).

--------------------------------------------------------------------------------
nsim_hs_smp_defconfig (arc, gcc-10) — PASS, 0 errors, 1 warning, 0 section mismatches

Warnings:
net/ipv4/inet_hashtables.c:608:68: warning: suggest parentheses around '+' in operand of '&' [-Wparentheses]

Section mismatches:
WARNING: modpost: Found 1 section mismatch(es).

--------------------------------------------------------------------------------
nsimosci_hs_defconfig (arc, gcc-10) — PASS, 0 errors, 1 warning, 0 section mismatches

Warnings:
net/ipv4/inet_hashtables.c:608:68: warning: suggest parentheses around '+' in operand of '&' [-Wparentheses]

Section mismatches:
WARNING: modpost: Found 1 section mismatch(es).

--------------------------------------------------------------------------------
nsimosci_hs_smp_defconfig (arc, gcc-10) — PASS, 0 errors, 1 warning, 0 section mismatches

Warnings:
net/ipv4/inet_hashtables.c:608:68: warning: suggest parentheses around '+' in operand of '&' [-Wparentheses]

Section mismatches:
WARNING: modpost: Found 1 section mismatch(es).

--------------------------------------------------------------------------------
nuc910_defconfig (arm, gcc-10) — PASS, 0 errors, 0 warnings, 0 section mismatches

--------------------------------------------------------------------------------
nuc950_defconfig (arm, gcc-10) — PASS, 0 errors, 0 warnings, 0 section mismatches

--------------------------------------------------------------------------------
nuc960_defconfig (arm, gcc-10) — PASS, 0 errors, 0 warnings, 0 section mismatches

--------------------------------------------------------------------------------
omap1_defconfig (arm, gcc-10) — PASS, 0 errors, 2 warnings, 0 section mismatches

Warnings:
drivers/gpio/gpio-omap.c:1161:34: warning: array ‘omap_gpio_match’ assumed to have one element
net/ipv4/inet_hashtables.c:608:68: warning: suggest parentheses around ‘+’ in operand of ‘&’ [-Wparentheses]

--------------------------------------------------------------------------------
omap2plus_defconfig (arm, gcc-10) — PASS, 0 errors, 1 warning, 0 section mismatches

Warnings:
net/ipv4/inet_hashtables.c:608:68: warning: suggest parentheses around ‘+’ in operand of ‘&’ [-Wparentheses]

Section mismatches:
WARNING: modpost: Found 1 section mismatch(es).

--------------------------------------------------------------------------------
orion5x_defconfig (arm, gcc-10) — PASS, 0 errors, 1 warning, 0 section mismatches

Warnings:
net/ipv4/inet_hashtables.c:608:68: warning: suggest parentheses around ‘+’ in operand of ‘&’ [-Wparentheses]

Section mismatches:
WARNING: modpost: Found 1 section mismatch(es).

--------------------------------------------------------------------------------
palmz72_defconfig (arm, gcc-10) — PASS, 0 errors, 1 warning, 0 section mismatches

Warnings:
net/ipv4/inet_hashtables.c:608:68: warning: suggest parentheses around ‘+’ in operand of ‘&’ [-Wparentheses]

--------------------------------------------------------------------------------
pcm027_defconfig (arm, gcc-10) — PASS, 0 errors, 1 warning, 0 section mismatches

Warnings:
net/ipv4/inet_hashtables.c:608:68: warning: suggest parentheses around ‘+’ in operand of ‘&’ [-Wparentheses]

--------------------------------------------------------------------------------
pleb_defconfig (arm, gcc-10) — PASS, 0 errors, 1 warning, 0 section mismatches

Warnings:
net/ipv4/inet_hashtables.c:608:68: warning: suggest parentheses around ‘+’ in operand of ‘&’ [-Wparentheses]

--------------------------------------------------------------------------------
pnx8335_stb225_defconfig (mips, gcc-10) — PASS, 0 errors, 1 warning, 0 section mismatches

Warnings:
net/ipv4/inet_hashtables.c:608:68: warning: suggest parentheses around ‘+’ in operand of ‘&’ [-Wparentheses]

--------------------------------------------------------------------------------
prima2_defconfig (arm, gcc-10) — PASS, 0 errors, 0 warnings, 0 section mismatches

Section mismatches:
WARNING: drivers/clk/built-in.o(___ksymtab_gpl+of_fixed_factor_clk_setup+0x0): Section mismatch in reference from the variable __ksymtab_of_fixed_factor_clk_setup to the function .init.text:of_fixed_factor_clk_setup()
WARNING: drivers/built-in.o(___ksymtab_gpl+of_fixed_factor_clk_setup+0x0): Section mismatch in reference from the variable __ksymtab_of_fixed_factor_clk_setup to the function .init.text:of_fixed_factor_clk_setup()
WARNING: vmlinux.o(___ksymtab_gpl+of_fixed_factor_clk_setup+0x0): Section mismatch in reference from the variable __ksymtab_of_fixed_factor_clk_setup to the function .init.text:of_fixed_factor_clk_setup()

--------------------------------------------------------------------------------
pxa168_defconfig (arm, gcc-10) — PASS, 0 errors, 1 warning, 0 section mismatches

Warnings:
net/ipv4/inet_hashtables.c:608:68: warning: suggest parentheses around ‘+’ in operand of ‘&’ [-Wparentheses]

--------------------------------------------------------------------------------
pxa255-idp_defconfig (arm, gcc-10) — PASS, 0 errors, 1 warning, 0 section mismatches

Warnings:
net/ipv4/inet_hashtables.c:608:68: warning: suggest parentheses around ‘+’ in operand of ‘&’ [-Wparentheses]

--------------------------------------------------------------------------------
pxa3xx_defconfig (arm, gcc-10) — PASS, 0 errors, 1 warning, 0 section mismatches

Warnings:
net/ipv4/inet_hashtables.c:608:68: warning: suggest parentheses around ‘+’ in operand of ‘&’ [-Wparentheses]

--------------------------------------------------------------------------------
pxa910_defconfig (arm, gcc-10) — PASS, 0 errors, 1 warning, 0 section mismatches

Warnings:
net/ipv4/inet_hashtables.c:608:68: warning: suggest parentheses around ‘+’ in operand of ‘&’ [-Wparentheses]

--------------------------------------------------------------------------------
qcom_defconfig (arm, gcc-10) — PASS, 0 errors, 1 warning, 0 section mismatches

Warnings:
net/ipv4/inet_hashtables.c:608:68: warning: suggest parentheses around ‘+’ in operand of ‘&’ [-Wparentheses]

Section mismatches:
WARNING: modpost: Found 1 section mismatch(es).

--------------------------------------------------------------------------------
qi_lb60_defconfig (mips, gcc-10) — PASS, 0 errors, 1 warning, 0 section mismatches

Warnings:
net/ipv4/inet_hashtables.c:608:68: warning: suggest parentheses around ‘+’ in operand of ‘&’ [-Wparentheses]

Section mismatches:
WARNING: modpost: Found 1 section mismatch(es).

--------------------------------------------------------------------------------
raumfeld_defconfig (arm, gcc-10) — PASS, 0 errors, 1 warning, 0 section mismatches

Warnings:
net/ipv4/inet_hashtables.c:608:68: warning: suggest parentheses around ‘+’ in operand of ‘&’ [-Wparentheses]

--------------------------------------------------------------------------------
rb532_defconfig (mips, gcc-10) — PASS, 0 errors, 1 warning, 0 section mismatches

Warnings:
net/ipv4/inet_hashtables.c:608:68: warning: suggest parentheses around ‘+’ in operand of ‘&’ [-Wparentheses]

--------------------------------------------------------------------------------
rbtx49xx_defconfig (mips, gcc-10) — PASS, 0 errors, 1 warning, 0 section mismatches

Warnings:
net/ipv4/inet_hashtables.c:608:68: warning: suggest parentheses around ‘+’ in operand of ‘&’ [-Wparentheses]

--------------------------------------------------------------------------------
realview-smp_defconfig (arm, gcc-10) — PASS, 0 errors, 1 warning, 0 section mismatches

Warnings:
net/ipv4/inet_hashtables.c:608:68: warning: suggest parentheses around ‘+’ in operand of ‘&’ [-Wparentheses]

--------------------------------------------------------------------------------
realview_defconfig (arm, gcc-10) — PASS, 0 errors, 1 warning, 0 section mismatches

Warnings:
net/ipv4/inet_hashtables.c:608:68: warning: suggest parentheses around ‘+’ in operand of ‘&’ [-Wparentheses]

--------------------------------------------------------------------------------
rm200_defconfig (mips, gcc-10) — PASS, 0 errors, 1 warning, 0 section mismatches

Warnings:
net/ipv4/inet_hashtables.c:608:68: warning: suggest parentheses around ‘+’ in operand of ‘&’ [-Wparentheses]

--------------------------------------------------------------------------------
rpc_defconfig (arm, gcc-10) — FAIL, 2 errors, 0 warnings, 0 section mismatches

Errors:
arm-linux-gnueabihf-gcc: error: unrecognized -march target: armv3
arm-linux-gnueabihf-gcc: error: missing argument to ‘-march=’

--------------------------------------------------------------------------------
rt305x_defconfig (mips, gcc-10) — PASS, 0 errors, 1 warning, 0 section mismatches

Warnings:
net/ipv4/inet_hashtables.c:608:68: warning: suggest parentheses around ‘+’ in operand of ‘&’ [-Wparentheses]

--------------------------------------------------------------------------------
s3c2410_defconfig (arm, gcc-10) — PASS, 0 errors, 2 warnings, 0 section mismatches

Warnings:
net/ipv4/inet_hashtables.c:608:68: warning: suggest parentheses around ‘+’ in operand of ‘&’ [-Wparentheses]
drivers/tty/serial/samsung.c:1776:34: warning: array ‘s3c24xx_uart_dt_match’ assumed to have one element

--------------------------------------------------------------------------------
s3c6400_defconfig (arm, gcc-10) — PASS, 0 errors, 2 warnings, 0 section mismatches

Warnings:
drivers/mmc/host/sdhci-s3c.c:429:34: warning: array ‘sdhci_s3c_dt_match’ assumed to have one element
drivers/tty/serial/samsung.c:1776:34: warning: array ‘s3c24xx_uart_dt_match’ assumed to have one element

Section mismatches:
WARNING: modpost: Found 1 section mismatch(es).

--------------------------------------------------------------------------------
s5pv210_defconfig (arm, gcc-10) — PASS, 0 errors, 0 warnings, 0 section mismatches

Section mismatches:
WARNING: modpost: Found 2 section mismatch(es).

--------------------------------------------------------------------------------
sama5_defconfig (arm, gcc-10) — PASS, 0 errors, 1 warning, 0 section mismatches

Warnings:
net/ipv4/inet_hashtables.c:608:68: warning: suggest parentheses around ‘+’ in operand of ‘&’ [-Wparentheses]

Section mismatches:
WARNING: modpost: Found 1 section mismatch(es).

--------------------------------------------------------------------------------
sb1250_swarm_defconfig (mips, gcc-10) — PASS, 0 errors, 1 warning, 0 section mismatches

Warnings:
net/ipv4/inet_hashtables.c:608:68: warning: suggest parentheses around ‘+’ in operand of ‘&’ [-Wparentheses]

--------------------------------------------------------------------------------
sead3_defconfig (mips, gcc-10) — PASS, 0 errors, 1 warning, 0 section mismatches

Warnings:
net/ipv4/inet_hashtables.c:608:68: warning: suggest parentheses around ‘+’ in operand of ‘&’ [-Wparentheses]

Section mismatches:
WARNING: modpost: Found 1 section mismatch(es).

--------------------------------------------------------------------------------
sead3micro_defconfig (mips, gcc-10) — PASS, 0 errors, 1 warning, 0 section mismatches

Warnings:
net/ipv4/inet_hashtables.c:608:68: warning: suggest parentheses around ‘+’ in operand of ‘&’ [-Wparentheses]

Section mismatches:
WARNING: modpost: Found 1 section mismatch(es).

--------------------------------------------------------------------------------
shannon_defconfig (arm, gcc-10) — PASS, 0 errors, 1 warning, 0 section mismatches

Warnings:
net/ipv4/inet_hashtables.c:608:68: warning: suggest parentheses around ‘+’ in operand of ‘&’ [-Wparentheses]

--------------------------------------------------------------------------------
shmobile_defconfig (arm, gcc-10) — PASS, 0 errors, 1 warning, 0 section mismatches

Warnings:
net/ipv4/inet_hashtables.c:608:68: warning: suggest parentheses around ‘+’ in operand of ‘&’ [-Wparentheses]

--------------------------------------------------------------------------------
simpad_defconfig (arm, gcc-10) — PASS, 0 errors, 1 warning, 0 section mismatches

Warnings:
net/ipv4/inet_hashtables.c:608:68: warning: suggest parentheses around ‘+’ in operand of ‘&’ [-Wparentheses]

--------------------------------------------------------------------------------
socfpga_defconfig (arm, gcc-10) — PASS, 0 errors, 1 warning, 0 section mismatches

Warnings:
net/ipv4/inet_hashtables.c:608:68: warning: suggest parentheses around ‘+’ in operand of ‘&’ [-Wparentheses]

Section mismatches:
WARNING: modpost: Found 1 section mismatch(es).

--------------------------------------------------------------------------------
spear13xx_defconfig (arm, gcc-10) — PASS, 0 errors, 1 warning, 0 section mismatches

Warnings:
net/ipv4/inet_hashtables.c:608:68: warning: suggest parentheses around ‘+’ in operand of ‘&’ [-Wparentheses]

Section mismatches:
WARNING: modpost: Found 1 section mismatch(es).

--------------------------------------------------------------------------------
spear3xx_defconfig (arm, gcc-10) — PASS, 0 errors, 0 warnings, 0 section mismatches

Section mismatches:
WARNING: modpost: Found 2 section mismatch(es).

--------------------------------------------------------------------------------
spear6xx_defconfig (arm, gcc-10) — PASS, 0 errors, 0 warnings, 0 section mismatches

Section mismatches:
WARNING: modpost: Found 2 section mismatch(es).

--------------------------------------------------------------------------------
spitz_defconfig (arm, gcc-10) — PASS, 0 errors, 1 warning, 0 section mismatches

Warnings:
net/ipv4/inet_hashtables.c:608:68: warning: suggest parentheses around ‘+’ in operand of ‘&’ [-Wparentheses]

--------------------------------------------------------------------------------
stm32_defconfig (arm, gcc-10) — PASS, 0 errors, 0 warnings, 0 section mismatches

--------------------------------------------------------------------------------
sunxi_defconfig (arm, gcc-10) — PASS, 0 errors, 1 warning, 0 section mismatches

Warnings:
net/ipv4/inet_hashtables.c:608:68: warning: suggest parentheses around ‘+’ in operand of ‘&’ [-Wparentheses]

Section mismatches:
WARNING: modpost: Found 1 section mismatch(es).

--------------------------------------------------------------------------------
tb0219_defconfig (mips, gcc-10) — PASS, 0 errors, 1 warning, 0 section mismatches

Warnings:
net/ipv4/inet_hashtables.c:608:68: warning: suggest parentheses around ‘+’ in operand of ‘&’ [-Wparentheses]

--------------------------------------------------------------------------------
tb0226_defconfig (mips, gcc-10) — PASS, 0 errors, 1 warning, 0 section mismatches

Warnings:
net/ipv4/inet_hashtables.c:608:68: warning: suggest parentheses around ‘+’ in operand of ‘&’ [-Wparentheses]

--------------------------------------------------------------------------------
tb0287_defconfig (mips, gcc-10) — PASS, 0 errors, 1 warning, 0 section mismatches

Warnings:
net/ipv4/inet_hashtables.c:608:68: warning: suggest parentheses around ‘+’ in operand of ‘&’ [-Wparentheses]

--------------------------------------------------------------------------------
tct_hammer_defconfig (arm, gcc-10) — PASS, 0 errors, 0 warnings, 0 section mismatches

--------------------------------------------------------------------------------
tegra_defconfig (arm, gcc-10) — PASS, 0 errors, 1 warning, 0 section mismatches

Warnings:
net/ipv4/inet_hashtables.c:608:68: warning: suggest parentheses around ‘+’ in operand of ‘&’ [-Wparentheses]

Section mismatches:
WARNING: modpost: Found 1 section mismatch(es).

--------------------------------------------------------------------------------
tinyconfig (mips, gcc-10) — PASS, 0 errors, 0 warnings, 0 section mismatches

--------------------------------------------------------------------------------
tinyconfig (arm, gcc-10) — PASS, 0 errors, 0 warnings, 0 section mismatches

--------------------------------------------------------------------------------
tinyconfig (arc, gcc-10) — PASS, 0 errors, 0 warnings, 0 section mismatches

--------------------------------------------------------------------------------
tinyconfig (x86_64, gcc-10) — PASS, 0 errors, 3 warnings, 0 section mismatches

Warnings:
arch/x86/entry/entry_64.S:487: Warning: no instruction mnemonic suffix given and no register operands; using default for `btr'
arch/x86/entry/entry_64.S:1642: Warning: no instruction mnemonic suffix given and no register operands; using default for `sysret'
arch/x86/kernel/process.c:456: Warning: no instruction mnemonic suffix given and no register operands; using default for `btr'

--------------------------------------------------------------------------------
tinyconfig (i386, gcc-10) — PASS, 0 errors, 0 warnings, 0 section mismatches

--------------------------------------------------------------------------------
trizeps4_defconfig (arm, gcc-10) — PASS, 0 errors, 1 warning, 0 section mismatches

Warnings:
net/ipv4/inet_hashtables.c:608:68: warning: suggest parentheses around ‘+’ in operand of ‘&’ [-Wparentheses]

--------------------------------------------------------------------------------
u300_defconfig (arm, gcc-10) — PASS, 0 errors, 0 warnings, 0 section mismatches

Section mismatches:
WARNING: modpost: Found 2 section mismatch(es).

--------------------------------------------------------------------------------
u8500_defconfig (arm, gcc-10) — PASS, 0 errors, 1 warning, 0 section mismatches

Warnings:
net/ipv4/inet_hashtables.c:608:68: warning: suggest parentheses around ‘+’ in operand of ‘&’ [-Wparentheses]

Section mismatches:
WARNING: modpost: Found 1 section mismatch(es).

--------------------------------------------------------------------------------
vdk_hs38_defconfig (arc, gcc-10) — PASS, 0 errors, 1 warning, 0 section mismatches

Warnings:
net/ipv4/inet_hashtables.c:608:68: warning: suggest parentheses around '+' in operand of '&' [-Wparentheses]

--------------------------------------------------------------------------------
vdk_hs38_smp_defconfig (arc, gcc-10) — PASS, 0 errors, 1 warning, 0 section mismatches

Warnings:
net/ipv4/inet_hashtables.c:608:68: warning: suggest parentheses around '+' in operand of '&' [-Wparentheses]

--------------------------------------------------------------------------------
versatile_defconfig (arm, gcc-10) — PASS, 0 errors, 1 warning, 0 section mismatches

Warnings:
net/ipv4/inet_hashtables.c:608:68: warning: suggest parentheses around ‘+’ in operand of ‘&’ [-Wparentheses]

Section mismatches:
WARNING: modpost: Found 1 section mismatch(es).

--------------------------------------------------------------------------------
vexpress_defconfig (arm, gcc-10) — PASS, 0 errors, 1 warning, 0 section mismatches

Warnings:
net/ipv4/inet_hashtables.c:608:68: warning: suggest parentheses around ‘+’ in operand of ‘&’ [-Wparentheses]

Section mismatches:
WARNING: modpost: Found 1 section mismatch(es).

--------------------------------------------------------------------------------
vf610m4_defconfig (arm, gcc-10) — PASS, 0 errors, 0 warnings, 0 section mismatches

--------------------------------------------------------------------------------
viper_defconfig (arm, gcc-10) — PASS, 0 errors, 1 warning, 0 section mismatches

Warnings:
net/ipv4/inet_hashtables.c:608:68: warning: suggest parentheses around ‘+’ in operand of ‘&’ [-Wparentheses]

--------------------------------------------------------------------------------
vt8500_v6_v7_defconfig (arm, gcc-10) — PASS, 0 errors, 1 warning, 0 section mismatches

Warnings:
net/ipv4/inet_hashtables.c:608:68: warning: suggest parentheses around ‘+’ in operand of ‘&’ [-Wparentheses]

--------------------------------------------------------------------------------
workpad_defconfig (mips, gcc-10) — PASS, 0 errors, 1 warning, 0 section mismatches

Warnings:
net/ipv4/inet_hashtables.c:608:68: warning: suggest parentheses around ‘+’ in operand of ‘&’ [-Wparentheses]

--------------------------------------------------------------------------------
x86_64_defconfig (x86_64, gcc-10) — PASS, 0 errors, 9 warnings, 0 section mismatches

Warnings:
arch/x86/entry/entry_64.S:487: Warning: no instruction mnemonic suffix given and no register operands; using default for `btr'
arch/x86/entry/entry_64.S:1642: Warning: no instruction mnemonic suffix given and no register operands; using default for `sysret'
arch/x86/kernel/process.c:456: Warning: no instruction mnemonic suffix given and no register operands; using default for `btr'
arch/x86/kernel/process.c:456: Warning: no instruction mnemonic suffix given and no register operands; using default for `btr'
net/ipv4/inet_hashtables.c:608:68: warning: suggest parentheses around ‘+’ in operand of ‘&’ [-Wparentheses]
WARNING: vmlinux.o (.discard.nospec): unexpected non-allocatable section.
WARNING: vmlinux.o (.discard.retpoline_safe): unexpected non-allocatable section.
ld: arch/x86/boot/compressed/head_64.o: warning: relocation in read-only section `.head.text'
ld: warning: creating DT_TEXTREL in a PIE

--------------------------------------------------------------------------------
x86_64_defconfig+x86-chromebook (x86_64, gcc-10) — PASS, 0 errors, 9 warnings, 0 section mismatches

Warnings:
arch/x86/entry/entry_64.S:487: Warning: no instruction mnemonic suffix given and no register operands; using default for `btr'
arch/x86/entry/entry_64.S:1642: Warning: no instruction mnemonic suffix given and no register operands; using default for `sysret'
arch/x86/kernel/process.c:456: Warning: no instruction mnemonic suffix given and no register operands; using default for `btr'
arch/x86/kernel/process.c:456: Warning: no instruction mnemonic suffix given and no register operands; using default for `btr'
net/ipv4/inet_hashtables.c:608:68: warning: suggest parentheses around ‘+’ in operand of ‘&’ [-Wparentheses]
WARNING: vmlinux.o (.discard.nospec): unexpected non-allocatable section.
WARNING: vmlinux.o (.discard.retpoline_safe): unexpected non-allocatable section.
ld: arch/x86/boot/compressed/head_64.o: warning: relocation in read-only section `.head.text'
ld: warning: creating DT_TEXTREL in a PIE

--------------------------------------------------------------------------------
xcep_defconfig (arm, gcc-10) — PASS, 0 errors, 1 warning, 0 section mismatches

Warnings:
net/ipv4/inet_hashtables.c:608:68: warning: suggest parentheses around ‘+’ in operand of ‘&’ [-Wparentheses]

--------------------------------------------------------------------------------
xilfpga_defconfig (mips, gcc-10) — PASS, 0 errors, 0 warnings, 0 section mismatches

--------------------------------------------------------------------------------
xway_defconfig (mips, gcc-10) — PASS, 0 errors, 1 warning, 0 section mismatches

Warnings:
net/ipv4/inet_hashtables.c:608:68: warning: suggest parentheses around ‘+’ in operand of ‘&’ [-Wparentheses]

--------------------------------------------------------------------------------
zeus_defconfig (arm, gcc-10) — PASS, 0 errors, 1 warning, 0 section mismatches

Warnings:
net/ipv4/inet_hashtables.c:608:68: warning: suggest parentheses around ‘+’ in operand of ‘&’ [-Wparentheses]

--------------------------------------------------------------------------------
zx_defconfig (arm, gcc-10) — PASS, 0 errors, 0 warnings, 0 section mismatches

---
For more info write to <info@...>


cip/linux-5.10.y-cip baseline: 142 runs, 12 regressions (v5.10.129-cip12-36-g21d9d56f4de5a) #kernelci

kernelci.org bot <bot@...>
 

cip/linux-5.10.y-cip baseline: 142 runs, 12 regressions (v5.10.129-cip12-36-g21d9d56f4de5a)

Regressions Summary
-------------------

platform | arch | lab | compiler | defconfig | regressions
---------------------------+--------+---------------+----------+------------------------------+------------
hp-x360-14-G1-sona | x86_64 | lab-collabora | gcc-10 | x86_64_defcon...6-chromebook | 1
qemu_arm64-virt-gicv2 | arm64 | lab-broonie | gcc-10 | defconfig+arm64-chromebook | 1
qemu_arm64-virt-gicv2 | arm64 | lab-broonie | gcc-10 | defconfig | 1
qemu_arm64-virt-gicv2 | arm64 | lab-collabora | gcc-10 | defconfig | 1
qemu_arm64-virt-gicv2-uefi | arm64 | lab-broonie | gcc-10 | defconfig+arm64-chromebook | 1
qemu_arm64-virt-gicv2-uefi | arm64 | lab-broonie | gcc-10 | defconfig | 1
qemu_arm64-virt-gicv3 | arm64 | lab-broonie | gcc-10 | defconfig+arm64-chromebook | 1
qemu_arm64-virt-gicv3 | arm64 | lab-broonie | gcc-10 | defconfig | 1
qemu_arm64-virt-gicv3 | arm64 | lab-collabora | gcc-10 | defconfig+arm64-chromebook | 1
qemu_arm64-virt-gicv3-uefi | arm64 | lab-broonie | gcc-10 | defconfig+arm64-chromebook | 1
qemu_arm64-virt-gicv3-uefi | arm64 | lab-broonie | gcc-10 | defconfig | 1
rk3399-gru-kevin | arm64 | lab-collabora | gcc-10 | defconfig+arm64-chromebook | 1

Details: https://kernelci.org/test/job/cip/branch/linux-5.10.y-cip/kernel/v5.10.129-cip12-36-g21d9d56f4de5a/plan/baseline/

Test: baseline
Tree: cip
Branch: linux-5.10.y-cip
Describe: v5.10.129-cip12-36-g21d9d56f4de5a
URL: https://git.kernel.org/pub/scm/linux/kernel/git/cip/linux-cip.git
SHA: 21d9d56f4de5acd415b12aecf82f754e9e6065fb


Test Regressions
----------------


platform | arch | lab | compiler | defconfig | regressions
---------------------------+--------+---------------+----------+------------------------------+------------
hp-x360-14-G1-sona | x86_64 | lab-collabora | gcc-10 | x86_64_defcon...6-chromebook | 1

Details: https://kernelci.org/test/plan/id/62dff4483ea71c7e5edaf056

Results: 0 PASS, 1 FAIL, 0 SKIP
Full config: x86_64_defconfig+x86-chromebook
Compiler: gcc-10 (gcc (Debian 10.2.1-6) 10.2.1 20210110)
Plain log: https://storage.kernelci.org//cip/linux-5.10.y-cip/v5.10.129-cip12-36-g21d9d56f4de5a/x86_64/x86_64_defconfig+x86-chromebook/gcc-10/lab-collabora/baseline-hp-x360-14-G1-sona.txt
HTML log: https://storage.kernelci.org//cip/linux-5.10.y-cip/v5.10.129-cip12-36-g21d9d56f4de5a/x86_64/x86_64_defconfig+x86-chromebook/gcc-10/lab-collabora/baseline-hp-x360-14-G1-sona.html
Rootfs: http://storage.kernelci.org/images/rootfs/buildroot/buildroot-baseline/20220718.0/x86/rootfs.cpio.gz


* baseline.login: https://kernelci.org/test/case/id/62dff4483ea71c7e5edaf057
new failure (last pass: v5.10.129-cip12-12-g93db31b19404)



platform | arch | lab | compiler | defconfig | regressions
---------------------------+--------+---------------+----------+------------------------------+------------
qemu_arm64-virt-gicv2 | arm64 | lab-broonie | gcc-10 | defconfig+arm64-chromebook | 1

Details: https://kernelci.org/test/plan/id/62dff8f63ba1284931daf072

Results: 0 PASS, 1 FAIL, 0 SKIP
Full config: defconfig+arm64-chromebook
Compiler: gcc-10 (aarch64-linux-gnu-gcc (Debian 10.2.1-6) 10.2.1 20210110)
Plain log: https://storage.kernelci.org//cip/linux-5.10.y-cip/v5.10.129-cip12-36-g21d9d56f4de5a/arm64/defconfig+arm64-chromebook/gcc-10/lab-broonie/baseline-qemu_arm64-virt-gicv2.txt
HTML log: https://storage.kernelci.org//cip/linux-5.10.y-cip/v5.10.129-cip12-36-g21d9d56f4de5a/arm64/defconfig+arm64-chromebook/gcc-10/lab-broonie/baseline-qemu_arm64-virt-gicv2.html
Rootfs: http://storage.kernelci.org/images/rootfs/buildroot/buildroot-baseline/20220718.0/arm64/rootfs.cpio.gz


* baseline.login: https://kernelci.org/test/case/id/62dff8f63ba1284931daf073
failing since 46 days (last pass: v5.10.112-cip6, first fail: v5.10.121-cip9)



platform | arch | lab | compiler | defconfig | regressions
---------------------------+--------+---------------+----------+------------------------------+------------
qemu_arm64-virt-gicv2 | arm64 | lab-broonie | gcc-10 | defconfig | 1

Details: https://kernelci.org/test/plan/id/62dffa9900d22d324adaf070

Results: 0 PASS, 1 FAIL, 0 SKIP
Full config: defconfig
Compiler: gcc-10 (aarch64-linux-gnu-gcc (Debian 10.2.1-6) 10.2.1 20210110)
Plain log: https://storage.kernelci.org//cip/linux-5.10.y-cip/v5.10.129-cip12-36-g21d9d56f4de5a/arm64/defconfig/gcc-10/lab-broonie/baseline-qemu_arm64-virt-gicv2.txt
HTML log: https://storage.kernelci.org//cip/linux-5.10.y-cip/v5.10.129-cip12-36-g21d9d56f4de5a/arm64/defconfig/gcc-10/lab-broonie/baseline-qemu_arm64-virt-gicv2.html
Rootfs: http://storage.kernelci.org/images/rootfs/buildroot/buildroot-baseline/20220718.0/arm64/rootfs.cpio.gz


* baseline.login: https://kernelci.org/test/case/id/62dffa9900d22d324adaf071
new failure (last pass: v5.10.83-cip1-178-g2cf1d12aab81)



platform | arch | lab | compiler | defconfig | regressions
---------------------------+--------+---------------+----------+------------------------------+------------
qemu_arm64-virt-gicv2 | arm64 | lab-collabora | gcc-10 | defconfig | 1

Details: https://kernelci.org/test/plan/id/62dff9ef7923fd0e83daf090

Results: 0 PASS, 1 FAIL, 0 SKIP
Full config: defconfig
Compiler: gcc-10 (aarch64-linux-gnu-gcc (Debian 10.2.1-6) 10.2.1 20210110)
Plain log: https://storage.kernelci.org//cip/linux-5.10.y-cip/v5.10.129-cip12-36-g21d9d56f4de5a/arm64/defconfig/gcc-10/lab-collabora/baseline-qemu_arm64-virt-gicv2.txt
HTML log: https://storage.kernelci.org//cip/linux-5.10.y-cip/v5.10.129-cip12-36-g21d9d56f4de5a/arm64/defconfig/gcc-10/lab-collabora/baseline-qemu_arm64-virt-gicv2.html
Rootfs: http://storage.kernelci.org/images/rootfs/buildroot/buildroot-baseline/20220718.0/arm64/rootfs.cpio.gz


* baseline.login: https://kernelci.org/test/case/id/62dff9ef7923fd0e83daf091
new failure (last pass: v5.10.83-cip1-178-g2cf1d12aab81)



platform | arch | lab | compiler | defconfig | regressions
---------------------------+--------+---------------+----------+------------------------------+------------
qemu_arm64-virt-gicv2-uefi | arm64 | lab-broonie | gcc-10 | defconfig+arm64-chromebook | 1

Details: https://kernelci.org/test/plan/id/62dff8f73ba1284931daf080

Results: 0 PASS, 1 FAIL, 0 SKIP
Full config: defconfig+arm64-chromebook
Compiler: gcc-10 (aarch64-linux-gnu-gcc (Debian 10.2.1-6) 10.2.1 20210110)
Plain log: https://storage.kernelci.org//cip/linux-5.10.y-cip/v5.10.129-cip12-36-g21d9d56f4de5a/arm64/defconfig+arm64-chromebook/gcc-10/lab-broonie/baseline-qemu_arm64-virt-gicv2-uefi.txt
HTML log: https://storage.kernelci.org//cip/linux-5.10.y-cip/v5.10.129-cip12-36-g21d9d56f4de5a/arm64/defconfig+arm64-chromebook/gcc-10/lab-broonie/baseline-qemu_arm64-virt-gicv2-uefi.html
Rootfs: http://storage.kernelci.org/images/rootfs/buildroot/buildroot-baseline/20220718.0/arm64/rootfs.cpio.gz


* baseline.login: https://kernelci.org/test/case/id/62dff8f73ba1284931daf081
failing since 46 days (last pass: v5.10.112-cip6, first fail: v5.10.121-cip9)



platform | arch | lab | compiler | defconfig | regressions
---------------------------+--------+---------------+----------+------------------------------+------------
qemu_arm64-virt-gicv2-uefi | arm64 | lab-broonie | gcc-10 | defconfig | 1

Details: https://kernelci.org/test/plan/id/62dffa9a6391f34bc1daf056

Results: 0 PASS, 1 FAIL, 0 SKIP
Full config: defconfig
Compiler: gcc-10 (aarch64-linux-gnu-gcc (Debian 10.2.1-6) 10.2.1 20210110)
Plain log: https://storage.kernelci.org//cip/linux-5.10.y-cip/v5.10.129-cip12-36-g21d9d56f4de5a/arm64/defconfig/gcc-10/lab-broonie/baseline-qemu_arm64-virt-gicv2-uefi.txt
HTML log: https://storage.kernelci.org//cip/linux-5.10.y-cip/v5.10.129-cip12-36-g21d9d56f4de5a/arm64/defconfig/gcc-10/lab-broonie/baseline-qemu_arm64-virt-gicv2-uefi.html
Rootfs: http://storage.kernelci.org/images/rootfs/buildroot/buildroot-baseline/20220718.0/arm64/rootfs.cpio.gz


* baseline.login: https://kernelci.org/test/case/id/62dffa9a6391f34bc1daf057
failing since 28 days (last pass: v5.10.112-cip6, first fail: v5.10.125-cip10)



platform | arch | lab | compiler | defconfig | regressions
---------------------------+--------+---------------+----------+------------------------------+------------
qemu_arm64-virt-gicv3 | arm64 | lab-broonie | gcc-10 | defconfig+arm64-chromebook | 1

Details: https://kernelci.org/test/plan/id/62dff8f83ba1284931daf083

Results: 0 PASS, 1 FAIL, 0 SKIP
Full config: defconfig+arm64-chromebook
Compiler: gcc-10 (aarch64-linux-gnu-gcc (Debian 10.2.1-6) 10.2.1 20210110)
Plain log: https://storage.kernelci.org//cip/linux-5.10.y-cip/v5.10.129-cip12-36-g21d9d56f4de5a/arm64/defconfig+arm64-chromebook/gcc-10/lab-broonie/baseline-qemu_arm64-virt-gicv3.txt
HTML log: https://storage.kernelci.org//cip/linux-5.10.y-cip/v5.10.129-cip12-36-g21d9d56f4de5a/arm64/defconfig+arm64-chromebook/gcc-10/lab-broonie/baseline-qemu_arm64-virt-gicv3.html
Rootfs: http://storage.kernelci.org/images/rootfs/buildroot/buildroot-baseline/20220718.0/arm64/rootfs.cpio.gz


* baseline.login: https://kernelci.org/test/case/id/62dff8f83ba1284931daf084
new failure (last pass: v5.10.83-cip1-178-g2cf1d12aab81)



platform | arch | lab | compiler | defconfig | regressions
---------------------------+--------+---------------+----------+------------------------------+------------
qemu_arm64-virt-gicv3 | arm64 | lab-broonie | gcc-10 | defconfig | 1

Details: https://kernelci.org/test/plan/id/62dffa5cd801be47eedaf075

Results: 0 PASS, 1 FAIL, 0 SKIP
Full config: defconfig
Compiler: gcc-10 (aarch64-linux-gnu-gcc (Debian 10.2.1-6) 10.2.1 20210110)
Plain log: https://storage.kernelci.org//cip/linux-5.10.y-cip/v5.10.129-cip12-36-g21d9d56f4de5a/arm64/defconfig/gcc-10/lab-broonie/baseline-qemu_arm64-virt-gicv3.txt
HTML log: https://storage.kernelci.org//cip/linux-5.10.y-cip/v5.10.129-cip12-36-g21d9d56f4de5a/arm64/defconfig/gcc-10/lab-broonie/baseline-qemu_arm64-virt-gicv3.html
Rootfs: http://storage.kernelci.org/images/rootfs/buildroot/buildroot-baseline/20220718.0/arm64/rootfs.cpio.gz


* baseline.login: https://kernelci.org/test/case/id/62dffa5cd801be47eedaf076
failing since 28 days (last pass: v5.10.112-cip6, first fail: v5.10.125-cip10)



platform | arch | lab | compiler | defconfig | regressions
---------------------------+--------+---------------+----------+------------------------------+------------
qemu_arm64-virt-gicv3 | arm64 | lab-collabora | gcc-10 | defconfig+arm64-chromebook | 1

Details: https://kernelci.org/test/plan/id/62dff8d73b2d0e9cc8daf05c

Results: 0 PASS, 1 FAIL, 0 SKIP
Full config: defconfig+arm64-chromebook
Compiler: gcc-10 (aarch64-linux-gnu-gcc (Debian 10.2.1-6) 10.2.1 20210110)
Plain log: https://storage.kernelci.org//cip/linux-5.10.y-cip/v5.10.129-cip12-36-g21d9d56f4de5a/arm64/defconfig+arm64-chromebook/gcc-10/lab-collabora/baseline-qemu_arm64-virt-gicv3.txt
HTML log: https://storage.kernelci.org//cip/linux-5.10.y-cip/v5.10.129-cip12-36-g21d9d56f4de5a/arm64/defconfig+arm64-chromebook/gcc-10/lab-collabora/baseline-qemu_arm64-virt-gicv3.html
Rootfs: http://storage.kernelci.org/images/rootfs/buildroot/buildroot-baseline/20220718.0/arm64/rootfs.cpio.gz


* baseline.login: https://kernelci.org/test/case/id/62dff8d73b2d0e9cc8daf05d
new failure (last pass: v5.10.83-cip1-178-g2cf1d12aab81)



platform | arch | lab | compiler | defconfig | regressions
---------------------------+--------+---------------+----------+------------------------------+------------
qemu_arm64-virt-gicv3-uefi | arm64 | lab-broonie | gcc-10 | defconfig+arm64-chromebook | 1

Details: https://kernelci.org/test/plan/id/62dff8f43ba1284931daf066

Results: 0 PASS, 1 FAIL, 0 SKIP
Full config: defconfig+arm64-chromebook
Compiler: gcc-10 (aarch64-linux-gnu-gcc (Debian 10.2.1-6) 10.2.1 20210110)
Plain log: https://storage.kernelci.org//cip/linux-5.10.y-cip/v5.10.129-cip12-36-g21d9d56f4de5a/arm64/defconfig+arm64-chromebook/gcc-10/lab-broonie/baseline-qemu_arm64-virt-gicv3-uefi.txt
HTML log: https://storage.kernelci.org//cip/linux-5.10.y-cip/v5.10.129-cip12-36-g21d9d56f4de5a/arm64/defconfig+arm64-chromebook/gcc-10/lab-broonie/baseline-qemu_arm64-virt-gicv3-uefi.html
Rootfs: http://storage.kernelci.org/images/rootfs/buildroot/buildroot-baseline/20220718.0/arm64/rootfs.cpio.gz


* baseline.login: https://kernelci.org/test/case/id/62dff8f43ba1284931daf067
failing since 46 days (last pass: v5.10.112-cip6, first fail: v5.10.121-cip9)



platform | arch | lab | compiler | defconfig | regressions
---------------------------+--------+---------------+----------+------------------------------+------------
qemu_arm64-virt-gicv3-uefi | arm64 | lab-broonie | gcc-10 | defconfig | 1

Details: https://kernelci.org/test/plan/id/62dffa5ed801be47eedaf078

Results: 0 PASS, 1 FAIL, 0 SKIP
Full config: defconfig
Compiler: gcc-10 (aarch64-linux-gnu-gcc (Debian 10.2.1-6) 10.2.1 20210110)
Plain log: https://storage.kernelci.org//cip/linux-5.10.y-cip/v5.10.129-cip12-36-g21d9d56f4de5a/arm64/defconfig/gcc-10/lab-broonie/baseline-qemu_arm64-virt-gicv3-uefi.txt
HTML log: https://storage.kernelci.org//cip/linux-5.10.y-cip/v5.10.129-cip12-36-g21d9d56f4de5a/arm64/defconfig/gcc-10/lab-broonie/baseline-qemu_arm64-virt-gicv3-uefi.html
Rootfs: http://storage.kernelci.org/images/rootfs/buildroot/buildroot-baseline/20220718.0/arm64/rootfs.cpio.gz


* baseline.login: https://kernelci.org/test/case/id/62dffa5ed801be47eedaf079
failing since 28 days (last pass: v5.10.112-cip6, first fail: v5.10.125-cip10)



platform | arch | lab | compiler | defconfig | regressions
---------------------------+--------+---------------+----------+------------------------------+------------
rk3399-gru-kevin | arm64 | lab-collabora | gcc-10 | defconfig+arm64-chromebook | 1

Details: https://kernelci.org/test/plan/id/62dffa3968c8d6939ddaf090

Results: 90 PASS, 2 FAIL, 0 SKIP
Full config: defconfig+arm64-chromebook
Compiler: gcc-10 (aarch64-linux-gnu-gcc (Debian 10.2.1-6) 10.2.1 20210110)
Plain log: https://storage.kernelci.org//cip/linux-5.10.y-cip/v5.10.129-cip12-36-g21d9d56f4de5a/arm64/defconfig+arm64-chromebook/gcc-10/lab-collabora/baseline-rk3399-gru-kevin.txt
HTML log: https://storage.kernelci.org//cip/linux-5.10.y-cip/v5.10.129-cip12-36-g21d9d56f4de5a/arm64/defconfig+arm64-chromebook/gcc-10/lab-collabora/baseline-rk3399-gru-kevin.html
Rootfs: http://storage.kernelci.org/images/rootfs/buildroot/buildroot-baseline/20220718.0/arm64/rootfs.cpio.gz


* baseline.bootrr.rockchip-i2s1-probed: https://kernelci.org/test/case/id/62dffa3968c8d6939ddaf0b2
failing since 119 days (last pass: v5.10.83-cip1-178-g2cf1d12aab81, first fail: v5.10.106-cip4)

2022-07-26T14:29:08.159088 <8>[ 33.049215] <LAVA_SIGNAL_TESTCASE TEST_CASE_ID=rockchip-i2s0-probed RESULT=pass>
2022-07-26T14:29:09.180864 /lava-6895466/1/../bin/lava-test-case
2022-07-26T14:29:09.191714 <8>[ 34.083417] <LAVA_SIGNAL_TESTCASE TEST_CASE_ID=rockchip-i2s1-probed RESULT=fail>


cip/linux-5.10.y-cip baseline-nfs: 28 runs, 2 regressions (v5.10.129-cip12-36-g21d9d56f4de5a) #kernelci

kernelci.org bot <bot@...>
 

cip/linux-5.10.y-cip baseline-nfs: 28 runs, 2 regressions (v5.10.129-cip12-36-g21d9d56f4de5a)

Regressions Summary
-------------------

platform | arch | lab | compiler | defconfig | regressions
----------------------+-------+---------------+----------+----------------------------+------------
meson-gxm-khadas-vim2 | arm64 | lab-baylibre | gcc-10 | defconfig | 1
rk3399-gru-kevin | arm64 | lab-collabora | gcc-10 | defconfig+arm64-chromebook | 1

Details: https://kernelci.org/test/job/cip/branch/linux-5.10.y-cip/kernel/v5.10.129-cip12-36-g21d9d56f4de5a/plan/baseline-nfs/

Test: baseline-nfs
Tree: cip
Branch: linux-5.10.y-cip
Describe: v5.10.129-cip12-36-g21d9d56f4de5a
URL: https://git.kernel.org/pub/scm/linux/kernel/git/cip/linux-cip.git
SHA: 21d9d56f4de5acd415b12aecf82f754e9e6065fb


Test Regressions
----------------


platform | arch | lab | compiler | defconfig | regressions
----------------------+-------+---------------+----------+----------------------------+------------
meson-gxm-khadas-vim2 | arm64 | lab-baylibre | gcc-10 | defconfig | 1

Details: https://kernelci.org/test/plan/id/62dffa0d4c6a289a15daf061

Results: 0 PASS, 1 FAIL, 0 SKIP
Full config: defconfig
Compiler: gcc-10 (aarch64-linux-gnu-gcc (Debian 10.2.1-6) 10.2.1 20210110)
Plain log: https://storage.kernelci.org//cip/linux-5.10.y-cip/v5.10.129-cip12-36-g21d9d56f4de5a/arm64/defconfig/gcc-10/lab-baylibre/baseline-nfs-meson-gxm-khadas-vim2.txt
HTML log: https://storage.kernelci.org//cip/linux-5.10.y-cip/v5.10.129-cip12-36-g21d9d56f4de5a/arm64/defconfig/gcc-10/lab-baylibre/baseline-nfs-meson-gxm-khadas-vim2.html
Rootfs: http://storage.kernelci.org/images/rootfs/debian/bullseye/20220718.0/arm64/initrd.cpio.gz


* baseline-nfs.login: https://kernelci.org/test/case/id/62dffa0d4c6a289a15daf062
failing since 217 days (last pass: v5.10.8-8301-g3d6168cb89f6, first fail: v5.10.83-cip1-31-gdcbef6602957)



platform | arch | lab | compiler | defconfig | regressions
----------------------+-------+---------------+----------+----------------------------+------------
rk3399-gru-kevin | arm64 | lab-collabora | gcc-10 | defconfig+arm64-chromebook | 1

Details: https://kernelci.org/test/plan/id/62dff91fbdefe46f20daf067

Results: 84 PASS, 4 FAIL, 0 SKIP
Full config: defconfig+arm64-chromebook
Compiler: gcc-10 (aarch64-linux-gnu-gcc (Debian 10.2.1-6) 10.2.1 20210110)
Plain log: https://storage.kernelci.org//cip/linux-5.10.y-cip/v5.10.129-cip12-36-g21d9d56f4de5a/arm64/defconfig+arm64-chromebook/gcc-10/lab-collabora/baseline-nfs-rk3399-gru-kevin.txt
HTML log: https://storage.kernelci.org//cip/linux-5.10.y-cip/v5.10.129-cip12-36-g21d9d56f4de5a/arm64/defconfig+arm64-chromebook/gcc-10/lab-collabora/baseline-nfs-rk3399-gru-kevin.html
Rootfs: http://storage.kernelci.org/images/rootfs/debian/bullseye/20220718.0/arm64/initrd.cpio.gz


* baseline-nfs.bootrr.rockchip-i2s1-probed: https://kernelci.org/test/case/id/62dff91fbdefe46f20daf089
failing since 119 days (last pass: v5.10.83-cip1-178-g2cf1d12aab81, first fail: v5.10.106-cip4)

2022-07-26T14:24:21.546655 <4>[ 37.988152] cdn-dp fec00000.dp: Direct firmware load for rockchip/dptx.bin failed with error -2
2022-07-26T14:24:21.555943 <4>[ 37.998468] cdn-dp fec00000.dp: Falling back to sysfs fallback for: rockchip/dptx.bin
2022-07-26T14:24:21.752817 /lava-6895453/1/../bin/lava-test-case


cip/linux-5.10.y-cip build: 190 builds: 3 failed, 187 passed, 4 errors, 10 warnings (v5.10.129-cip12-36-g21d9d56f4de5a) #kernelci

kernelci.org bot <bot@...>
 

cip/linux-5.10.y-cip build: 190 builds: 3 failed, 187 passed, 4 errors, 10 warnings (v5.10.129-cip12-36-g21d9d56f4de5a)

Full Build Summary: https://kernelci.org/build/cip/branch/linux-5.10.y-cip/kernel/v5.10.129-cip12-36-g21d9d56f4de5a/

Tree: cip
Branch: linux-5.10.y-cip
Git Describe: v5.10.129-cip12-36-g21d9d56f4de5a
Git Commit: 21d9d56f4de5acd415b12aecf82f754e9e6065fb
Git URL: https://git.kernel.org/pub/scm/linux/kernel/git/cip/linux-cip.git
Built: 7 unique architectures

Build Failures Detected:

arm:
rpc_defconfig: (gcc-10) FAIL

mips:
ip27_defconfig: (gcc-10) FAIL
ip28_defconfig: (gcc-10) FAIL

Errors and Warnings Detected:

arc:

arm64:

arm:
rpc_defconfig (gcc-10): 4 errors

i386:

mips:
32r2el_defconfig (gcc-10): 1 warning
decstation_64_defconfig (gcc-10): 1 warning
decstation_defconfig (gcc-10): 1 warning
decstation_r4k_defconfig (gcc-10): 1 warning
lemote2f_defconfig (gcc-10): 1 warning
rm200_defconfig (gcc-10): 1 warning

riscv:
rv32_defconfig (gcc-10): 4 warnings

x86_64:

Errors summary:

2 arm-linux-gnueabihf-gcc: error: unrecognized -march target: armv3m
2 arm-linux-gnueabihf-gcc: error: missing argument to ‘-march=’

Warnings summary:

3 kernel/rcu/tasks.h:710:13: warning: ‘show_rcu_tasks_rude_gp_kthread’ defined but not used [-Wunused-function]
2 <stdin>:830:2: warning: #warning syscall fstat64 not implemented [-Wcpp]
2 <stdin>:1127:2: warning: #warning syscall fstatat64 not implemented [-Wcpp]
1 net/mac80211/mlme.c:4349:1: warning: the frame size of 1040 bytes is larger than 1024 bytes [-Wframe-larger-than=]
1 drivers/block/paride/bpck.c:32: warning: "PC" redefined
1 WARNING: modpost: Symbol info of vmlinux is missing. Unresolved symbol check will be entirely skipped.

Section mismatches summary:

1 WARNING: modpost: vmlinux.o(___ksymtab_gpl+ixp4xx_irq_init+0x0): Section mismatch in reference from the variable __ksymtab_ixp4xx_irq_init to the function .init.text:ixp4xx_irq_init()
1 WARNING: modpost: vmlinux.o(___ksymtab+prom_init_numa_memory+0x0): Section mismatch in reference from the variable __ksymtab_prom_init_numa_memory to the function .init.text:prom_init_numa_memory()

================================================================================

Detailed per-defconfig build reports:

--------------------------------------------------------------------------------
32r2el_defconfig (mips, gcc-10) — PASS, 0 errors, 1 warning, 0 section mismatches

Warnings:
WARNING: modpost: Symbol info of vmlinux is missing. Unresolved symbol check will be entirely skipped.

--------------------------------------------------------------------------------
allnoconfig (i386, gcc-10) — PASS, 0 errors, 0 warnings, 0 section mismatches

--------------------------------------------------------------------------------
allnoconfig (arc, gcc-10) — PASS, 0 errors, 0 warnings, 0 section mismatches

--------------------------------------------------------------------------------
allnoconfig (x86_64, gcc-10) — PASS, 0 errors, 0 warnings, 0 section mismatches

--------------------------------------------------------------------------------
am200epdkit_defconfig (arm, gcc-10) — PASS, 0 errors, 0 warnings, 0 section mismatches

--------------------------------------------------------------------------------
ar7_defconfig (mips, gcc-10) — PASS, 0 errors, 0 warnings, 0 section mismatches

--------------------------------------------------------------------------------
aspeed_g4_defconfig (arm, gcc-10) — PASS, 0 errors, 0 warnings, 0 section mismatches

--------------------------------------------------------------------------------
aspeed_g5_defconfig (arm, gcc-10) — PASS, 0 errors, 0 warnings, 0 section mismatches

--------------------------------------------------------------------------------
assabet_defconfig (arm, gcc-10) — PASS, 0 errors, 0 warnings, 0 section mismatches

--------------------------------------------------------------------------------
at91_dt_defconfig (arm, gcc-10) — PASS, 0 errors, 0 warnings, 0 section mismatches

--------------------------------------------------------------------------------
ath25_defconfig (mips, gcc-10) — PASS, 0 errors, 0 warnings, 0 section mismatches

--------------------------------------------------------------------------------
ath79_defconfig (mips, gcc-10) — PASS, 0 errors, 0 warnings, 0 section mismatches

--------------------------------------------------------------------------------
axm55xx_defconfig (arm, gcc-10) — PASS, 0 errors, 0 warnings, 0 section mismatches

--------------------------------------------------------------------------------
axs103_defconfig (arc, gcc-10) — PASS, 0 errors, 0 warnings, 0 section mismatches

--------------------------------------------------------------------------------
axs103_smp_defconfig (arc, gcc-10) — PASS, 0 errors, 0 warnings, 0 section mismatches

--------------------------------------------------------------------------------
badge4_defconfig (arm, gcc-10) — PASS, 0 errors, 0 warnings, 0 section mismatches

--------------------------------------------------------------------------------
bcm2835_defconfig (arm, gcc-10) — PASS, 0 errors, 0 warnings, 0 section mismatches

--------------------------------------------------------------------------------
bcm47xx_defconfig (mips, gcc-10) — PASS, 0 errors, 0 warnings, 0 section mismatches

--------------------------------------------------------------------------------
bcm63xx_defconfig (mips, gcc-10) — PASS, 0 errors, 0 warnings, 0 section mismatches

--------------------------------------------------------------------------------
bigsur_defconfig (mips, gcc-10) — PASS, 0 errors, 0 warnings, 0 section mismatches

--------------------------------------------------------------------------------
bmips_be_defconfig (mips, gcc-10) — PASS, 0 errors, 0 warnings, 0 section mismatches

--------------------------------------------------------------------------------
bmips_stb_defconfig (mips, gcc-10) — PASS, 0 errors, 0 warnings, 0 section mismatches

--------------------------------------------------------------------------------
capcella_defconfig (mips, gcc-10) — PASS, 0 errors, 0 warnings, 0 section mismatches

--------------------------------------------------------------------------------
cavium_octeon_defconfig (mips, gcc-10) — PASS, 0 errors, 0 warnings, 0 section mismatches

--------------------------------------------------------------------------------
cerfcube_defconfig (arm, gcc-10) — PASS, 0 errors, 0 warnings, 0 section mismatches

--------------------------------------------------------------------------------
ci20_defconfig (mips, gcc-10) — PASS, 0 errors, 0 warnings, 0 section mismatches

--------------------------------------------------------------------------------
cm_x300_defconfig (arm, gcc-10) — PASS, 0 errors, 0 warnings, 0 section mismatches

--------------------------------------------------------------------------------
cobalt_defconfig (mips, gcc-10) — PASS, 0 errors, 0 warnings, 0 section mismatches

--------------------------------------------------------------------------------
colibri_pxa270_defconfig (arm, gcc-10) — PASS, 0 errors, 0 warnings, 0 section mismatches

--------------------------------------------------------------------------------
colibri_pxa300_defconfig (arm, gcc-10) — PASS, 0 errors, 0 warnings, 0 section mismatches

--------------------------------------------------------------------------------
collie_defconfig (arm, gcc-10) — PASS, 0 errors, 0 warnings, 0 section mismatches

--------------------------------------------------------------------------------
corgi_defconfig (arm, gcc-10) — PASS, 0 errors, 0 warnings, 0 section mismatches

--------------------------------------------------------------------------------
cu1000-neo_defconfig (mips, gcc-10) — PASS, 0 errors, 0 warnings, 0 section mismatches

--------------------------------------------------------------------------------
cu1830-neo_defconfig (mips, gcc-10) — PASS, 0 errors, 0 warnings, 0 section mismatches

--------------------------------------------------------------------------------
davinci_all_defconfig (arm, gcc-10) — PASS, 0 errors, 0 warnings, 0 section mismatches

--------------------------------------------------------------------------------
db1xxx_defconfig (mips, gcc-10) — PASS, 0 errors, 0 warnings, 0 section mismatches

--------------------------------------------------------------------------------
decstation_64_defconfig (mips, gcc-10) — PASS, 0 errors, 1 warning, 0 section mismatches

Warnings:
kernel/rcu/tasks.h:710:13: warning: ‘show_rcu_tasks_rude_gp_kthread’ defined but not used [-Wunused-function]

--------------------------------------------------------------------------------
decstation_defconfig (mips, gcc-10) — PASS, 0 errors, 1 warning, 0 section mismatches

Warnings:
kernel/rcu/tasks.h:710:13: warning: ‘show_rcu_tasks_rude_gp_kthread’ defined but not used [-Wunused-function]

--------------------------------------------------------------------------------
decstation_r4k_defconfig (mips, gcc-10) — PASS, 0 errors, 1 warning, 0 section mismatches

Warnings:
kernel/rcu/tasks.h:710:13: warning: ‘show_rcu_tasks_rude_gp_kthread’ defined but not used [-Wunused-function]

--------------------------------------------------------------------------------
defconfig (riscv, gcc-10) — PASS, 0 errors, 0 warnings, 0 section mismatches

--------------------------------------------------------------------------------
defconfig (arm64, gcc-10) — PASS, 0 errors, 0 warnings, 0 section mismatches

--------------------------------------------------------------------------------
defconfig+arm64-chromebook (arm64, gcc-10) — PASS, 0 errors, 0 warnings, 0 section mismatches

--------------------------------------------------------------------------------
defconfig+arm64-chromebook+kselftest (arm64, gcc-10) — PASS, 0 errors, 0 warnings, 0 section mismatches

--------------------------------------------------------------------------------
defconfig+kselftest (arm64, gcc-10) — PASS, 0 errors, 0 warnings, 0 section mismatches

--------------------------------------------------------------------------------
dove_defconfig (arm, gcc-10) — PASS, 0 errors, 0 warnings, 0 section mismatches

--------------------------------------------------------------------------------
e55_defconfig (mips, gcc-10) — PASS, 0 errors, 0 warnings, 0 section mismatches

--------------------------------------------------------------------------------
ebsa110_defconfig (arm, gcc-10) — PASS, 0 errors, 0 warnings, 0 section mismatches

--------------------------------------------------------------------------------
efm32_defconfig (arm, gcc-10) — PASS, 0 errors, 0 warnings, 0 section mismatches

--------------------------------------------------------------------------------
ep93xx_defconfig (arm, gcc-10) — PASS, 0 errors, 0 warnings, 0 section mismatches

--------------------------------------------------------------------------------
eseries_pxa_defconfig (arm, gcc-10) — PASS, 0 errors, 0 warnings, 0 section mismatches

--------------------------------------------------------------------------------
exynos_defconfig (arm, gcc-10) — PASS, 0 errors, 0 warnings, 0 section mismatches

--------------------------------------------------------------------------------
ezx_defconfig (arm, gcc-10) — PASS, 0 errors, 0 warnings, 0 section mismatches

--------------------------------------------------------------------------------
footbridge_defconfig (arm, gcc-10) — PASS, 0 errors, 0 warnings, 0 section mismatches

--------------------------------------------------------------------------------
fuloong2e_defconfig (mips, gcc-10) — PASS, 0 errors, 0 warnings, 0 section mismatches

--------------------------------------------------------------------------------
gcw0_defconfig (mips, gcc-10) — PASS, 0 errors, 0 warnings, 0 section mismatches

--------------------------------------------------------------------------------
gemini_defconfig (arm, gcc-10) — PASS, 0 errors, 0 warnings, 0 section mismatches

--------------------------------------------------------------------------------
gpr_defconfig (mips, gcc-10) — PASS, 0 errors, 0 warnings, 0 section mismatches

--------------------------------------------------------------------------------
h3600_defconfig (arm, gcc-10) — PASS, 0 errors, 0 warnings, 0 section mismatches

--------------------------------------------------------------------------------
h5000_defconfig (arm, gcc-10) — PASS, 0 errors, 0 warnings, 0 section mismatches

--------------------------------------------------------------------------------
hackkit_defconfig (arm, gcc-10) — PASS, 0 errors, 0 warnings, 0 section mismatches

--------------------------------------------------------------------------------
haps_hs_defconfig (arc, gcc-10) — PASS, 0 errors, 0 warnings, 0 section mismatches

--------------------------------------------------------------------------------
haps_hs_smp_defconfig (arc, gcc-10) — PASS, 0 errors, 0 warnings, 0 section mismatches

--------------------------------------------------------------------------------
hisi_defconfig (arm, gcc-10) — PASS, 0 errors, 0 warnings, 0 section mismatches

--------------------------------------------------------------------------------
hsdk_defconfig (arc, gcc-10) — PASS, 0 errors, 0 warnings, 0 section mismatches

--------------------------------------------------------------------------------
i386_defconfig (i386, gcc-10) — PASS, 0 errors, 0 warnings, 0 section mismatches

--------------------------------------------------------------------------------
imote2_defconfig (arm, gcc-10) — PASS, 0 errors, 0 warnings, 0 section mismatches

--------------------------------------------------------------------------------
imx_v4_v5_defconfig (arm, gcc-10) — PASS, 0 errors, 0 warnings, 0 section mismatches

--------------------------------------------------------------------------------
imx_v6_v7_defconfig (arm, gcc-10) — PASS, 0 errors, 0 warnings, 0 section mismatches

--------------------------------------------------------------------------------
integrator_defconfig (arm, gcc-10) — PASS, 0 errors, 0 warnings, 0 section mismatches

--------------------------------------------------------------------------------
iop32x_defconfig (arm, gcc-10) — PASS, 0 errors, 0 warnings, 0 section mismatches

--------------------------------------------------------------------------------
ip22_defconfig (mips, gcc-10) — PASS, 0 errors, 0 warnings, 0 section mismatches

--------------------------------------------------------------------------------
ip27_defconfig (mips, gcc-10) — FAIL, 0 errors, 0 warnings, 0 section mismatches

--------------------------------------------------------------------------------
ip28_defconfig (mips, gcc-10) — FAIL, 0 errors, 0 warnings, 0 section mismatches

--------------------------------------------------------------------------------
ip32_defconfig (mips, gcc-10) — PASS, 0 errors, 0 warnings, 0 section mismatches

--------------------------------------------------------------------------------
ixp4xx_defconfig (arm, gcc-10) — PASS, 0 errors, 0 warnings, 0 section mismatches

Section mismatches:
WARNING: modpost: vmlinux.o(___ksymtab_gpl+ixp4xx_irq_init+0x0): Section mismatch in reference from the variable __ksymtab_ixp4xx_irq_init to the function .init.text:ixp4xx_irq_init()

--------------------------------------------------------------------------------
jazz_defconfig (mips, gcc-10) — PASS, 0 errors, 0 warnings, 0 section mismatches

--------------------------------------------------------------------------------
jmr3927_defconfig (mips, gcc-10) — PASS, 0 errors, 0 warnings, 0 section mismatches

--------------------------------------------------------------------------------
jornada720_defconfig (arm, gcc-10) — PASS, 0 errors, 0 warnings, 0 section mismatches

--------------------------------------------------------------------------------
keystone_defconfig (arm, gcc-10) — PASS, 0 errors, 0 warnings, 0 section mismatches

--------------------------------------------------------------------------------
lart_defconfig (arm, gcc-10) — PASS, 0 errors, 0 warnings, 0 section mismatches

--------------------------------------------------------------------------------
lemote2f_defconfig (mips, gcc-10) — PASS, 0 errors, 1 warning, 0 section mismatches

Warnings:
net/mac80211/mlme.c:4349:1: warning: the frame size of 1040 bytes is larger than 1024 bytes [-Wframe-larger-than=]

--------------------------------------------------------------------------------
loongson1b_defconfig (mips, gcc-10) — PASS, 0 errors, 0 warnings, 0 section mismatches

--------------------------------------------------------------------------------
loongson1c_defconfig (mips, gcc-10) — PASS, 0 errors, 0 warnings, 0 section mismatches

--------------------------------------------------------------------------------
loongson3_defconfig (mips, gcc-10) — PASS, 0 errors, 0 warnings, 0 section mismatches

Section mismatches:
WARNING: modpost: vmlinux.o(___ksymtab+prom_init_numa_memory+0x0): Section mismatch in reference from the variable __ksymtab_prom_init_numa_memory to the function .init.text:prom_init_numa_memory()

--------------------------------------------------------------------------------
lpc18xx_defconfig (arm, gcc-10) — PASS, 0 errors, 0 warnings, 0 section mismatches

--------------------------------------------------------------------------------
lpc32xx_defconfig (arm, gcc-10) — PASS, 0 errors, 0 warnings, 0 section mismatches

--------------------------------------------------------------------------------
lpd270_defconfig (arm, gcc-10) — PASS, 0 errors, 0 warnings, 0 section mismatches

--------------------------------------------------------------------------------
lubbock_defconfig (arm, gcc-10) — PASS, 0 errors, 0 warnings, 0 section mismatches

--------------------------------------------------------------------------------
magician_defconfig (arm, gcc-10) — PASS, 0 errors, 0 warnings, 0 section mismatches

--------------------------------------------------------------------------------
mainstone_defconfig (arm, gcc-10) — PASS, 0 errors, 0 warnings, 0 section mismatches

--------------------------------------------------------------------------------
malta_defconfig (mips, gcc-10) — PASS, 0 errors, 0 warnings, 0 section mismatches

--------------------------------------------------------------------------------
malta_kvm_defconfig (mips, gcc-10) — PASS, 0 errors, 0 warnings, 0 section mismatches

--------------------------------------------------------------------------------
malta_kvm_guest_defconfig (mips, gcc-10) — PASS, 0 errors, 0 warnings, 0 section mismatches

--------------------------------------------------------------------------------
malta_qemu_32r6_defconfig (mips, gcc-10) — PASS, 0 errors, 0 warnings, 0 section mismatches

--------------------------------------------------------------------------------
maltaaprp_defconfig (mips, gcc-10) — PASS, 0 errors, 0 warnings, 0 section mismatches

--------------------------------------------------------------------------------
maltasmvp_defconfig (mips, gcc-10) — PASS, 0 errors, 0 warnings, 0 section mismatches

--------------------------------------------------------------------------------
maltasmvp_eva_defconfig (mips, gcc-10) — PASS, 0 errors, 0 warnings, 0 section mismatches

--------------------------------------------------------------------------------
maltaup_defconfig (mips, gcc-10) — PASS, 0 errors, 0 warnings, 0 section mismatches

--------------------------------------------------------------------------------
maltaup_xpa_defconfig (mips, gcc-10) — PASS, 0 errors, 0 warnings, 0 section mismatches

--------------------------------------------------------------------------------
milbeaut_m10v_defconfig (arm, gcc-10) — PASS, 0 errors, 0 warnings, 0 section mismatches

--------------------------------------------------------------------------------
mini2440_defconfig (arm, gcc-10) — PASS, 0 errors, 0 warnings, 0 section mismatches

--------------------------------------------------------------------------------
mmp2_defconfig (arm, gcc-10) — PASS, 0 errors, 0 warnings, 0 section mismatches

--------------------------------------------------------------------------------
moxart_defconfig (arm, gcc-10) — PASS, 0 errors, 0 warnings, 0 section mismatches

--------------------------------------------------------------------------------
mpc30x_defconfig (mips, gcc-10) — PASS, 0 errors, 0 warnings, 0 section mismatches

--------------------------------------------------------------------------------
mps2_defconfig (arm, gcc-10) — PASS, 0 errors, 0 warnings, 0 section mismatches

--------------------------------------------------------------------------------
mtx1_defconfig (mips, gcc-10) — PASS, 0 errors, 0 warnings, 0 section mismatches

--------------------------------------------------------------------------------
multi_v4t_defconfig (arm, gcc-10) — PASS, 0 errors, 0 warnings, 0 section mismatches

--------------------------------------------------------------------------------
multi_v5_defconfig (arm, gcc-10) — PASS, 0 errors, 0 warnings, 0 section mismatches

--------------------------------------------------------------------------------
multi_v7_defconfig (arm, gcc-10) — PASS, 0 errors, 0 warnings, 0 section mismatches

--------------------------------------------------------------------------------
multi_v7_defconfig+kselftest (arm, gcc-10) — PASS, 0 errors, 0 warnings, 0 section mismatches

--------------------------------------------------------------------------------
mvebu_v5_defconfig (arm, gcc-10) — PASS, 0 errors, 0 warnings, 0 section mismatches

--------------------------------------------------------------------------------
mvebu_v7_defconfig (arm, gcc-10) — PASS, 0 errors, 0 warnings, 0 section mismatches

--------------------------------------------------------------------------------
mxs_defconfig (arm, gcc-10) — PASS, 0 errors, 0 warnings, 0 section mismatches

--------------------------------------------------------------------------------
neponset_defconfig (arm, gcc-10) — PASS, 0 errors, 0 warnings, 0 section mismatches

--------------------------------------------------------------------------------
netwinder_defconfig (arm, gcc-10) — PASS, 0 errors, 0 warnings, 0 section mismatches

--------------------------------------------------------------------------------
nhk8815_defconfig (arm, gcc-10) — PASS, 0 errors, 0 warnings, 0 section mismatches

--------------------------------------------------------------------------------
nlm_xlp_defconfig (mips, gcc-10) — PASS, 0 errors, 0 warnings, 0 section mismatches

--------------------------------------------------------------------------------
nlm_xlr_defconfig (mips, gcc-10) — PASS, 0 errors, 0 warnings, 0 section mismatches

--------------------------------------------------------------------------------
nommu_k210_defconfig (riscv, gcc-10) — PASS, 0 errors, 0 warnings, 0 section mismatches

--------------------------------------------------------------------------------
nsimosci_hs_defconfig (arc, gcc-10) — PASS, 0 errors, 0 warnings, 0 section mismatches

--------------------------------------------------------------------------------
nsimosci_hs_smp_defconfig (arc, gcc-10) — PASS, 0 errors, 0 warnings, 0 section mismatches

--------------------------------------------------------------------------------
omap1_defconfig (arm, gcc-10) — PASS, 0 errors, 0 warnings, 0 section mismatches

--------------------------------------------------------------------------------
omap2plus_defconfig (arm, gcc-10) — PASS, 0 errors, 0 warnings, 0 section mismatches

--------------------------------------------------------------------------------
omega2p_defconfig (mips, gcc-10) — PASS, 0 errors, 0 warnings, 0 section mismatches

--------------------------------------------------------------------------------
orion5x_defconfig (arm, gcc-10) — PASS, 0 errors, 0 warnings, 0 section mismatches

--------------------------------------------------------------------------------
oxnas_v6_defconfig (arm, gcc-10) — PASS, 0 errors, 0 warnings, 0 section mismatches

--------------------------------------------------------------------------------
palmz72_defconfig (arm, gcc-10) — PASS, 0 errors, 0 warnings, 0 section mismatches

--------------------------------------------------------------------------------
pcm027_defconfig (arm, gcc-10) — PASS, 0 errors, 0 warnings, 0 section mismatches

--------------------------------------------------------------------------------
pic32mzda_defconfig (mips, gcc-10) — PASS, 0 errors, 0 warnings, 0 section mismatches

--------------------------------------------------------------------------------
pistachio_defconfig (mips, gcc-10) — PASS, 0 errors, 0 warnings, 0 section mismatches

--------------------------------------------------------------------------------
pleb_defconfig (arm, gcc-10) — PASS, 0 errors, 0 warnings, 0 section mismatches

--------------------------------------------------------------------------------
prima2_defconfig (arm, gcc-10) — PASS, 0 errors, 0 warnings, 0 section mismatches

--------------------------------------------------------------------------------
pxa168_defconfig (arm, gcc-10) — PASS, 0 errors, 0 warnings, 0 section mismatches

--------------------------------------------------------------------------------
pxa255-idp_defconfig (arm, gcc-10) — PASS, 0 errors, 0 warnings, 0 section mismatches

--------------------------------------------------------------------------------
pxa3xx_defconfig (arm, gcc-10) — PASS, 0 errors, 0 warnings, 0 section mismatches

--------------------------------------------------------------------------------
pxa910_defconfig (arm, gcc-10) — PASS, 0 errors, 0 warnings, 0 section mismatches

--------------------------------------------------------------------------------
pxa_defconfig (arm, gcc-10) — PASS, 0 errors, 0 warnings, 0 section mismatches

--------------------------------------------------------------------------------
qcom_defconfig (arm, gcc-10) — PASS, 0 errors, 0 warnings, 0 section mismatches

--------------------------------------------------------------------------------
qi_lb60_defconfig (mips, gcc-10) — PASS, 0 errors, 0 warnings, 0 section mismatches

--------------------------------------------------------------------------------
rb532_defconfig (mips, gcc-10) — PASS, 0 errors, 0 warnings, 0 section mismatches

--------------------------------------------------------------------------------
rbtx49xx_defconfig (mips, gcc-10) — PASS, 0 errors, 0 warnings, 0 section mismatches

--------------------------------------------------------------------------------
realview_defconfig (arm, gcc-10) — PASS, 0 errors, 0 warnings, 0 section mismatches

--------------------------------------------------------------------------------
rm200_defconfig (mips, gcc-10) — PASS, 0 errors, 1 warning, 0 section mismatches

Warnings:
drivers/block/paride/bpck.c:32: warning: "PC" redefined

--------------------------------------------------------------------------------
rpc_defconfig (arm, gcc-10) — FAIL, 4 errors, 0 warnings, 0 section mismatches

Errors:
arm-linux-gnueabihf-gcc: error: unrecognized -march target: armv3m
arm-linux-gnueabihf-gcc: error: missing argument to ‘-march=’
arm-linux-gnueabihf-gcc: error: unrecognized -march target: armv3m
arm-linux-gnueabihf-gcc: error: missing argument to ‘-march=’

--------------------------------------------------------------------------------
rs90_defconfig (mips, gcc-10) — PASS, 0 errors, 0 warnings, 0 section mismatches

--------------------------------------------------------------------------------
rt305x_defconfig (mips, gcc-10) — PASS, 0 errors, 0 warnings, 0 section mismatches

--------------------------------------------------------------------------------
rv32_defconfig (riscv, gcc-10) — PASS, 0 errors, 4 warnings, 0 section mismatches

Warnings:
<stdin>:830:2: warning: #warning syscall fstat64 not implemented [-Wcpp]
<stdin>:1127:2: warning: #warning syscall fstatat64 not implemented [-Wcpp]
<stdin>:830:2: warning: #warning syscall fstat64 not implemented [-Wcpp]
<stdin>:1127:2: warning: #warning syscall fstatat64 not implemented [-Wcpp]

--------------------------------------------------------------------------------
s3c2410_defconfig (arm, gcc-10) — PASS, 0 errors, 0 warnings, 0 section mismatches

--------------------------------------------------------------------------------
s3c6400_defconfig (arm, gcc-10) — PASS, 0 errors, 0 warnings, 0 section mismatches

--------------------------------------------------------------------------------
s5pv210_defconfig (arm, gcc-10) — PASS, 0 errors, 0 warnings, 0 section mismatches

--------------------------------------------------------------------------------
sama5_defconfig (arm, gcc-10) — PASS, 0 errors, 0 warnings, 0 section mismatches

--------------------------------------------------------------------------------
sb1250_swarm_defconfig (mips, gcc-10) — PASS, 0 errors, 0 warnings, 0 section mismatches

--------------------------------------------------------------------------------
shannon_defconfig (arm, gcc-10) — PASS, 0 errors, 0 warnings, 0 section mismatches

--------------------------------------------------------------------------------
shmobile_defconfig (arm, gcc-10) — PASS, 0 errors, 0 warnings, 0 section mismatches

--------------------------------------------------------------------------------
simpad_defconfig (arm, gcc-10) — PASS, 0 errors, 0 warnings, 0 section mismatches

--------------------------------------------------------------------------------
socfpga_defconfig (arm, gcc-10) — PASS, 0 errors, 0 warnings, 0 section mismatches

--------------------------------------------------------------------------------
spear13xx_defconfig (arm, gcc-10) — PASS, 0 errors, 0 warnings, 0 section mismatches

--------------------------------------------------------------------------------
spear3xx_defconfig (arm, gcc-10) — PASS, 0 errors, 0 warnings, 0 section mismatches

--------------------------------------------------------------------------------
spear6xx_defconfig (arm, gcc-10) — PASS, 0 errors, 0 warnings, 0 section mismatches

--------------------------------------------------------------------------------
spitz_defconfig (arm, gcc-10) — PASS, 0 errors, 0 warnings, 0 section mismatches

--------------------------------------------------------------------------------
stm32_defconfig (arm, gcc-10) — PASS, 0 errors, 0 warnings, 0 section mismatches

--------------------------------------------------------------------------------
sunxi_defconfig (arm, gcc-10) — PASS, 0 errors, 0 warnings, 0 section mismatches

--------------------------------------------------------------------------------
tango4_defconfig (arm, gcc-10) — PASS, 0 errors, 0 warnings, 0 section mismatches

--------------------------------------------------------------------------------
tb0219_defconfig (mips, gcc-10) — PASS, 0 errors, 0 warnings, 0 section mismatches

--------------------------------------------------------------------------------
tb0226_defconfig (mips, gcc-10) — PASS, 0 errors, 0 warnings, 0 section mismatches

--------------------------------------------------------------------------------
tb0287_defconfig (mips, gcc-10) — PASS, 0 errors, 0 warnings, 0 section mismatches

--------------------------------------------------------------------------------
tct_hammer_defconfig (arm, gcc-10) — PASS, 0 errors, 0 warnings, 0 section mismatches

--------------------------------------------------------------------------------
tegra_defconfig (arm, gcc-10) — PASS, 0 errors, 0 warnings, 0 section mismatches

--------------------------------------------------------------------------------
tinyconfig (i386, gcc-10) — PASS, 0 errors, 0 warnings, 0 section mismatches

--------------------------------------------------------------------------------
tinyconfig (arc, gcc-10) — PASS, 0 errors, 0 warnings, 0 section mismatches

--------------------------------------------------------------------------------
tinyconfig (x86_64, gcc-10) — PASS, 0 errors, 0 warnings, 0 section mismatches

--------------------------------------------------------------------------------
trizeps4_defconfig (arm, gcc-10) — PASS, 0 errors, 0 warnings, 0 section mismatches

--------------------------------------------------------------------------------
u300_defconfig (arm, gcc-10) — PASS, 0 errors, 0 warnings, 0 section mismatches

--------------------------------------------------------------------------------
u8500_defconfig (arm, gcc-10) — PASS, 0 errors, 0 warnings, 0 section mismatches

--------------------------------------------------------------------------------
vdk_hs38_defconfig (arc, gcc-10) — PASS, 0 errors, 0 warnings, 0 section mismatches

--------------------------------------------------------------------------------
vdk_hs38_smp_defconfig (arc, gcc-10) — PASS, 0 errors, 0 warnings, 0 section mismatches

--------------------------------------------------------------------------------
versatile_defconfig (arm, gcc-10) — PASS, 0 errors, 0 warnings, 0 section mismatches

--------------------------------------------------------------------------------
vexpress_defconfig (arm, gcc-10) — PASS, 0 errors, 0 warnings, 0 section mismatches

--------------------------------------------------------------------------------
vf610m4_defconfig (arm, gcc-10) — PASS, 0 errors, 0 warnings, 0 section mismatches

--------------------------------------------------------------------------------
viper_defconfig (arm, gcc-10) — PASS, 0 errors, 0 warnings, 0 section mismatches

--------------------------------------------------------------------------------
vocore2_defconfig (mips, gcc-10) — PASS, 0 errors, 0 warnings, 0 section mismatches

--------------------------------------------------------------------------------
vt8500_v6_v7_defconfig (arm, gcc-10) — PASS, 0 errors, 0 warnings, 0 section mismatches

--------------------------------------------------------------------------------
workpad_defconfig (mips, gcc-10) — PASS, 0 errors, 0 warnings, 0 section mismatches

--------------------------------------------------------------------------------
x86_64_defconfig (x86_64, gcc-10) — PASS, 0 errors, 0 warnings, 0 section mismatches

--------------------------------------------------------------------------------
x86_64_defconfig+kselftest (x86_64, gcc-10) — PASS, 0 errors, 0 warnings, 0 section mismatches

--------------------------------------------------------------------------------
x86_64_defconfig+x86-chromebook (x86_64, gcc-10) — PASS, 0 errors, 0 warnings, 0 section mismatches

--------------------------------------------------------------------------------
x86_64_defconfig+x86-chromebook+kselftest (x86_64, gcc-10) — PASS, 0 errors, 0 warnings, 0 section mismatches

--------------------------------------------------------------------------------
xcep_defconfig (arm, gcc-10) — PASS, 0 errors, 0 warnings, 0 section mismatches

--------------------------------------------------------------------------------
zeus_defconfig (arm, gcc-10) — PASS, 0 errors, 0 warnings, 0 section mismatches

--------------------------------------------------------------------------------
zx_defconfig (arm, gcc-10) — PASS, 0 errors, 0 warnings, 0 section mismatches

---
For more info write to <info@...>


Re: [PATCH 5.10.y-cip 24/24] arm64: dts: renesas: rzg2l-smarc: Move pinctrl definitions

Biju Das
 

Hi Pavel,

Subject: Re: [cip-dev] [PATCH 5.10.y-cip 24/24] arm64: dts: renesas:
rzg2l-smarc: Move pinctrl definitions

Hi!

This really needs subsequent patches to be useful; plus, git
complains about blank line at EOF. Anyway, I believe we can still
take it.

Will send support for RZ/G2LC next week. Regarding blank line, Will
fix it in mainline.

Thank you. The blank line may be "too trivial" to fix in separate patch.
Ok, Next time when I get a chance to touch this file. Will fix this as well.

Cheers,
Biju


Re: [PATCH 5.10.y-cip 24/24] arm64: dts: renesas: rzg2l-smarc: Move pinctrl definitions

Pavel Machek
 

Hi!

This really needs subsequent patches to be useful; plus, git complains
about blank line at EOF. Anyway, I believe we can still take it.
Will send support for RZ/G2LC next week. Regarding blank line, Will fix it in mainline.
Thank you. The blank line may be "too trivial" to fix in separate
patch.

Best regards,
Pavel
--
DENX Software Engineering GmbH, Managing Director: Wolfgang Denk
HRB 165235 Munich, Office: Kirchenstr.5, D-82194 Groebenzell, Germany


Re: [PATCH 5.10.y-cip 00/24] RZ/G2L Fixes from mainline

Pavel Machek
 

Hi!

Xu Wang (1):
iio: adc: rzg2l_adc: Remove unnecessary print function dev_err()
I reviewed this series, so I don't have any pointing out.
I can push to CIP tree.
Thank you. I already had series applied and tested, so I did the push.

Best regards,
Pavel
--
DENX Software Engineering GmbH, Managing Director: Wolfgang Denk
HRB 165235 Munich, Office: Kirchenstr.5, D-82194 Groebenzell, Germany


Re: [PATCH 5.10.y-cip 16/24] ASoC: sh: rz-ssi: Release the DMA channels in rz_ssi_probe() error path

Biju Das
 

Hi Pavel,

Thanks for the feedback.

Subject: Re: [cip-dev] [PATCH 5.10.y-cip 16/24] ASoC: sh: rz-ssi:
Release the DMA channels in rz_ssi_probe() error path

Hi!

From: Lad Prabhakar <prabhakar.mahadev-lad.rj@...>

commit 767e6f26204d3f5406630e86b720d01818b8616d upstream.

DMA channels requested by rz_ssi_dma_request() in rz_ssi_probe() were
never released in the error path apart from one place. This patch
fixes this issue by calling rz_ssi_release_dma_channels() in the error
path.
I believe this is correct, but...
+++ b/sound/soc/sh/rz-ssi.c
@@ -976,14 +976,18 @@ static int rz_ssi_probe(struct platform_device
*pdev)
- if (ssi->irq_int < 0)
+ if (ssi->irq_int < 0) {
+ rz_ssi_release_dma_channels(ssi);
return ssi->irq_int;
+ }
+ if (ret < 0) {
+ rz_ssi_release_dma_channels(ssi);
return dev_err_probe(&pdev->dev, ret,
"irq request error (int_req)\n");
+ }
ssi->rstc = devm_reset_control_get_exclusive(&pdev->dev, NULL);
- if (IS_ERR(ssi->rstc))
+ if (IS_ERR(ssi->rstc)) {
+ rz_ssi_release_dma_channels(ssi);
return PTR_ERR(ssi->rstc);
+ }
I believe we have enough cases to use "goto cleanup" style to reduce
code duplication.
OK.


if (ret < 0) {
+ rz_ssi_release_dma_channels(ssi);
pm_runtime_disable(ssi->dev);
reset_control_assert(ssi->rstc);
return dev_err_probe(ssi->dev, ret,
"pm_runtime_resume_and_get
failed\n");
Plus, we usually do cleanup in reverse order of init.
OK, Will fix this in mainline.

Cheers,
Biju


Re: [PATCH 5.10.y-cip 24/24] arm64: dts: renesas: rzg2l-smarc: Move pinctrl definitions

Biju Das
 

Hi Pavel,

Thanks for the feedback.

Subject: Re: [cip-dev] [PATCH 5.10.y-cip 24/24] arm64: dts: renesas:
rzg2l-smarc: Move pinctrl definitions

Hi!

RZ/G2L and RZ/G2LC SMARC EVK use the same carrier board, but the pin
mappings between the RZ/G2L and the RZ/G2LC SMARC SoM are different.
Therefore we need to update the carrier board pin definitions based on
the corresponding SoM pin mapping.

Move pinctrl definitions out of the RZ/G2L SMARC common file, so that
we can reuse the common file to support RZ/G2LC SMARC EVK.
...

This really needs subsequent patches to be useful; plus, git complains
about blank line at EOF. Anyway, I believe we can still take it.
Will send support for RZ/G2LC next week. Regarding blank line, Will fix it in mainline.

Cheers,
Biju



diff --git a/arch/arm64/boot/dts/renesas/rzg2l-smarc-pinfunction.dtsi
b/arch/arm64/boot/dts/renesas/rzg2l-smarc-pinfunction.dtsi
new file mode 100644
index 000000000000..71d83e447670
--- /dev/null
+++ b/arch/arm64/boot/dts/renesas/rzg2l-smarc-pinfunction.dtsi
+ };
+};
+
Best regards,
Pavel
--
DENX Software Engineering GmbH, Managing Director: Wolfgang Denk
HRB 165235 Munich, Office: Kirchenstr.5, D-82194 Groebenzell, Germany


Re: [PATCH 5.10.y-cip 01/24] soc: renesas: Consolidate product register handling

Biju Das
 

Hi Pavel,

Thanks for the feedback.

Subject: Re: [PATCH 5.10.y-cip 01/24] soc: renesas: Consolidate product
register handling

Hi!

From: Geert Uytterhoeven <geert+renesas@...>

commit 05b22caa7490e4f4c94bbde33c61cf72d187b8f7 upstream.

Currently renesas_soc_init() scans the whole device tree up to three
times, to find a device node describing a product register.
Furthermore, the product register handling for the different variants
is very similar, with the major difference being the location of the
product bitfield inside the product register.

Reduce scanning to a single pass using
of_find_matching_node_and_match() instead. Switch to a common
handling of product registers, by storing the intrinsics of each
product register type in the data field of the corresponding match
entry.
...

+static const struct of_device_id renesas_ids[] __initconst = {
+ { .compatible = "renesas,bsid", .data = &id_bsid },
+ { .compatible = "renesas,r9a07g044-sysc", .data = &id_rzg2l },
+ { .compatible = "renesas,prr", .data = &id_prr },
+ { /* sentinel */ }
+};
+

match = of_match_node(renesas_socs, of_root);
if (!match)
return -ENODEV;

+ soc_id = strchr(match->compatible, ',') + 1;
soc = match->data;
family = soc->family;
This is quite tricky code. ',' will always be in the compatible with the
current table, but if this ever changes, it will crash. I would not mind
something like.
I agree it is tricky. But we will never be going to change {vendor},{soc_id}
format for the renesas SoC's in mainline.

Cheers,
Biju


Re: [PATCH 5.10.y-cip 00/24] RZ/G2L Fixes from mainline

Nobuhiro Iwamatsu
 

Hi all,

-----Original Message-----
From: Biju Das <biju.das.jz@...>
Sent: Friday, July 15, 2022 4:22 PM
To: cip-dev@...; iwamatsu nobuhiro(岩松 信洋 □SWC◯A
CT) <nobuhiro1.iwamatsu@...>; Pavel Machek
<pavel@...>
Cc: Chris Paterson <chris.paterson2@...>; Biju Das
<biju.das.jz@...>; Prabhakar Mahadev Lad
<prabhakar.mahadev-lad.rj@...>
Subject: [PATCH 5.10.y-cip 00/24] RZ/G2L Fixes from mainline

This patch series are backported from Mainline for supporting future SoCs as
well as various bugs and improvements related to RZ/g2L SMARC EVK
Platform.

All these patches are cherry-picked from mainline.

Biju Das (6):
dt-bindings: power: renesas,rzg2l-sysc: Document RZ/V2L SoC
soc: renesas: Identify RZ/V2L SoC
soc: renesas: Add support for reading product revision for RZ/G2L
family
ASoC: sh: Make SND_SOC_RZ depend on ARCH_RZG2L
dt-bindings: dma: rz-dmac: Document RZ/V2L SoC
arm64: dts: renesas: rzg2l-smarc: Move pinctrl definitions

Geert Uytterhoeven (2):
soc: renesas: Consolidate product register handling
arm64: dts: renesas: Fix pin controller node names

Heiner Kallweit (2):
reset: renesas: Fix Runtime PM usage
reset: renesas: Check return value of reset_control_deassert()

Jialin Zhang (1):
iio: adc: rzg2l_adc: add missing fwnode_handle_put() in
rzg2l_adc_parse_properties()

Lad Prabhakar (12):
soc: renesas: Kconfig: Explicitly select PM and PM_GENERIC_DOMAINS
configs
soc: renesas: Kconfig: Introduce ARCH_RZG2L config option
iio: adc: Kconfig: Make RZG2L_ADC depend on ARCH_RZG2L
dmaengine: sh: Kconfig: Add ARCH_R9A07G054 dependency for RZ_DMAC
config option
dmaengine: sh: Kconfig: Make RZ_DMAC depend on ARCH_RZG2L
reset: Kconfig: Make RESET_RZG2L_USBPHY_CTRL depend on
ARCH_RZG2L
dt-bindings: pinctrl: renesas,rzg2l-pinctrl: Add description for
power-source property
ASoC: sh: rz-ssi: Drop SSIFSR_TDC and SSIFSR_RDC macros
ASoC: sh: rz-ssi: Propagate error codes returned from
platform_get_irq_byname()
ASoC: sh: rz-ssi: Release the DMA channels in rz_ssi_probe() error
path
iio: adc: rzg2l_adc: Fix typo
i2c: riic: Simplify reset handling

Xu Wang (1):
iio: adc: rzg2l_adc: Remove unnecessary print function dev_err()
I reviewed this series, so I don't have any pointing out.
I can push to CIP tree.

Reviewed-by: Nobuhiro Iwamatsu <nobuhiro1.iwamatsu@...>

Best regards,
Nobuhiro

.../bindings/dma/renesas,rz-dmac.yaml | 3 +-
.../pinctrl/renesas,rzg2l-pinctrl.yaml | 1 +
.../bindings/power/renesas,rzg2l-sysc.yaml | 7 +-
arch/arm64/boot/dts/renesas/r9a07g044.dtsi | 2 +-
.../boot/dts/renesas/r9a07g044l2-smarc.dts | 1 +
.../dts/renesas/rzg2l-smarc-pinfunction.dtsi | 137 ++++++++++++++
arch/arm64/boot/dts/renesas/rzg2l-smarc.dtsi | 127 -------------
drivers/dma/sh/Kconfig | 6 +-
drivers/i2c/busses/i2c-riic.c | 34 ++--
drivers/iio/adc/Kconfig | 2 +-
drivers/iio/adc/rzg2l_adc.c | 16 +-
drivers/reset/Kconfig | 2 +-
drivers/reset/reset-rzg2l-usbphy-ctrl.c | 11 +-
drivers/soc/renesas/Kconfig | 12 ++
drivers/soc/renesas/renesas-soc.c | 173
++++++++++--------
sound/soc/sh/Kconfig | 2 +-
sound/soc/sh/rz-ssi.c | 24 +--
17 files changed, 309 insertions(+), 251 deletions(-) create mode 100644
arch/arm64/boot/dts/renesas/rzg2l-smarc-pinfunction.dtsi

--
2.25.1


cip/linux-5.10.y-cip smc: 9 runs, 2 regressions (v5.10.129-cip12-12-g93db31b19404) #kernelci

kernelci.org bot <bot@...>
 

cip/linux-5.10.y-cip smc: 9 runs, 2 regressions (v5.10.129-cip12-12-g93db31b19404)

Regressions Summary
-------------------

platform | arch | lab | compiler | defconfig | regressions
-----------------------------+--------+---------------+----------+------------------------------+------------
hp-x360-12b-c...4020-octopus | x86_64 | lab-collabora | gcc-10 | x86_64_defcon...6-chromebook | 2

Details: https://kernelci.org/test/job/cip/branch/linux-5.10.y-cip/kernel/v5.10.129-cip12-12-g93db31b19404/plan/smc/

Test: smc
Tree: cip
Branch: linux-5.10.y-cip
Describe: v5.10.129-cip12-12-g93db31b19404
URL: https://git.kernel.org/pub/scm/linux/kernel/git/cip/linux-cip.git
SHA: 93db31b194040f61924e230fdae0266bd92c54cc


Test Regressions
----------------


platform | arch | lab | compiler | defconfig | regressions
-----------------------------+--------+---------------+----------+------------------------------+------------
hp-x360-12b-c...4020-octopus | x86_64 | lab-collabora | gcc-10 | x86_64_defcon...6-chromebook | 2

Details: https://kernelci.org/test/plan/id/62df4f717df2ee4bb3daf05a

Results: 14 PASS, 2 FAIL, 0 SKIP
Full config: x86_64_defconfig+x86-chromebook
Compiler: gcc-10 (gcc (Debian 10.2.1-6) 10.2.1 20210110)
Plain log: https://storage.kernelci.org//cip/linux-5.10.y-cip/v5.10.129-cip12-12-g93db31b19404/x86_64/x86_64_defconfig+x86-chromebook/gcc-10/lab-collabora/smc-hp-x360-12b-ca0010nr-n4020-octopus.txt
HTML log: https://storage.kernelci.org//cip/linux-5.10.y-cip/v5.10.129-cip12-12-g93db31b19404/x86_64/x86_64_defconfig+x86-chromebook/gcc-10/lab-collabora/smc-hp-x360-12b-ca0010nr-n4020-octopus.html
Rootfs: http://storage.kernelci.org/images/rootfs/buildroot/buildroot-baseline/20220718.0/x86/rootfs.cpio.gz


* smc.CVE-2018-3639: https://kernelci.org/test/case/id/62df4f717df2ee4bb3daf066
failing since 21 days (last pass: v5.10.125-cip10, first fail: v5.10.126-cip11)

2022-07-26T02:20:26.471216 <8>[ 12.331174] <LAVA_SIGNAL_TESTCASE TEST_CASE_ID=CVE-2018-3639 RESULT=fail>

* smc.CVE-2018-3640: https://kernelci.org/test/case/id/62df4f717df2ee4bb3daf067
failing since 21 days (last pass: v5.10.125-cip10, first fail: v5.10.126-cip11)

2022-07-26T02:20:26.453382 <8>[ 12.312952] <LAVA_SIGNAL_TESTCASE TEST_CASE_ID=CVE-2018-3640 RESULT=fail>


cip/linux-5.10.y-cip kselftest-lkdtm: 5 runs, 4 regressions (v5.10.129-cip12-12-g93db31b19404) #kernelci

kernelci.org bot <bot@...>
 

cip/linux-5.10.y-cip kselftest-lkdtm: 5 runs, 4 regressions (v5.10.129-cip12-12-g93db31b19404)

Regressions Summary
-------------------

platform | arch | lab | compiler | defconfig | regressions
--------------------------+--------+---------------+----------+------------------------------+------------
asus-C433TA-AJ0005-rammus | x86_64 | lab-collabora | gcc-10 | x86_64_defcon...ok+kselftest | 1
asus-C523NA-A20057-coral | x86_64 | lab-collabora | gcc-10 | x86_64_defcon...ok+kselftest | 1
hp-11A-G6-EE-grunt | x86_64 | lab-collabora | gcc-10 | x86_64_defcon...ok+kselftest | 1
r8a774a1-hihope-rzg2m-ex | arm64 | lab-cip | gcc-10 | defconfig+kselftest | 1

Details: https://kernelci.org/test/job/cip/branch/linux-5.10.y-cip/kernel/v5.10.129-cip12-12-g93db31b19404/plan/kselftest-lkdtm/

Test: kselftest-lkdtm
Tree: cip
Branch: linux-5.10.y-cip
Describe: v5.10.129-cip12-12-g93db31b19404
URL: https://git.kernel.org/pub/scm/linux/kernel/git/cip/linux-cip.git
SHA: 93db31b194040f61924e230fdae0266bd92c54cc


Test Regressions
----------------


platform | arch | lab | compiler | defconfig | regressions
--------------------------+--------+---------------+----------+------------------------------+------------
asus-C433TA-AJ0005-rammus | x86_64 | lab-collabora | gcc-10 | x86_64_defcon...ok+kselftest | 1

Details: https://kernelci.org/test/plan/id/62df4f185ac25be21ddaf061

Results: 37 PASS, 17 FAIL, 25 SKIP
Full config: x86_64_defconfig+x86-chromebook+kselftest
Compiler: gcc-10 (gcc (Debian 10.2.1-6) 10.2.1 20210110)
Plain log: https://storage.kernelci.org//cip/linux-5.10.y-cip/v5.10.129-cip12-12-g93db31b19404/x86_64/x86_64_defconfig+x86-chromebook+kselftest/gcc-10/lab-collabora/kselftest-lkdtm-asus-C433TA-AJ0005-rammus.txt
HTML log: https://storage.kernelci.org//cip/linux-5.10.y-cip/v5.10.129-cip12-12-g93db31b19404/x86_64/x86_64_defconfig+x86-chromebook+kselftest/gcc-10/lab-collabora/kselftest-lkdtm-asus-C433TA-AJ0005-rammus.html
Rootfs: http://storage.kernelci.org/images/rootfs/debian/bullseye-kselftest/20220718.0/amd64/initrd.cpio.gz


* kselftest-lkdtm.lkdtm_USERCOPY_STACK_FRAME_FROM_sh: https://kernelci.org/test/case/id/62df4f185ac25be21ddaf067
failing since 27 days (last pass: v5.10.121-cip9, first fail: v5.10.125-cip10)



platform | arch | lab | compiler | defconfig | regressions
--------------------------+--------+---------------+----------+------------------------------+------------
asus-C523NA-A20057-coral | x86_64 | lab-collabora | gcc-10 | x86_64_defcon...ok+kselftest | 1

Details: https://kernelci.org/test/plan/id/62df57d097d174b3afdaf082

Results: 37 PASS, 17 FAIL, 25 SKIP
Full config: x86_64_defconfig+x86-chromebook+kselftest
Compiler: gcc-10 (gcc (Debian 10.2.1-6) 10.2.1 20210110)
Plain log: https://storage.kernelci.org//cip/linux-5.10.y-cip/v5.10.129-cip12-12-g93db31b19404/x86_64/x86_64_defconfig+x86-chromebook+kselftest/gcc-10/lab-collabora/kselftest-lkdtm-asus-C523NA-A20057-coral.txt
HTML log: https://storage.kernelci.org//cip/linux-5.10.y-cip/v5.10.129-cip12-12-g93db31b19404/x86_64/x86_64_defconfig+x86-chromebook+kselftest/gcc-10/lab-collabora/kselftest-lkdtm-asus-C523NA-A20057-coral.html
Rootfs: http://storage.kernelci.org/images/rootfs/debian/bullseye-kselftest/20220718.0/amd64/initrd.cpio.gz


* kselftest-lkdtm.lkdtm_USERCOPY_STACK_FRAME_FROM_sh: https://kernelci.org/test/case/id/62df57d097d174b3afdaf088
failing since 27 days (last pass: v5.10.121-cip9, first fail: v5.10.125-cip10)



platform | arch | lab | compiler | defconfig | regressions
--------------------------+--------+---------------+----------+------------------------------+------------
hp-11A-G6-EE-grunt | x86_64 | lab-collabora | gcc-10 | x86_64_defcon...ok+kselftest | 1

Details: https://kernelci.org/test/plan/id/62df55598cae9b7647daf058

Results: 36 PASS, 18 FAIL, 25 SKIP
Full config: x86_64_defconfig+x86-chromebook+kselftest
Compiler: gcc-10 (gcc (Debian 10.2.1-6) 10.2.1 20210110)
Plain log: https://storage.kernelci.org//cip/linux-5.10.y-cip/v5.10.129-cip12-12-g93db31b19404/x86_64/x86_64_defconfig+x86-chromebook+kselftest/gcc-10/lab-collabora/kselftest-lkdtm-hp-11A-G6-EE-grunt.txt
HTML log: https://storage.kernelci.org//cip/linux-5.10.y-cip/v5.10.129-cip12-12-g93db31b19404/x86_64/x86_64_defconfig+x86-chromebook+kselftest/gcc-10/lab-collabora/kselftest-lkdtm-hp-11A-G6-EE-grunt.html
Rootfs: http://storage.kernelci.org/images/rootfs/debian/bullseye-kselftest/20220718.0/amd64/initrd.cpio.gz


* kselftest-lkdtm.lkdtm_USERCOPY_STACK_FRAME_FROM_sh: https://kernelci.org/test/case/id/62df55598cae9b7647daf05e
failing since 27 days (last pass: v5.10.121-cip9, first fail: v5.10.125-cip10)



platform | arch | lab | compiler | defconfig | regressions
--------------------------+--------+---------------+----------+------------------------------+------------
r8a774a1-hihope-rzg2m-ex | arm64 | lab-cip | gcc-10 | defconfig+kselftest | 1

Details: https://kernelci.org/test/plan/id/62df5577405d8b4348daf08b

Results: 0 PASS, 1 FAIL, 0 SKIP
Full config: defconfig+kselftest
Compiler: gcc-10 (aarch64-linux-gnu-gcc (Debian 10.2.1-6) 10.2.1 20210110)
Plain log: https://storage.kernelci.org//cip/linux-5.10.y-cip/v5.10.129-cip12-12-g93db31b19404/arm64/defconfig+kselftest/gcc-10/lab-cip/kselftest-lkdtm-r8a774a1-hihope-rzg2m-ex.txt
HTML log: https://storage.kernelci.org//cip/linux-5.10.y-cip/v5.10.129-cip12-12-g93db31b19404/arm64/defconfig+kselftest/gcc-10/lab-cip/kselftest-lkdtm-r8a774a1-hihope-rzg2m-ex.html
Rootfs: http://storage.kernelci.org/images/rootfs/debian/bullseye-kselftest/20220718.0/arm64/initrd.cpio.gz


* kselftest-lkdtm.login: https://kernelci.org/test/case/id/62df5577405d8b4348daf08c
new failure (last pass: v5.10.129-cip12)


cip/linux-5.10.y-cip build: 189 builds: 3 failed, 186 passed, 4 errors, 10 warnings (v5.10.129-cip12-12-g93db31b19404) #kernelci

kernelci.org bot <bot@...>
 

cip/linux-5.10.y-cip build: 189 builds: 3 failed, 186 passed, 4 errors, 10 warnings (v5.10.129-cip12-12-g93db31b19404)

Full Build Summary: https://kernelci.org/build/cip/branch/linux-5.10.y-cip/kernel/v5.10.129-cip12-12-g93db31b19404/

Tree: cip
Branch: linux-5.10.y-cip
Git Describe: v5.10.129-cip12-12-g93db31b19404
Git Commit: 93db31b194040f61924e230fdae0266bd92c54cc
Git URL: https://git.kernel.org/pub/scm/linux/kernel/git/cip/linux-cip.git
Built: 7 unique architectures

Build Failures Detected:

arm:
rpc_defconfig: (gcc-10) FAIL

mips:
ip27_defconfig: (gcc-10) FAIL
ip28_defconfig: (gcc-10) FAIL

Errors and Warnings Detected:

arc:

arm64:

arm:
rpc_defconfig (gcc-10): 4 errors

i386:

mips:
32r2el_defconfig (gcc-10): 1 warning
decstation_64_defconfig (gcc-10): 1 warning
decstation_defconfig (gcc-10): 1 warning
decstation_r4k_defconfig (gcc-10): 1 warning
lemote2f_defconfig (gcc-10): 1 warning
rm200_defconfig (gcc-10): 1 warning

riscv:
rv32_defconfig (gcc-10): 4 warnings

x86_64:

Errors summary:

2 arm-linux-gnueabihf-gcc: error: unrecognized -march target: armv3m
2 arm-linux-gnueabihf-gcc: error: missing argument to ‘-march=’

Warnings summary:

3 kernel/rcu/tasks.h:710:13: warning: ‘show_rcu_tasks_rude_gp_kthread’ defined but not used [-Wunused-function]
2 <stdin>:830:2: warning: #warning syscall fstat64 not implemented [-Wcpp]
2 <stdin>:1127:2: warning: #warning syscall fstatat64 not implemented [-Wcpp]
1 net/mac80211/mlme.c:4349:1: warning: the frame size of 1040 bytes is larger than 1024 bytes [-Wframe-larger-than=]
1 drivers/block/paride/bpck.c:32: warning: "PC" redefined
1 WARNING: modpost: Symbol info of vmlinux is missing. Unresolved symbol check will be entirely skipped.

Section mismatches summary:

1 WARNING: modpost: vmlinux.o(___ksymtab_gpl+ixp4xx_irq_init+0x0): Section mismatch in reference from the variable __ksymtab_ixp4xx_irq_init to the function .init.text:ixp4xx_irq_init()
1 WARNING: modpost: vmlinux.o(___ksymtab+prom_init_numa_memory+0x0): Section mismatch in reference from the variable __ksymtab_prom_init_numa_memory to the function .init.text:prom_init_numa_memory()

================================================================================

Detailed per-defconfig build reports:

--------------------------------------------------------------------------------
32r2el_defconfig (mips, gcc-10) — PASS, 0 errors, 1 warning, 0 section mismatches

Warnings:
WARNING: modpost: Symbol info of vmlinux is missing. Unresolved symbol check will be entirely skipped.

--------------------------------------------------------------------------------
allnoconfig (arc, gcc-10) — PASS, 0 errors, 0 warnings, 0 section mismatches

--------------------------------------------------------------------------------
allnoconfig (i386, gcc-10) — PASS, 0 errors, 0 warnings, 0 section mismatches

--------------------------------------------------------------------------------
allnoconfig (x86_64, gcc-10) — PASS, 0 errors, 0 warnings, 0 section mismatches

--------------------------------------------------------------------------------
am200epdkit_defconfig (arm, gcc-10) — PASS, 0 errors, 0 warnings, 0 section mismatches

--------------------------------------------------------------------------------
ar7_defconfig (mips, gcc-10) — PASS, 0 errors, 0 warnings, 0 section mismatches

--------------------------------------------------------------------------------
aspeed_g4_defconfig (arm, gcc-10) — PASS, 0 errors, 0 warnings, 0 section mismatches

--------------------------------------------------------------------------------
aspeed_g5_defconfig (arm, gcc-10) — PASS, 0 errors, 0 warnings, 0 section mismatches

--------------------------------------------------------------------------------
assabet_defconfig (arm, gcc-10) — PASS, 0 errors, 0 warnings, 0 section mismatches

--------------------------------------------------------------------------------
at91_dt_defconfig (arm, gcc-10) — PASS, 0 errors, 0 warnings, 0 section mismatches

--------------------------------------------------------------------------------
ath25_defconfig (mips, gcc-10) — PASS, 0 errors, 0 warnings, 0 section mismatches

--------------------------------------------------------------------------------
ath79_defconfig (mips, gcc-10) — PASS, 0 errors, 0 warnings, 0 section mismatches

--------------------------------------------------------------------------------
axm55xx_defconfig (arm, gcc-10) — PASS, 0 errors, 0 warnings, 0 section mismatches

--------------------------------------------------------------------------------
axs103_defconfig (arc, gcc-10) — PASS, 0 errors, 0 warnings, 0 section mismatches

--------------------------------------------------------------------------------
axs103_smp_defconfig (arc, gcc-10) — PASS, 0 errors, 0 warnings, 0 section mismatches

--------------------------------------------------------------------------------
badge4_defconfig (arm, gcc-10) — PASS, 0 errors, 0 warnings, 0 section mismatches

--------------------------------------------------------------------------------
bcm2835_defconfig (arm, gcc-10) — PASS, 0 errors, 0 warnings, 0 section mismatches

--------------------------------------------------------------------------------
bcm47xx_defconfig (mips, gcc-10) — PASS, 0 errors, 0 warnings, 0 section mismatches

--------------------------------------------------------------------------------
bcm63xx_defconfig (mips, gcc-10) — PASS, 0 errors, 0 warnings, 0 section mismatches

--------------------------------------------------------------------------------
bigsur_defconfig (mips, gcc-10) — PASS, 0 errors, 0 warnings, 0 section mismatches

--------------------------------------------------------------------------------
bmips_be_defconfig (mips, gcc-10) — PASS, 0 errors, 0 warnings, 0 section mismatches

--------------------------------------------------------------------------------
bmips_stb_defconfig (mips, gcc-10) — PASS, 0 errors, 0 warnings, 0 section mismatches

--------------------------------------------------------------------------------
capcella_defconfig (mips, gcc-10) — PASS, 0 errors, 0 warnings, 0 section mismatches

--------------------------------------------------------------------------------
cavium_octeon_defconfig (mips, gcc-10) — PASS, 0 errors, 0 warnings, 0 section mismatches

--------------------------------------------------------------------------------
cerfcube_defconfig (arm, gcc-10) — PASS, 0 errors, 0 warnings, 0 section mismatches

--------------------------------------------------------------------------------
ci20_defconfig (mips, gcc-10) — PASS, 0 errors, 0 warnings, 0 section mismatches

--------------------------------------------------------------------------------
cm_x300_defconfig (arm, gcc-10) — PASS, 0 errors, 0 warnings, 0 section mismatches

--------------------------------------------------------------------------------
cobalt_defconfig (mips, gcc-10) — PASS, 0 errors, 0 warnings, 0 section mismatches

--------------------------------------------------------------------------------
colibri_pxa270_defconfig (arm, gcc-10) — PASS, 0 errors, 0 warnings, 0 section mismatches

--------------------------------------------------------------------------------
colibri_pxa300_defconfig (arm, gcc-10) — PASS, 0 errors, 0 warnings, 0 section mismatches

--------------------------------------------------------------------------------
collie_defconfig (arm, gcc-10) — PASS, 0 errors, 0 warnings, 0 section mismatches

--------------------------------------------------------------------------------
corgi_defconfig (arm, gcc-10) — PASS, 0 errors, 0 warnings, 0 section mismatches

--------------------------------------------------------------------------------
cu1000-neo_defconfig (mips, gcc-10) — PASS, 0 errors, 0 warnings, 0 section mismatches

--------------------------------------------------------------------------------
cu1830-neo_defconfig (mips, gcc-10) — PASS, 0 errors, 0 warnings, 0 section mismatches

--------------------------------------------------------------------------------
davinci_all_defconfig (arm, gcc-10) — PASS, 0 errors, 0 warnings, 0 section mismatches

--------------------------------------------------------------------------------
db1xxx_defconfig (mips, gcc-10) — PASS, 0 errors, 0 warnings, 0 section mismatches

--------------------------------------------------------------------------------
decstation_64_defconfig (mips, gcc-10) — PASS, 0 errors, 1 warning, 0 section mismatches

Warnings:
kernel/rcu/tasks.h:710:13: warning: ‘show_rcu_tasks_rude_gp_kthread’ defined but not used [-Wunused-function]

--------------------------------------------------------------------------------
decstation_defconfig (mips, gcc-10) — PASS, 0 errors, 1 warning, 0 section mismatches

Warnings:
kernel/rcu/tasks.h:710:13: warning: ‘show_rcu_tasks_rude_gp_kthread’ defined but not used [-Wunused-function]

--------------------------------------------------------------------------------
decstation_r4k_defconfig (mips, gcc-10) — PASS, 0 errors, 1 warning, 0 section mismatches

Warnings:
kernel/rcu/tasks.h:710:13: warning: ‘show_rcu_tasks_rude_gp_kthread’ defined but not used [-Wunused-function]

--------------------------------------------------------------------------------
defconfig (riscv, gcc-10) — PASS, 0 errors, 0 warnings, 0 section mismatches

--------------------------------------------------------------------------------
defconfig (arm64, gcc-10) — PASS, 0 errors, 0 warnings, 0 section mismatches

--------------------------------------------------------------------------------
defconfig+arm64-chromebook+kselftest (arm64, gcc-10) — PASS, 0 errors, 0 warnings, 0 section mismatches

--------------------------------------------------------------------------------
defconfig+kselftest (arm64, gcc-10) — PASS, 0 errors, 0 warnings, 0 section mismatches

--------------------------------------------------------------------------------
dove_defconfig (arm, gcc-10) — PASS, 0 errors, 0 warnings, 0 section mismatches

--------------------------------------------------------------------------------
e55_defconfig (mips, gcc-10) — PASS, 0 errors, 0 warnings, 0 section mismatches

--------------------------------------------------------------------------------
ebsa110_defconfig (arm, gcc-10) — PASS, 0 errors, 0 warnings, 0 section mismatches

--------------------------------------------------------------------------------
efm32_defconfig (arm, gcc-10) — PASS, 0 errors, 0 warnings, 0 section mismatches

--------------------------------------------------------------------------------
ep93xx_defconfig (arm, gcc-10) — PASS, 0 errors, 0 warnings, 0 section mismatches

--------------------------------------------------------------------------------
eseries_pxa_defconfig (arm, gcc-10) — PASS, 0 errors, 0 warnings, 0 section mismatches

--------------------------------------------------------------------------------
exynos_defconfig (arm, gcc-10) — PASS, 0 errors, 0 warnings, 0 section mismatches

--------------------------------------------------------------------------------
ezx_defconfig (arm, gcc-10) — PASS, 0 errors, 0 warnings, 0 section mismatches

--------------------------------------------------------------------------------
footbridge_defconfig (arm, gcc-10) — PASS, 0 errors, 0 warnings, 0 section mismatches

--------------------------------------------------------------------------------
fuloong2e_defconfig (mips, gcc-10) — PASS, 0 errors, 0 warnings, 0 section mismatches

--------------------------------------------------------------------------------
gcw0_defconfig (mips, gcc-10) — PASS, 0 errors, 0 warnings, 0 section mismatches

--------------------------------------------------------------------------------
gemini_defconfig (arm, gcc-10) — PASS, 0 errors, 0 warnings, 0 section mismatches

--------------------------------------------------------------------------------
gpr_defconfig (mips, gcc-10) — PASS, 0 errors, 0 warnings, 0 section mismatches

--------------------------------------------------------------------------------
h3600_defconfig (arm, gcc-10) — PASS, 0 errors, 0 warnings, 0 section mismatches

--------------------------------------------------------------------------------
h5000_defconfig (arm, gcc-10) — PASS, 0 errors, 0 warnings, 0 section mismatches

--------------------------------------------------------------------------------
hackkit_defconfig (arm, gcc-10) — PASS, 0 errors, 0 warnings, 0 section mismatches

--------------------------------------------------------------------------------
haps_hs_defconfig (arc, gcc-10) — PASS, 0 errors, 0 warnings, 0 section mismatches

--------------------------------------------------------------------------------
haps_hs_smp_defconfig (arc, gcc-10) — PASS, 0 errors, 0 warnings, 0 section mismatches

--------------------------------------------------------------------------------
hisi_defconfig (arm, gcc-10) — PASS, 0 errors, 0 warnings, 0 section mismatches

--------------------------------------------------------------------------------
hsdk_defconfig (arc, gcc-10) — PASS, 0 errors, 0 warnings, 0 section mismatches

--------------------------------------------------------------------------------
i386_defconfig (i386, gcc-10) — PASS, 0 errors, 0 warnings, 0 section mismatches

--------------------------------------------------------------------------------
imote2_defconfig (arm, gcc-10) — PASS, 0 errors, 0 warnings, 0 section mismatches

--------------------------------------------------------------------------------
imx_v4_v5_defconfig (arm, gcc-10) — PASS, 0 errors, 0 warnings, 0 section mismatches

--------------------------------------------------------------------------------
imx_v6_v7_defconfig (arm, gcc-10) — PASS, 0 errors, 0 warnings, 0 section mismatches

--------------------------------------------------------------------------------
integrator_defconfig (arm, gcc-10) — PASS, 0 errors, 0 warnings, 0 section mismatches

--------------------------------------------------------------------------------
iop32x_defconfig (arm, gcc-10) — PASS, 0 errors, 0 warnings, 0 section mismatches

--------------------------------------------------------------------------------
ip22_defconfig (mips, gcc-10) — PASS, 0 errors, 0 warnings, 0 section mismatches

--------------------------------------------------------------------------------
ip27_defconfig (mips, gcc-10) — FAIL, 0 errors, 0 warnings, 0 section mismatches

--------------------------------------------------------------------------------
ip28_defconfig (mips, gcc-10) — FAIL, 0 errors, 0 warnings, 0 section mismatches

--------------------------------------------------------------------------------
ip32_defconfig (mips, gcc-10) — PASS, 0 errors, 0 warnings, 0 section mismatches

--------------------------------------------------------------------------------
ixp4xx_defconfig (arm, gcc-10) — PASS, 0 errors, 0 warnings, 0 section mismatches

Section mismatches:
WARNING: modpost: vmlinux.o(___ksymtab_gpl+ixp4xx_irq_init+0x0): Section mismatch in reference from the variable __ksymtab_ixp4xx_irq_init to the function .init.text:ixp4xx_irq_init()

--------------------------------------------------------------------------------
jazz_defconfig (mips, gcc-10) — PASS, 0 errors, 0 warnings, 0 section mismatches

--------------------------------------------------------------------------------
jmr3927_defconfig (mips, gcc-10) — PASS, 0 errors, 0 warnings, 0 section mismatches

--------------------------------------------------------------------------------
jornada720_defconfig (arm, gcc-10) — PASS, 0 errors, 0 warnings, 0 section mismatches

--------------------------------------------------------------------------------
keystone_defconfig (arm, gcc-10) — PASS, 0 errors, 0 warnings, 0 section mismatches

--------------------------------------------------------------------------------
lart_defconfig (arm, gcc-10) — PASS, 0 errors, 0 warnings, 0 section mismatches

--------------------------------------------------------------------------------
lemote2f_defconfig (mips, gcc-10) — PASS, 0 errors, 1 warning, 0 section mismatches

Warnings:
net/mac80211/mlme.c:4349:1: warning: the frame size of 1040 bytes is larger than 1024 bytes [-Wframe-larger-than=]

--------------------------------------------------------------------------------
loongson1b_defconfig (mips, gcc-10) — PASS, 0 errors, 0 warnings, 0 section mismatches

--------------------------------------------------------------------------------
loongson1c_defconfig (mips, gcc-10) — PASS, 0 errors, 0 warnings, 0 section mismatches

--------------------------------------------------------------------------------
loongson3_defconfig (mips, gcc-10) — PASS, 0 errors, 0 warnings, 0 section mismatches

Section mismatches:
WARNING: modpost: vmlinux.o(___ksymtab+prom_init_numa_memory+0x0): Section mismatch in reference from the variable __ksymtab_prom_init_numa_memory to the function .init.text:prom_init_numa_memory()

--------------------------------------------------------------------------------
lpc18xx_defconfig (arm, gcc-10) — PASS, 0 errors, 0 warnings, 0 section mismatches

--------------------------------------------------------------------------------
lpc32xx_defconfig (arm, gcc-10) — PASS, 0 errors, 0 warnings, 0 section mismatches

--------------------------------------------------------------------------------
lpd270_defconfig (arm, gcc-10) — PASS, 0 errors, 0 warnings, 0 section mismatches

--------------------------------------------------------------------------------
lubbock_defconfig (arm, gcc-10) — PASS, 0 errors, 0 warnings, 0 section mismatches

--------------------------------------------------------------------------------
magician_defconfig (arm, gcc-10) — PASS, 0 errors, 0 warnings, 0 section mismatches

--------------------------------------------------------------------------------
mainstone_defconfig (arm, gcc-10) — PASS, 0 errors, 0 warnings, 0 section mismatches

--------------------------------------------------------------------------------
malta_defconfig (mips, gcc-10) — PASS, 0 errors, 0 warnings, 0 section mismatches

--------------------------------------------------------------------------------
malta_kvm_defconfig (mips, gcc-10) — PASS, 0 errors, 0 warnings, 0 section mismatches

--------------------------------------------------------------------------------
malta_kvm_guest_defconfig (mips, gcc-10) — PASS, 0 errors, 0 warnings, 0 section mismatches

--------------------------------------------------------------------------------
malta_qemu_32r6_defconfig (mips, gcc-10) — PASS, 0 errors, 0 warnings, 0 section mismatches

--------------------------------------------------------------------------------
maltaaprp_defconfig (mips, gcc-10) — PASS, 0 errors, 0 warnings, 0 section mismatches

--------------------------------------------------------------------------------
maltasmvp_defconfig (mips, gcc-10) — PASS, 0 errors, 0 warnings, 0 section mismatches

--------------------------------------------------------------------------------
maltasmvp_eva_defconfig (mips, gcc-10) — PASS, 0 errors, 0 warnings, 0 section mismatches

--------------------------------------------------------------------------------
maltaup_defconfig (mips, gcc-10) — PASS, 0 errors, 0 warnings, 0 section mismatches

--------------------------------------------------------------------------------
maltaup_xpa_defconfig (mips, gcc-10) — PASS, 0 errors, 0 warnings, 0 section mismatches

--------------------------------------------------------------------------------
milbeaut_m10v_defconfig (arm, gcc-10) — PASS, 0 errors, 0 warnings, 0 section mismatches

--------------------------------------------------------------------------------
mini2440_defconfig (arm, gcc-10) — PASS, 0 errors, 0 warnings, 0 section mismatches

--------------------------------------------------------------------------------
mmp2_defconfig (arm, gcc-10) — PASS, 0 errors, 0 warnings, 0 section mismatches

--------------------------------------------------------------------------------
moxart_defconfig (arm, gcc-10) — PASS, 0 errors, 0 warnings, 0 section mismatches

--------------------------------------------------------------------------------
mpc30x_defconfig (mips, gcc-10) — PASS, 0 errors, 0 warnings, 0 section mismatches

--------------------------------------------------------------------------------
mps2_defconfig (arm, gcc-10) — PASS, 0 errors, 0 warnings, 0 section mismatches

--------------------------------------------------------------------------------
mtx1_defconfig (mips, gcc-10) — PASS, 0 errors, 0 warnings, 0 section mismatches

--------------------------------------------------------------------------------
multi_v4t_defconfig (arm, gcc-10) — PASS, 0 errors, 0 warnings, 0 section mismatches

--------------------------------------------------------------------------------
multi_v5_defconfig (arm, gcc-10) — PASS, 0 errors, 0 warnings, 0 section mismatches

--------------------------------------------------------------------------------
multi_v7_defconfig (arm, gcc-10) — PASS, 0 errors, 0 warnings, 0 section mismatches

--------------------------------------------------------------------------------
multi_v7_defconfig+kselftest (arm, gcc-10) — PASS, 0 errors, 0 warnings, 0 section mismatches

--------------------------------------------------------------------------------
mvebu_v5_defconfig (arm, gcc-10) — PASS, 0 errors, 0 warnings, 0 section mismatches

--------------------------------------------------------------------------------
mvebu_v7_defconfig (arm, gcc-10) — PASS, 0 errors, 0 warnings, 0 section mismatches

--------------------------------------------------------------------------------
mxs_defconfig (arm, gcc-10) — PASS, 0 errors, 0 warnings, 0 section mismatches

--------------------------------------------------------------------------------
neponset_defconfig (arm, gcc-10) — PASS, 0 errors, 0 warnings, 0 section mismatches

--------------------------------------------------------------------------------
netwinder_defconfig (arm, gcc-10) — PASS, 0 errors, 0 warnings, 0 section mismatches

--------------------------------------------------------------------------------
nhk8815_defconfig (arm, gcc-10) — PASS, 0 errors, 0 warnings, 0 section mismatches

--------------------------------------------------------------------------------
nlm_xlp_defconfig (mips, gcc-10) — PASS, 0 errors, 0 warnings, 0 section mismatches

--------------------------------------------------------------------------------
nlm_xlr_defconfig (mips, gcc-10) — PASS, 0 errors, 0 warnings, 0 section mismatches

--------------------------------------------------------------------------------
nommu_k210_defconfig (riscv, gcc-10) — PASS, 0 errors, 0 warnings, 0 section mismatches

--------------------------------------------------------------------------------
nsimosci_hs_defconfig (arc, gcc-10) — PASS, 0 errors, 0 warnings, 0 section mismatches

--------------------------------------------------------------------------------
nsimosci_hs_smp_defconfig (arc, gcc-10) — PASS, 0 errors, 0 warnings, 0 section mismatches

--------------------------------------------------------------------------------
omap1_defconfig (arm, gcc-10) — PASS, 0 errors, 0 warnings, 0 section mismatches

--------------------------------------------------------------------------------
omap2plus_defconfig (arm, gcc-10) — PASS, 0 errors, 0 warnings, 0 section mismatches

--------------------------------------------------------------------------------
omega2p_defconfig (mips, gcc-10) — PASS, 0 errors, 0 warnings, 0 section mismatches

--------------------------------------------------------------------------------
orion5x_defconfig (arm, gcc-10) — PASS, 0 errors, 0 warnings, 0 section mismatches

--------------------------------------------------------------------------------
oxnas_v6_defconfig (arm, gcc-10) — PASS, 0 errors, 0 warnings, 0 section mismatches

--------------------------------------------------------------------------------
palmz72_defconfig (arm, gcc-10) — PASS, 0 errors, 0 warnings, 0 section mismatches

--------------------------------------------------------------------------------
pcm027_defconfig (arm, gcc-10) — PASS, 0 errors, 0 warnings, 0 section mismatches

--------------------------------------------------------------------------------
pic32mzda_defconfig (mips, gcc-10) — PASS, 0 errors, 0 warnings, 0 section mismatches

--------------------------------------------------------------------------------
pistachio_defconfig (mips, gcc-10) — PASS, 0 errors, 0 warnings, 0 section mismatches

--------------------------------------------------------------------------------
pleb_defconfig (arm, gcc-10) — PASS, 0 errors, 0 warnings, 0 section mismatches

--------------------------------------------------------------------------------
prima2_defconfig (arm, gcc-10) — PASS, 0 errors, 0 warnings, 0 section mismatches

--------------------------------------------------------------------------------
pxa168_defconfig (arm, gcc-10) — PASS, 0 errors, 0 warnings, 0 section mismatches

--------------------------------------------------------------------------------
pxa255-idp_defconfig (arm, gcc-10) — PASS, 0 errors, 0 warnings, 0 section mismatches

--------------------------------------------------------------------------------
pxa3xx_defconfig (arm, gcc-10) — PASS, 0 errors, 0 warnings, 0 section mismatches

--------------------------------------------------------------------------------
pxa910_defconfig (arm, gcc-10) — PASS, 0 errors, 0 warnings, 0 section mismatches

--------------------------------------------------------------------------------
pxa_defconfig (arm, gcc-10) — PASS, 0 errors, 0 warnings, 0 section mismatches

--------------------------------------------------------------------------------
qcom_defconfig (arm, gcc-10) — PASS, 0 errors, 0 warnings, 0 section mismatches

--------------------------------------------------------------------------------
qi_lb60_defconfig (mips, gcc-10) — PASS, 0 errors, 0 warnings, 0 section mismatches

--------------------------------------------------------------------------------
rb532_defconfig (mips, gcc-10) — PASS, 0 errors, 0 warnings, 0 section mismatches

--------------------------------------------------------------------------------
rbtx49xx_defconfig (mips, gcc-10) — PASS, 0 errors, 0 warnings, 0 section mismatches

--------------------------------------------------------------------------------
realview_defconfig (arm, gcc-10) — PASS, 0 errors, 0 warnings, 0 section mismatches

--------------------------------------------------------------------------------
rm200_defconfig (mips, gcc-10) — PASS, 0 errors, 1 warning, 0 section mismatches

Warnings:
drivers/block/paride/bpck.c:32: warning: "PC" redefined

--------------------------------------------------------------------------------
rpc_defconfig (arm, gcc-10) — FAIL, 4 errors, 0 warnings, 0 section mismatches

Errors:
arm-linux-gnueabihf-gcc: error: unrecognized -march target: armv3m
arm-linux-gnueabihf-gcc: error: missing argument to ‘-march=’
arm-linux-gnueabihf-gcc: error: unrecognized -march target: armv3m
arm-linux-gnueabihf-gcc: error: missing argument to ‘-march=’

--------------------------------------------------------------------------------
rs90_defconfig (mips, gcc-10) — PASS, 0 errors, 0 warnings, 0 section mismatches

--------------------------------------------------------------------------------
rt305x_defconfig (mips, gcc-10) — PASS, 0 errors, 0 warnings, 0 section mismatches

--------------------------------------------------------------------------------
rv32_defconfig (riscv, gcc-10) — PASS, 0 errors, 4 warnings, 0 section mismatches

Warnings:
<stdin>:830:2: warning: #warning syscall fstat64 not implemented [-Wcpp]
<stdin>:1127:2: warning: #warning syscall fstatat64 not implemented [-Wcpp]
<stdin>:830:2: warning: #warning syscall fstat64 not implemented [-Wcpp]
<stdin>:1127:2: warning: #warning syscall fstatat64 not implemented [-Wcpp]

--------------------------------------------------------------------------------
s3c2410_defconfig (arm, gcc-10) — PASS, 0 errors, 0 warnings, 0 section mismatches

--------------------------------------------------------------------------------
s3c6400_defconfig (arm, gcc-10) — PASS, 0 errors, 0 warnings, 0 section mismatches

--------------------------------------------------------------------------------
s5pv210_defconfig (arm, gcc-10) — PASS, 0 errors, 0 warnings, 0 section mismatches

--------------------------------------------------------------------------------
sama5_defconfig (arm, gcc-10) — PASS, 0 errors, 0 warnings, 0 section mismatches

--------------------------------------------------------------------------------
sb1250_swarm_defconfig (mips, gcc-10) — PASS, 0 errors, 0 warnings, 0 section mismatches

--------------------------------------------------------------------------------
shannon_defconfig (arm, gcc-10) — PASS, 0 errors, 0 warnings, 0 section mismatches

--------------------------------------------------------------------------------
shmobile_defconfig (arm, gcc-10) — PASS, 0 errors, 0 warnings, 0 section mismatches

--------------------------------------------------------------------------------
simpad_defconfig (arm, gcc-10) — PASS, 0 errors, 0 warnings, 0 section mismatches

--------------------------------------------------------------------------------
socfpga_defconfig (arm, gcc-10) — PASS, 0 errors, 0 warnings, 0 section mismatches

--------------------------------------------------------------------------------
spear13xx_defconfig (arm, gcc-10) — PASS, 0 errors, 0 warnings, 0 section mismatches

--------------------------------------------------------------------------------
spear3xx_defconfig (arm, gcc-10) — PASS, 0 errors, 0 warnings, 0 section mismatches

--------------------------------------------------------------------------------
spear6xx_defconfig (arm, gcc-10) — PASS, 0 errors, 0 warnings, 0 section mismatches

--------------------------------------------------------------------------------
spitz_defconfig (arm, gcc-10) — PASS, 0 errors, 0 warnings, 0 section mismatches

--------------------------------------------------------------------------------
stm32_defconfig (arm, gcc-10) — PASS, 0 errors, 0 warnings, 0 section mismatches

--------------------------------------------------------------------------------
sunxi_defconfig (arm, gcc-10) — PASS, 0 errors, 0 warnings, 0 section mismatches

--------------------------------------------------------------------------------
tango4_defconfig (arm, gcc-10) — PASS, 0 errors, 0 warnings, 0 section mismatches

--------------------------------------------------------------------------------
tb0219_defconfig (mips, gcc-10) — PASS, 0 errors, 0 warnings, 0 section mismatches

--------------------------------------------------------------------------------
tb0226_defconfig (mips, gcc-10) — PASS, 0 errors, 0 warnings, 0 section mismatches

--------------------------------------------------------------------------------
tb0287_defconfig (mips, gcc-10) — PASS, 0 errors, 0 warnings, 0 section mismatches

--------------------------------------------------------------------------------
tct_hammer_defconfig (arm, gcc-10) — PASS, 0 errors, 0 warnings, 0 section mismatches

--------------------------------------------------------------------------------
tegra_defconfig (arm, gcc-10) — PASS, 0 errors, 0 warnings, 0 section mismatches

--------------------------------------------------------------------------------
tinyconfig (arc, gcc-10) — PASS, 0 errors, 0 warnings, 0 section mismatches

--------------------------------------------------------------------------------
tinyconfig (x86_64, gcc-10) — PASS, 0 errors, 0 warnings, 0 section mismatches

--------------------------------------------------------------------------------
tinyconfig (i386, gcc-10) — PASS, 0 errors, 0 warnings, 0 section mismatches

--------------------------------------------------------------------------------
trizeps4_defconfig (arm, gcc-10) — PASS, 0 errors, 0 warnings, 0 section mismatches

--------------------------------------------------------------------------------
u300_defconfig (arm, gcc-10) — PASS, 0 errors, 0 warnings, 0 section mismatches

--------------------------------------------------------------------------------
u8500_defconfig (arm, gcc-10) — PASS, 0 errors, 0 warnings, 0 section mismatches

--------------------------------------------------------------------------------
vdk_hs38_defconfig (arc, gcc-10) — PASS, 0 errors, 0 warnings, 0 section mismatches

--------------------------------------------------------------------------------
vdk_hs38_smp_defconfig (arc, gcc-10) — PASS, 0 errors, 0 warnings, 0 section mismatches

--------------------------------------------------------------------------------
versatile_defconfig (arm, gcc-10) — PASS, 0 errors, 0 warnings, 0 section mismatches

--------------------------------------------------------------------------------
vexpress_defconfig (arm, gcc-10) — PASS, 0 errors, 0 warnings, 0 section mismatches

--------------------------------------------------------------------------------
vf610m4_defconfig (arm, gcc-10) — PASS, 0 errors, 0 warnings, 0 section mismatches

--------------------------------------------------------------------------------
viper_defconfig (arm, gcc-10) — PASS, 0 errors, 0 warnings, 0 section mismatches

--------------------------------------------------------------------------------
vocore2_defconfig (mips, gcc-10) — PASS, 0 errors, 0 warnings, 0 section mismatches

--------------------------------------------------------------------------------
vt8500_v6_v7_defconfig (arm, gcc-10) — PASS, 0 errors, 0 warnings, 0 section mismatches

--------------------------------------------------------------------------------
workpad_defconfig (mips, gcc-10) — PASS, 0 errors, 0 warnings, 0 section mismatches

--------------------------------------------------------------------------------
x86_64_defconfig (x86_64, gcc-10) — PASS, 0 errors, 0 warnings, 0 section mismatches

--------------------------------------------------------------------------------
x86_64_defconfig+kselftest (x86_64, gcc-10) — PASS, 0 errors, 0 warnings, 0 section mismatches

--------------------------------------------------------------------------------
x86_64_defconfig+x86-chromebook (x86_64, gcc-10) — PASS, 0 errors, 0 warnings, 0 section mismatches

--------------------------------------------------------------------------------
x86_64_defconfig+x86-chromebook+kselftest (x86_64, gcc-10) — PASS, 0 errors, 0 warnings, 0 section mismatches

--------------------------------------------------------------------------------
xcep_defconfig (arm, gcc-10) — PASS, 0 errors, 0 warnings, 0 section mismatches

--------------------------------------------------------------------------------
zeus_defconfig (arm, gcc-10) — PASS, 0 errors, 0 warnings, 0 section mismatches

--------------------------------------------------------------------------------
zx_defconfig (arm, gcc-10) — PASS, 0 errors, 0 warnings, 0 section mismatches

---
For more info write to <info@...>


cip/linux-4.4.y-cip smc: 12 runs, 3 regressions (v4.4.302-cip69-517-g92709d8ae585) #kernelci

kernelci.org bot <bot@...>
 

cip/linux-4.4.y-cip smc: 12 runs, 3 regressions (v4.4.302-cip69-517-g92709d8ae585)

Regressions Summary
-------------------

platform | arch | lab | compiler | defconfig | regressions
----------------------+-------+---------------+----------+----------------------------+------------
qemu_arm64-virt-gicv3 | arm64 | lab-broonie | gcc-10 | defconfig | 1
qemu_arm64-virt-gicv3 | arm64 | lab-broonie | gcc-10 | defconfig+arm64-chromebook | 1
qemu_arm64-virt-gicv3 | arm64 | lab-collabora | gcc-10 | defconfig | 1

Details: https://kernelci.org/test/job/cip/branch/linux-4.4.y-cip/kernel/v4.4.302-cip69-517-g92709d8ae585/plan/smc/

Test: smc
Tree: cip
Branch: linux-4.4.y-cip
Describe: v4.4.302-cip69-517-g92709d8ae585
URL: https://git.kernel.org/pub/scm/linux/kernel/git/cip/linux-cip.git
SHA: 92709d8ae585b3c97e359b1323f02c37349ee40d


Test Regressions
----------------


platform | arch | lab | compiler | defconfig | regressions
----------------------+-------+---------------+----------+----------------------------+------------
qemu_arm64-virt-gicv3 | arm64 | lab-broonie | gcc-10 | defconfig | 1

Details: https://kernelci.org/test/plan/id/62df3b4f0d9464660fdaf064

Results: 0 PASS, 1 FAIL, 0 SKIP
Full config: defconfig
Compiler: gcc-10 (aarch64-linux-gnu-gcc (Debian 10.2.1-6) 10.2.1 20210110)
Plain log: https://storage.kernelci.org//cip/linux-4.4.y-cip/v4.4.302-cip69-517-g92709d8ae585/arm64/defconfig/gcc-10/lab-broonie/smc-qemu_arm64-virt-gicv3.txt
HTML log: https://storage.kernelci.org//cip/linux-4.4.y-cip/v4.4.302-cip69-517-g92709d8ae585/arm64/defconfig/gcc-10/lab-broonie/smc-qemu_arm64-virt-gicv3.html
Rootfs: http://storage.kernelci.org/images/rootfs/buildroot/buildroot-baseline/20220718.0/arm64/rootfs.cpio.gz


* smc.login: https://kernelci.org/test/case/id/62df3b4f0d9464660fdaf065
new failure (last pass: v4.4.296-cip67)



platform | arch | lab | compiler | defconfig | regressions
----------------------+-------+---------------+----------+----------------------------+------------
qemu_arm64-virt-gicv3 | arm64 | lab-broonie | gcc-10 | defconfig+arm64-chromebook | 1

Details: https://kernelci.org/test/plan/id/62df4821591cbb65c6daf0f1

Results: 0 PASS, 1 FAIL, 0 SKIP
Full config: defconfig+arm64-chromebook
Compiler: gcc-10 (aarch64-linux-gnu-gcc (Debian 10.2.1-6) 10.2.1 20210110)
Plain log: https://storage.kernelci.org//cip/linux-4.4.y-cip/v4.4.302-cip69-517-g92709d8ae585/arm64/defconfig+arm64-chromebook/gcc-10/lab-broonie/smc-qemu_arm64-virt-gicv3.txt
HTML log: https://storage.kernelci.org//cip/linux-4.4.y-cip/v4.4.302-cip69-517-g92709d8ae585/arm64/defconfig+arm64-chromebook/gcc-10/lab-broonie/smc-qemu_arm64-virt-gicv3.html
Rootfs: http://storage.kernelci.org/images/rootfs/buildroot/buildroot-baseline/20220718.0/arm64/rootfs.cpio.gz


* smc.login: https://kernelci.org/test/case/id/62df4821591cbb65c6daf0f2
failing since 10 days (last pass: v4.4.302-cip69, first fail: v4.4.302-cip69-508-gd887d54a1be6)



platform | arch | lab | compiler | defconfig | regressions
----------------------+-------+---------------+----------+----------------------------+------------
qemu_arm64-virt-gicv3 | arm64 | lab-collabora | gcc-10 | defconfig | 1

Details: https://kernelci.org/test/plan/id/62df3a0e3ff2ed5542daf069

Results: 0 PASS, 1 FAIL, 0 SKIP
Full config: defconfig
Compiler: gcc-10 (aarch64-linux-gnu-gcc (Debian 10.2.1-6) 10.2.1 20210110)
Plain log: https://storage.kernelci.org//cip/linux-4.4.y-cip/v4.4.302-cip69-517-g92709d8ae585/arm64/defconfig/gcc-10/lab-collabora/smc-qemu_arm64-virt-gicv3.txt
HTML log: https://storage.kernelci.org//cip/linux-4.4.y-cip/v4.4.302-cip69-517-g92709d8ae585/arm64/defconfig/gcc-10/lab-collabora/smc-qemu_arm64-virt-gicv3.html
Rootfs: http://storage.kernelci.org/images/rootfs/buildroot/buildroot-baseline/20220718.0/arm64/rootfs.cpio.gz


* smc.login: https://kernelci.org/test/case/id/62df3a0e3ff2ed5542daf06a
new failure (last pass: v4.4.296-cip67)


cip/linux-4.4.y-cip ltp-pty: 3 runs, 1 regressions (v4.4.302-cip69-517-g92709d8ae585) #kernelci

kernelci.org bot <bot@...>
 

cip/linux-4.4.y-cip ltp-pty: 3 runs, 1 regressions (v4.4.302-cip69-517-g92709d8ae585)

Regressions Summary
-------------------

platform | arch | lab | compiler | defconfig | regressions
-------------------------+--------+---------------+----------+------------------------------+------------
asus-C523NA-A20057-coral | x86_64 | lab-collabora | gcc-10 | x86_64_defcon...6-chromebook | 1

Details: https://kernelci.org/test/job/cip/branch/linux-4.4.y-cip/kernel/v4.4.302-cip69-517-g92709d8ae585/plan/ltp-pty/

Test: ltp-pty
Tree: cip
Branch: linux-4.4.y-cip
Describe: v4.4.302-cip69-517-g92709d8ae585
URL: https://git.kernel.org/pub/scm/linux/kernel/git/cip/linux-cip.git
SHA: 92709d8ae585b3c97e359b1323f02c37349ee40d

Test suite revisions:
ltp-tests
URL: https://github.com/linux-test-project/ltp.git
SHA: bda92ad659a52d38ac810099f69adff626b064c6


Test Regressions
----------------


platform | arch | lab | compiler | defconfig | regressions
-------------------------+--------+---------------+----------+------------------------------+------------
asus-C523NA-A20057-coral | x86_64 | lab-collabora | gcc-10 | x86_64_defcon...6-chromebook | 1

Details: https://kernelci.org/test/plan/id/62df3ab8befd78bcd6daf061

Results: 0 PASS, 1 FAIL, 0 SKIP
Full config: x86_64_defconfig+x86-chromebook
Compiler: gcc-10 (gcc (Debian 10.2.1-6) 10.2.1 20210110)
Plain log: https://storage.kernelci.org//cip/linux-4.4.y-cip/v4.4.302-cip69-517-g92709d8ae585/x86_64/x86_64_defconfig+x86-chromebook/gcc-10/lab-collabora/ltp-pty-asus-C523NA-A20057-coral.txt
HTML log: https://storage.kernelci.org//cip/linux-4.4.y-cip/v4.4.302-cip69-517-g92709d8ae585/x86_64/x86_64_defconfig+x86-chromebook/gcc-10/lab-collabora/ltp-pty-asus-C523NA-A20057-coral.html
Rootfs: http://storage.kernelci.org/images/rootfs/debian/bullseye-ltp/20220716.0/amd64/initrd.cpio.gz


* ltp-pty.login: https://kernelci.org/test/case/id/62df3ab8befd78bcd6daf062
failing since 11 days (last pass: v4.4.302-cip69-296-g52de9431d314, first fail: v4.4.302-cip69-508-gd887d54a1be6)


cip/linux-4.4.y-cip baseline: 102 runs, 6 regressions (v4.4.302-cip69-517-g92709d8ae585) #kernelci

kernelci.org bot <bot@...>
 

cip/linux-4.4.y-cip baseline: 102 runs, 6 regressions (v4.4.302-cip69-517-g92709d8ae585)

Regressions Summary
-------------------

platform | arch | lab | compiler | defconfig | regressions
----------------------+-------+---------------+----------+----------------------------+------------
qemu_arm64-virt-gicv2 | arm64 | lab-broonie | gcc-10 | defconfig | 1
qemu_arm64-virt-gicv2 | arm64 | lab-broonie | gcc-10 | defconfig+arm64-chromebook | 1
qemu_arm64-virt-gicv2 | arm64 | lab-collabora | gcc-10 | defconfig | 1
qemu_arm64-virt-gicv3 | arm64 | lab-broonie | gcc-10 | defconfig | 1
qemu_arm64-virt-gicv3 | arm64 | lab-broonie | gcc-10 | defconfig+arm64-chromebook | 1
qemu_arm64-virt-gicv3 | arm64 | lab-collabora | gcc-10 | defconfig | 1

Details: https://kernelci.org/test/job/cip/branch/linux-4.4.y-cip/kernel/v4.4.302-cip69-517-g92709d8ae585/plan/baseline/

Test: baseline
Tree: cip
Branch: linux-4.4.y-cip
Describe: v4.4.302-cip69-517-g92709d8ae585
URL: https://git.kernel.org/pub/scm/linux/kernel/git/cip/linux-cip.git
SHA: 92709d8ae585b3c97e359b1323f02c37349ee40d


Test Regressions
----------------


platform | arch | lab | compiler | defconfig | regressions
----------------------+-------+---------------+----------+----------------------------+------------
qemu_arm64-virt-gicv2 | arm64 | lab-broonie | gcc-10 | defconfig | 1

Details: https://kernelci.org/test/plan/id/62df3a103ff2ed5542daf075

Results: 0 PASS, 1 FAIL, 0 SKIP
Full config: defconfig
Compiler: gcc-10 (aarch64-linux-gnu-gcc (Debian 10.2.1-6) 10.2.1 20210110)
Plain log: https://storage.kernelci.org//cip/linux-4.4.y-cip/v4.4.302-cip69-517-g92709d8ae585/arm64/defconfig/gcc-10/lab-broonie/baseline-qemu_arm64-virt-gicv2.txt
HTML log: https://storage.kernelci.org//cip/linux-4.4.y-cip/v4.4.302-cip69-517-g92709d8ae585/arm64/defconfig/gcc-10/lab-broonie/baseline-qemu_arm64-virt-gicv2.html
Rootfs: http://storage.kernelci.org/images/rootfs/buildroot/buildroot-baseline/20220718.0/arm64/rootfs.cpio.gz


* baseline.login: https://kernelci.org/test/case/id/62df3a103ff2ed5542daf076
new failure (last pass: v4.4.296-cip67)



platform | arch | lab | compiler | defconfig | regressions
----------------------+-------+---------------+----------+----------------------------+------------
qemu_arm64-virt-gicv2 | arm64 | lab-broonie | gcc-10 | defconfig+arm64-chromebook | 1

Details: https://kernelci.org/test/plan/id/62df42aa0d3c31b496daf09a

Results: 0 PASS, 1 FAIL, 0 SKIP
Full config: defconfig+arm64-chromebook
Compiler: gcc-10 (aarch64-linux-gnu-gcc (Debian 10.2.1-6) 10.2.1 20210110)
Plain log: https://storage.kernelci.org//cip/linux-4.4.y-cip/v4.4.302-cip69-517-g92709d8ae585/arm64/defconfig+arm64-chromebook/gcc-10/lab-broonie/baseline-qemu_arm64-virt-gicv2.txt
HTML log: https://storage.kernelci.org//cip/linux-4.4.y-cip/v4.4.302-cip69-517-g92709d8ae585/arm64/defconfig+arm64-chromebook/gcc-10/lab-broonie/baseline-qemu_arm64-virt-gicv2.html
Rootfs: http://storage.kernelci.org/images/rootfs/buildroot/buildroot-baseline/20220718.0/arm64/rootfs.cpio.gz


* baseline.login: https://kernelci.org/test/case/id/62df42aa0d3c31b496daf09b
failing since 68 days (last pass: v4.4.302-cip69, first fail: v4.4.302-cip69-296-g52de9431d314)



platform | arch | lab | compiler | defconfig | regressions
----------------------+-------+---------------+----------+----------------------------+------------
qemu_arm64-virt-gicv2 | arm64 | lab-collabora | gcc-10 | defconfig | 1

Details: https://kernelci.org/test/plan/id/62df3a0152ae3c4809daf0c4

Results: 0 PASS, 1 FAIL, 0 SKIP
Full config: defconfig
Compiler: gcc-10 (aarch64-linux-gnu-gcc (Debian 10.2.1-6) 10.2.1 20210110)
Plain log: https://storage.kernelci.org//cip/linux-4.4.y-cip/v4.4.302-cip69-517-g92709d8ae585/arm64/defconfig/gcc-10/lab-collabora/baseline-qemu_arm64-virt-gicv2.txt
HTML log: https://storage.kernelci.org//cip/linux-4.4.y-cip/v4.4.302-cip69-517-g92709d8ae585/arm64/defconfig/gcc-10/lab-collabora/baseline-qemu_arm64-virt-gicv2.html
Rootfs: http://storage.kernelci.org/images/rootfs/buildroot/buildroot-baseline/20220718.0/arm64/rootfs.cpio.gz


* baseline.login: https://kernelci.org/test/case/id/62df3a0152ae3c4809daf0c5
new failure (last pass: v4.4.296-cip67)



platform | arch | lab | compiler | defconfig | regressions
----------------------+-------+---------------+----------+----------------------------+------------
qemu_arm64-virt-gicv3 | arm64 | lab-broonie | gcc-10 | defconfig | 1

Details: https://kernelci.org/test/plan/id/62df3a0f3ff2ed5542daf06c

Results: 0 PASS, 1 FAIL, 0 SKIP
Full config: defconfig
Compiler: gcc-10 (aarch64-linux-gnu-gcc (Debian 10.2.1-6) 10.2.1 20210110)
Plain log: https://storage.kernelci.org//cip/linux-4.4.y-cip/v4.4.302-cip69-517-g92709d8ae585/arm64/defconfig/gcc-10/lab-broonie/baseline-qemu_arm64-virt-gicv3.txt
HTML log: https://storage.kernelci.org//cip/linux-4.4.y-cip/v4.4.302-cip69-517-g92709d8ae585/arm64/defconfig/gcc-10/lab-broonie/baseline-qemu_arm64-virt-gicv3.html
Rootfs: http://storage.kernelci.org/images/rootfs/buildroot/buildroot-baseline/20220718.0/arm64/rootfs.cpio.gz


* baseline.login: https://kernelci.org/test/case/id/62df3a0f3ff2ed5542daf06d
new failure (last pass: v4.4.296-cip67)



platform | arch | lab | compiler | defconfig | regressions
----------------------+-------+---------------+----------+----------------------------+------------
qemu_arm64-virt-gicv3 | arm64 | lab-broonie | gcc-10 | defconfig+arm64-chromebook | 1

Details: https://kernelci.org/test/plan/id/62df42a80d3c31b496daf094

Results: 0 PASS, 1 FAIL, 0 SKIP
Full config: defconfig+arm64-chromebook
Compiler: gcc-10 (aarch64-linux-gnu-gcc (Debian 10.2.1-6) 10.2.1 20210110)
Plain log: https://storage.kernelci.org//cip/linux-4.4.y-cip/v4.4.302-cip69-517-g92709d8ae585/arm64/defconfig+arm64-chromebook/gcc-10/lab-broonie/baseline-qemu_arm64-virt-gicv3.txt
HTML log: https://storage.kernelci.org//cip/linux-4.4.y-cip/v4.4.302-cip69-517-g92709d8ae585/arm64/defconfig+arm64-chromebook/gcc-10/lab-broonie/baseline-qemu_arm64-virt-gicv3.html
Rootfs: http://storage.kernelci.org/images/rootfs/buildroot/buildroot-baseline/20220718.0/arm64/rootfs.cpio.gz


* baseline.login: https://kernelci.org/test/case/id/62df42a80d3c31b496daf095
failing since 68 days (last pass: v4.4.302-cip69, first fail: v4.4.302-cip69-296-g52de9431d314)



platform | arch | lab | compiler | defconfig | regressions
----------------------+-------+---------------+----------+----------------------------+------------
qemu_arm64-virt-gicv3 | arm64 | lab-collabora | gcc-10 | defconfig | 1

Details: https://kernelci.org/test/plan/id/62df39fb8872029232daf06a

Results: 0 PASS, 1 FAIL, 0 SKIP
Full config: defconfig
Compiler: gcc-10 (aarch64-linux-gnu-gcc (Debian 10.2.1-6) 10.2.1 20210110)
Plain log: https://storage.kernelci.org//cip/linux-4.4.y-cip/v4.4.302-cip69-517-g92709d8ae585/arm64/defconfig/gcc-10/lab-collabora/baseline-qemu_arm64-virt-gicv3.txt
HTML log: https://storage.kernelci.org//cip/linux-4.4.y-cip/v4.4.302-cip69-517-g92709d8ae585/arm64/defconfig/gcc-10/lab-collabora/baseline-qemu_arm64-virt-gicv3.html
Rootfs: http://storage.kernelci.org/images/rootfs/buildroot/buildroot-baseline/20220718.0/arm64/rootfs.cpio.gz


* baseline.login: https://kernelci.org/test/case/id/62df39fb8872029232daf06b
new failure (last pass: v4.4.296-cip67)


cip-gitlab/ci/pavel/linux-test smc: 15 runs, 4 regressions (v5.10.129-cip12-36-g21d9d56f4de5a) #kernelci

kernelci.org bot <bot@...>
 

cip-gitlab/ci/pavel/linux-test smc: 15 runs, 4 regressions (v5.10.129-cip12-36-g21d9d56f4de5a)

Regressions Summary
-------------------

platform | arch | lab | compiler | defconfig | regressions
----------------------+-------+---------------+----------+----------------------------+------------
qemu_arm64-virt-gicv3 | arm64 | lab-broonie | gcc-10 | defconfig | 1
qemu_arm64-virt-gicv3 | arm64 | lab-broonie | gcc-10 | defconfig+arm64-chromebook | 1
qemu_arm64-virt-gicv3 | arm64 | lab-collabora | gcc-10 | defconfig | 1
qemu_arm64-virt-gicv3 | arm64 | lab-collabora | gcc-10 | defconfig+arm64-chromebook | 1

Details: https://kernelci.org/test/job/cip-gitlab/branch/ci%2Fpavel%2Flinux-test/kernel/v5.10.129-cip12-36-g21d9d56f4de5a/plan/smc/

Test: smc
Tree: cip-gitlab
Branch: ci/pavel/linux-test
Describe: v5.10.129-cip12-36-g21d9d56f4de5a
URL: https://gitlab.com/cip-project/cip-kernel/linux-cip.git
SHA: 21d9d56f4de5acd415b12aecf82f754e9e6065fb


Test Regressions
----------------


platform | arch | lab | compiler | defconfig | regressions
----------------------+-------+---------------+----------+----------------------------+------------
qemu_arm64-virt-gicv3 | arm64 | lab-broonie | gcc-10 | defconfig | 1

Details: https://kernelci.org/test/plan/id/62df3572a022ca189adaf066

Results: 0 PASS, 1 FAIL, 0 SKIP
Full config: defconfig
Compiler: gcc-10 (aarch64-linux-gnu-gcc (Debian 10.2.1-6) 10.2.1 20210110)
Plain log: https://storage.kernelci.org//cip-gitlab/ci-pavel-linux-test/v5.10.129-cip12-36-g21d9d56f4de5a/arm64/defconfig/gcc-10/lab-broonie/smc-qemu_arm64-virt-gicv3.txt
HTML log: https://storage.kernelci.org//cip-gitlab/ci-pavel-linux-test/v5.10.129-cip12-36-g21d9d56f4de5a/arm64/defconfig/gcc-10/lab-broonie/smc-qemu_arm64-virt-gicv3.html
Rootfs: http://storage.kernelci.org/images/rootfs/buildroot/buildroot-baseline/20220718.0/arm64/rootfs.cpio.gz


* smc.login: https://kernelci.org/test/case/id/62df3572a022ca189adaf067
failing since 76 days (last pass: v4.19.233-516-ge5e741fbfc87, first fail: v5.10.109-cip5-384-g722204542e8a)



platform | arch | lab | compiler | defconfig | regressions
----------------------+-------+---------------+----------+----------------------------+------------
qemu_arm64-virt-gicv3 | arm64 | lab-broonie | gcc-10 | defconfig+arm64-chromebook | 1

Details: https://kernelci.org/test/plan/id/62df3573a5f09021ccdaf05a

Results: 0 PASS, 1 FAIL, 0 SKIP
Full config: defconfig+arm64-chromebook
Compiler: gcc-10 (aarch64-linux-gnu-gcc (Debian 10.2.1-6) 10.2.1 20210110)
Plain log: https://storage.kernelci.org//cip-gitlab/ci-pavel-linux-test/v5.10.129-cip12-36-g21d9d56f4de5a/arm64/defconfig+arm64-chromebook/gcc-10/lab-broonie/smc-qemu_arm64-virt-gicv3.txt
HTML log: https://storage.kernelci.org//cip-gitlab/ci-pavel-linux-test/v5.10.129-cip12-36-g21d9d56f4de5a/arm64/defconfig+arm64-chromebook/gcc-10/lab-broonie/smc-qemu_arm64-virt-gicv3.html
Rootfs: http://storage.kernelci.org/images/rootfs/buildroot/buildroot-baseline/20220718.0/arm64/rootfs.cpio.gz


* smc.login: https://kernelci.org/test/case/id/62df3573a5f09021ccdaf05b
failing since 76 days (last pass: v4.19.233-516-ge5e741fbfc87, first fail: v5.10.109-cip5-384-g722204542e8a)



platform | arch | lab | compiler | defconfig | regressions
----------------------+-------+---------------+----------+----------------------------+------------
qemu_arm64-virt-gicv3 | arm64 | lab-collabora | gcc-10 | defconfig | 1

Details: https://kernelci.org/test/plan/id/62df337dbf38f24917daf05f

Results: 0 PASS, 1 FAIL, 0 SKIP
Full config: defconfig
Compiler: gcc-10 (aarch64-linux-gnu-gcc (Debian 10.2.1-6) 10.2.1 20210110)
Plain log: https://storage.kernelci.org//cip-gitlab/ci-pavel-linux-test/v5.10.129-cip12-36-g21d9d56f4de5a/arm64/defconfig/gcc-10/lab-collabora/smc-qemu_arm64-virt-gicv3.txt
HTML log: https://storage.kernelci.org//cip-gitlab/ci-pavel-linux-test/v5.10.129-cip12-36-g21d9d56f4de5a/arm64/defconfig/gcc-10/lab-collabora/smc-qemu_arm64-virt-gicv3.html
Rootfs: http://storage.kernelci.org/images/rootfs/buildroot/buildroot-baseline/20220718.0/arm64/rootfs.cpio.gz


* smc.login: https://kernelci.org/test/case/id/62df337dbf38f24917daf060
failing since 76 days (last pass: v4.19.233-516-ge5e741fbfc87, first fail: v5.10.109-cip5-384-g722204542e8a)



platform | arch | lab | compiler | defconfig | regressions
----------------------+-------+---------------+----------+----------------------------+------------
qemu_arm64-virt-gicv3 | arm64 | lab-collabora | gcc-10 | defconfig+arm64-chromebook | 1

Details: https://kernelci.org/test/plan/id/62df34e6593fcab452daf074

Results: 0 PASS, 1 FAIL, 0 SKIP
Full config: defconfig+arm64-chromebook
Compiler: gcc-10 (aarch64-linux-gnu-gcc (Debian 10.2.1-6) 10.2.1 20210110)
Plain log: https://storage.kernelci.org//cip-gitlab/ci-pavel-linux-test/v5.10.129-cip12-36-g21d9d56f4de5a/arm64/defconfig+arm64-chromebook/gcc-10/lab-collabora/smc-qemu_arm64-virt-gicv3.txt
HTML log: https://storage.kernelci.org//cip-gitlab/ci-pavel-linux-test/v5.10.129-cip12-36-g21d9d56f4de5a/arm64/defconfig+arm64-chromebook/gcc-10/lab-collabora/smc-qemu_arm64-virt-gicv3.html
Rootfs: http://storage.kernelci.org/images/rootfs/buildroot/buildroot-baseline/20220718.0/arm64/rootfs.cpio.gz


* smc.login: https://kernelci.org/test/case/id/62df34e6593fcab452daf075
failing since 76 days (last pass: v4.19.233-516-ge5e741fbfc87, first fail: v5.10.109-cip5-384-g722204542e8a)


cip-gitlab/ci/pavel/linux-test ltp-pty: 7 runs, 1 regressions (v5.10.129-cip12-36-g21d9d56f4de5a) #kernelci

kernelci.org bot <bot@...>
 

cip-gitlab/ci/pavel/linux-test ltp-pty: 7 runs, 1 regressions (v5.10.129-cip12-36-g21d9d56f4de5a)

Regressions Summary
-------------------

platform | arch | lab | compiler | defconfig | regressions
-------------------------+-------+---------+----------+----------------------------+------------
r8a774a1-hihope-rzg2m-ex | arm64 | lab-cip | gcc-10 | defconfig+arm64-chromebook | 1

Details: https://kernelci.org/test/job/cip-gitlab/branch/ci%2Fpavel%2Flinux-test/kernel/v5.10.129-cip12-36-g21d9d56f4de5a/plan/ltp-pty/

Test: ltp-pty
Tree: cip-gitlab
Branch: ci/pavel/linux-test
Describe: v5.10.129-cip12-36-g21d9d56f4de5a
URL: https://gitlab.com/cip-project/cip-kernel/linux-cip.git
SHA: 21d9d56f4de5acd415b12aecf82f754e9e6065fb

Test suite revisions:
ltp-tests
URL: https://github.com/linux-test-project/ltp.git
SHA: bda92ad659a52d38ac810099f69adff626b064c6


Test Regressions
----------------


platform | arch | lab | compiler | defconfig | regressions
-------------------------+-------+---------+----------+----------------------------+------------
r8a774a1-hihope-rzg2m-ex | arm64 | lab-cip | gcc-10 | defconfig+arm64-chromebook | 1

Details: https://kernelci.org/test/plan/id/62df3673e91f097b06daf05d

Results: 0 PASS, 1 FAIL, 0 SKIP
Full config: defconfig+arm64-chromebook
Compiler: gcc-10 (aarch64-linux-gnu-gcc (Debian 10.2.1-6) 10.2.1 20210110)
Plain log: https://storage.kernelci.org//cip-gitlab/ci-pavel-linux-test/v5.10.129-cip12-36-g21d9d56f4de5a/arm64/defconfig+arm64-chromebook/gcc-10/lab-cip/ltp-pty-r8a774a1-hihope-rzg2m-ex.txt
HTML log: https://storage.kernelci.org//cip-gitlab/ci-pavel-linux-test/v5.10.129-cip12-36-g21d9d56f4de5a/arm64/defconfig+arm64-chromebook/gcc-10/lab-cip/ltp-pty-r8a774a1-hihope-rzg2m-ex.html
Rootfs: http://storage.kernelci.org/images/rootfs/debian/bullseye-ltp/20220716.0/arm64/initrd.cpio.gz


* ltp-pty.login: https://kernelci.org/test/case/id/62df3673e91f097b06daf05e
new failure (last pass: v5.10.112-cip6)


cip-gitlab/ci/pavel/linux-test ltp-fcntl-locktests: 8 runs, 1 regressions (v5.10.129-cip12-36-g21d9d56f4de5a) #kernelci

kernelci.org bot <bot@...>
 

cip-gitlab/ci/pavel/linux-test ltp-fcntl-locktests: 8 runs, 1 regressions (v5.10.129-cip12-36-g21d9d56f4de5a)

Regressions Summary
-------------------

platform | arch | lab | compiler | defconfig | regressions
-------------------------+-------+---------+----------+-----------+------------
r8a774a1-hihope-rzg2m-ex | arm64 | lab-cip | gcc-10 | defconfig | 1

Details: https://kernelci.org/test/job/cip-gitlab/branch/ci%2Fpavel%2Flinux-test/kernel/v5.10.129-cip12-36-g21d9d56f4de5a/plan/ltp-fcntl-locktests/

Test: ltp-fcntl-locktests
Tree: cip-gitlab
Branch: ci/pavel/linux-test
Describe: v5.10.129-cip12-36-g21d9d56f4de5a
URL: https://gitlab.com/cip-project/cip-kernel/linux-cip.git
SHA: 21d9d56f4de5acd415b12aecf82f754e9e6065fb

Test suite revisions:
ltp-tests
URL: https://github.com/linux-test-project/ltp.git
SHA: bda92ad659a52d38ac810099f69adff626b064c6


Test Regressions
----------------


platform | arch | lab | compiler | defconfig | regressions
-------------------------+-------+---------+----------+-----------+------------
r8a774a1-hihope-rzg2m-ex | arm64 | lab-cip | gcc-10 | defconfig | 1

Details: https://kernelci.org/test/plan/id/62df3626524b7fca18daf0e7

Results: 0 PASS, 1 FAIL, 0 SKIP
Full config: defconfig
Compiler: gcc-10 (aarch64-linux-gnu-gcc (Debian 10.2.1-6) 10.2.1 20210110)
Plain log: https://storage.kernelci.org//cip-gitlab/ci-pavel-linux-test/v5.10.129-cip12-36-g21d9d56f4de5a/arm64/defconfig/gcc-10/lab-cip/ltp-fcntl-locktests-r8a774a1-hihope-rzg2m-ex.txt
HTML log: https://storage.kernelci.org//cip-gitlab/ci-pavel-linux-test/v5.10.129-cip12-36-g21d9d56f4de5a/arm64/defconfig/gcc-10/lab-cip/ltp-fcntl-locktests-r8a774a1-hihope-rzg2m-ex.html
Rootfs: http://storage.kernelci.org/images/rootfs/debian/bullseye-ltp/20220716.0/arm64/initrd.cpio.gz


* ltp-fcntl-locktests.login: https://kernelci.org/test/case/id/62df3626524b7fca18daf0e8
new failure (last pass: v5.10.112-cip6)

221 - 240 of 9152