Date   

Re: [ANNOUNCE] Release v5.10.83-cip1 / First release of the CIP 5.10.y Linux kernel

Alice Ferrazzi
 

On Sun, Dec 5, 2021 at 8:24 AM Nobuhiro Iwamatsu
<nobuhiro1.iwamatsu@...> wrote:

Hi all,

We release v5.10.83-cip1, which is the first release of the CIP 5.10.y Linux kernel !
This is based on v5.10.83 with some additional updates for the Renesas reference
boards.

You can get this release via the git tree at:

v5.10.83-cip1:
repository:
https://git.kernel.org/pub/scm/linux/kernel/git/cip/linux-cip.git
branch:
linux-5.10.y-cip
commit hash:
2332f07a324fd78d7c7436deeed23cd7db441ea7
added commits:
CIP: Add a number to the version suffix
dt-bindings: pci: rcar-pci-ep: Document missing interrupts property
dt-bindings: timer: renesas: tmu: Document r8a774e1 bindings
dt-bindings: PCI: rcar-pci-host: Document r8a774e1 bindings
memory: renesas-rpc-if: Make rpcif_enable/disable_rpm() as static inline
spi: spi-mem: Fix passing zero to 'PTR_ERR' warning
clk: renesas: r8a774a1: Add RPC clocks
clk: renesas: r8a774b1: Add RPC clocks
clk: renesas: r8a774c0: Add RPC clocks
pinctrl: renesas: r8a77990: Add QSPI[01] pins, groups and functions
pinctrl: renesas: r8a77990: Optimize pinctrl image size for R8A774C0
pinctrl: renesas: r8a77951: Add QSPI[01] pins, groups and functions
pinctrl: renesas: r8a77951: Optimize pinctrl image size for R8A774E1
pinctrl: renesas: r8a7796: Add QSPI[01] pins, groups and functions
pinctrl: renesas: r8a7796: Optimize pinctrl image size for R8A774A1
pinctrl: renesas: r8a77965: Add QSPI[01] pins, groups and functions
pinctrl: renesas: r8a77965: Optimize pinctrl image size for R8A774B1
Add configuration for gitlab-ci.
In the link here under there is the difference with Linux stable v5.10.83:
https://www.diffchecker.com/1Ber9vjb

Other than having linux-5.10.y-cip tested on more boards,
respectively 164 builds vs 184 builds for CIP kernel.
We could also test CIP kernel on arm64,
Linux stable looks not yet tested on arm64 with KernelCI.
I currently don't see any relevant difference from both build tests.

--
======================================
Cybertrust Japan Co.,Ltd.
Alice Ferrazzi
alice.ferrazzi@...
======================================


Re: Planned maintenance for lab-cip-renesas: 4-5th Dec

Alice Ferrazzi
 

On Mon, Dec 6, 2021 at 6:08 PM Chris Paterson
<chris.paterson2@...> wrote:

From: cip-dev@... <cip-dev@...> On
Behalf Of Chris Paterson via lists.cip-project.org
Sent: 03 December 2021 20:03

Hello all,

From: cip-dev@... <cip-dev@...> On
Behalf Of Chris Paterson via lists.cip-project.org
Sent: 19 November 2021 12:33

Hello all,

Just a heads up, on the weekend of the 4/5th December the Renesas UK
office will be undergoing maintenance on its power infrastructure.
As such I will be taking lab-cip-renesas offline for the weekend starting
from
Friday evening (UK time).
lab-cip-renesas is now offline until Monday morning (UK time).
lab-cip-renesas is now back online.
we still have some devices offline with no machine available:
r8a77470-iwg23s-sbc
x86-openblocks-iot-vx2

As I'm adding this devices to KernelCI,
can we get it back online for testing ?

--
======================================
Cybertrust Japan Co.,Ltd.
Alice Ferrazzi
alice.ferrazzi@...
======================================


Re: Planned maintenance for lab-cip-renesas: 4-5th Dec

Chris Paterson
 

From: cip-dev@... <cip-dev@...> On
Behalf Of Chris Paterson via lists.cip-project.org
Sent: 03 December 2021 20:03

Hello all,

From: cip-dev@... <cip-dev@...> On
Behalf Of Chris Paterson via lists.cip-project.org
Sent: 19 November 2021 12:33

Hello all,

Just a heads up, on the weekend of the 4/5th December the Renesas UK
office will be undergoing maintenance on its power infrastructure.
As such I will be taking lab-cip-renesas offline for the weekend starting
from
Friday evening (UK time).
lab-cip-renesas is now offline until Monday morning (UK time).
lab-cip-renesas is now back online.

Kind regards, Chris


[isar-cip-core][PATCH 1/2] Add kas option to selection 4.19 explicitly

Jan Kiszka
 

From: Jan Kiszka <jan.kiszka@...>

The distro configs provide a default choice of the kernel version.
Therefore, we cannot rely on 4.19 being chosen when not providing any
kas option file.

Signed-off-by: Jan Kiszka <jan.kiszka@...>
---
Kconfig | 4 ++--
kas/opt/4.19.yml | 18 ++++++++++++++++++
2 files changed, 20 insertions(+), 2 deletions(-)
create mode 100644 kas/opt/4.19.yml

diff --git a/Kconfig b/Kconfig
index e5ce257..ca67f30 100644
--- a/Kconfig
+++ b/Kconfig
@@ -61,8 +61,8 @@ endchoice

config KAS_INCLUDE_KERNEL
string
- default "kas/opt/4.4.yml"
- depends on KERNEL_4_4
+ default "kas/opt/4.4.yml" if KERNEL_4_4
+ default "kas/opt/4.19.yml" if KERNEL_4_19

config KERNEL_RT
bool "Real-time CIP kernel"
diff --git a/kas/opt/4.19.yml b/kas/opt/4.19.yml
new file mode 100644
index 0000000..5ff1683
--- /dev/null
+++ b/kas/opt/4.19.yml
@@ -0,0 +1,18 @@
+#
+# CIP Core, generic profile
+#
+# Copyright (c) Siemens AG, 2021
+#
+# Authors:
+# Jan Kiszka <jan.kiszka@...>
+#
+# SPDX-License-Identifier: MIT
+#
+
+header:
+ version: 10
+
+local_conf_header:
+ kernel-version: |
+ PREFERRED_VERSION_linux-cip = "4.19.%"
+ PREFERRED_VERSION_linux-cip-rt = "4.19.%"
--
2.31.1


[isar-cip-core][PATCH 2/2] linux-cip: Add recipe, option file and menu entry for 5.10.83-cip1

Jan Kiszka
 

From: Jan Kiszka <jan.kiszka@...>

No -rt kernel released so far, thus we need to confine the choice when
5.10 is selected.

Signed-off-by: Jan Kiszka <jan.kiszka@...>
---
Kconfig | 7 ++++++-
conf/distro/cip-core-bullseye.conf | 2 +-
conf/distro/cip-core-bullseye.conf => kas/opt/5.10.yml | 10 ++++++----
.../linux/linux-cip_5.10.83-cip1.bb | 6 ++----
4 files changed, 15 insertions(+), 10 deletions(-)
copy conf/distro/cip-core-bullseye.conf => kas/opt/5.10.yml (50%)
copy conf/distro/cip-core-bullseye.conf => recipes-kernel/linux/linux-cip_5.10.83-cip1.bb (50%)

diff --git a/Kconfig b/Kconfig
index ca67f30..e03ab50 100644
--- a/Kconfig
+++ b/Kconfig
@@ -49,7 +49,7 @@ comment "Kernel options"

choice
prompt "CIP kernel version"
- default KERNEL_4_19
+ default KERNEL_5_10

config KERNEL_4_4
bool "Kernel 4.4.x-cip"
@@ -57,15 +57,20 @@ config KERNEL_4_4
config KERNEL_4_19
bool "Kernel 4.19.x-cip"

+config KERNEL_5_10
+ bool "Kernel 5.10.x-cip"
+
endchoice

config KAS_INCLUDE_KERNEL
string
default "kas/opt/4.4.yml" if KERNEL_4_4
default "kas/opt/4.19.yml" if KERNEL_4_19
+ default "kas/opt/5.10.yml" if KERNEL_5_10

config KERNEL_RT
bool "Real-time CIP kernel"
+ depends on !KERNEL_5_10

config KAS_INCLUDE_KERNEL_RT
string
diff --git a/conf/distro/cip-core-bullseye.conf b/conf/distro/cip-core-bullseye.conf
index 38014b4..a0790d5 100644
--- a/conf/distro/cip-core-bullseye.conf
+++ b/conf/distro/cip-core-bullseye.conf
@@ -12,5 +12,5 @@
require conf/distro/debian-bullseye.conf
require cip-core-common.inc

-PREFERRED_VERSION_linux-cip ?= "4.19.%"
+PREFERRED_VERSION_linux-cip ?= "5.10.%"
PREFERRED_VERSION_linux-cip-rt ?= "4.19.%"
diff --git a/conf/distro/cip-core-bullseye.conf b/kas/opt/5.10.yml
similarity index 50%
copy from conf/distro/cip-core-bullseye.conf
copy to kas/opt/5.10.yml
index 38014b4..612b7f9 100644
--- a/conf/distro/cip-core-bullseye.conf
+++ b/kas/opt/5.10.yml
@@ -9,8 +9,10 @@
# SPDX-License-Identifier: MIT
#

-require conf/distro/debian-bullseye.conf
-require cip-core-common.inc
+header:
+ version: 10

-PREFERRED_VERSION_linux-cip ?= "4.19.%"
-PREFERRED_VERSION_linux-cip-rt ?= "4.19.%"
+local_conf_header:
+ kernel-version: |
+ PREFERRED_VERSION_linux-cip = "5.10.%"
+ PREFERRED_VERSION_linux-cip-rt = "5.10.%"
diff --git a/conf/distro/cip-core-bullseye.conf b/recipes-kernel/linux/linux-cip_5.10.83-cip1.bb
similarity index 50%
copy from conf/distro/cip-core-bullseye.conf
copy to recipes-kernel/linux/linux-cip_5.10.83-cip1.bb
index 38014b4..a89f568 100644
--- a/conf/distro/cip-core-bullseye.conf
+++ b/recipes-kernel/linux/linux-cip_5.10.83-cip1.bb
@@ -9,8 +9,6 @@
# SPDX-License-Identifier: MIT
#

-require conf/distro/debian-bullseye.conf
-require cip-core-common.inc
+require linux-cip-common.inc

-PREFERRED_VERSION_linux-cip ?= "4.19.%"
-PREFERRED_VERSION_linux-cip-rt ?= "4.19.%"
+SRC_URI[sha256sum] = "85af8f809b2505c6434266d6658d977d62d383889b3a4f9968b2764794108d4f"
--
2.31.1


[isar-cip-core][PATCH 0/2] Add 5.10 recipe, fix free choice of kernel versions

Jan Kiszka
 

See patches for details.

Jan

Jan Kiszka (2):
Add kas option to selection 4.19 explicitly
linux-cip: Add recipe, option file and menu entry for 5.10.83-cip1

Kconfig | 11 ++++++++---
conf/distro/cip-core-bullseye.conf | 2 +-
.../distro/cip-core-bullseye.conf => kas/opt/4.19.yml | 10 ++++++----
.../distro/cip-core-bullseye.conf => kas/opt/5.10.yml | 10 ++++++----
.../linux/linux-cip_5.10.83-cip1.bb | 6 ++----
5 files changed, 23 insertions(+), 16 deletions(-)
copy conf/distro/cip-core-bullseye.conf => kas/opt/4.19.yml (50%)
copy conf/distro/cip-core-bullseye.conf => kas/opt/5.10.yml (50%)
copy conf/distro/cip-core-bullseye.conf => recipes-kernel/linux/linux-cip_5.10.83-cip1.bb (50%)

--
2.31.1


cip/linux-5.10.y-cip baseline-nfs: 12 runs, 2 regressions (v5.10.83-cip1) #kernelci

kernelci.org bot <bot@...>
 

cip/linux-5.10.y-cip baseline-nfs: 12 runs, 2 regressions (v5.10.83-cip1)

Regressions Summary
-------------------

platform | arch | lab | compiler | defconfig | regressions
-----------------+------+---------+----------+---------------------+------------
beaglebone-black | arm | lab-cip | gcc-10 | multi_v7_defconfig | 1
beaglebone-black | arm | lab-cip | gcc-10 | omap2plus_defconfig | 1

Details: https://kernelci.org/test/job/cip/branch/linux-5.10.y-cip/kernel/v5.10.83-cip1/plan/baseline-nfs/

Test: baseline-nfs
Tree: cip
Branch: linux-5.10.y-cip
Describe: v5.10.83-cip1
URL: https://git.kernel.org/pub/scm/linux/kernel/git/cip/linux-cip.git
SHA: 2332f07a324fd78d7c7436deeed23cd7db441ea7


Test Regressions
----------------


platform | arch | lab | compiler | defconfig | regressions
-----------------+------+---------+----------+---------------------+------------
beaglebone-black | arm | lab-cip | gcc-10 | multi_v7_defconfig | 1

Details: https://kernelci.org/test/plan/id/61ac050fcc9fae60621a94af

Results: 0 PASS, 1 FAIL, 0 SKIP
Full config: multi_v7_defconfig
Compiler: gcc-10 (arm-linux-gnueabihf-gcc (Debian 10.2.1-6) 10.2.1 20210110)
Plain log: https://storage.kernelci.org//cip/linux-5.10.y-cip/v5.10.83-cip1/arm/multi_v7_defconfig/gcc-10/lab-cip/baseline-nfs-beaglebone-black.txt
HTML log: https://storage.kernelci.org//cip/linux-5.10.y-cip/v5.10.83-cip1/arm/multi_v7_defconfig/gcc-10/lab-cip/baseline-nfs-beaglebone-black.html
Rootfs: http://storage.kernelci.org/images/rootfs/debian/bullseye/20211126.0/armhf/initrd.cpio.gz


* baseline-nfs.login: https://kernelci.org/test/case/id/61ac050fcc9fae60621a94b0
new failure (last pass: v5.10.8-8301-g3d6168cb89f6)



platform | arch | lab | compiler | defconfig | regressions
-----------------+------+---------+----------+---------------------+------------
beaglebone-black | arm | lab-cip | gcc-10 | omap2plus_defconfig | 1

Details: https://kernelci.org/test/plan/id/61ac07e00a190a3f881a94a3

Results: 0 PASS, 1 FAIL, 0 SKIP
Full config: omap2plus_defconfig
Compiler: gcc-10 (arm-linux-gnueabihf-gcc (Debian 10.2.1-6) 10.2.1 20210110)
Plain log: https://storage.kernelci.org//cip/linux-5.10.y-cip/v5.10.83-cip1/arm/omap2plus_defconfig/gcc-10/lab-cip/baseline-nfs-beaglebone-black.txt
HTML log: https://storage.kernelci.org//cip/linux-5.10.y-cip/v5.10.83-cip1/arm/omap2plus_defconfig/gcc-10/lab-cip/baseline-nfs-beaglebone-black.html
Rootfs: http://storage.kernelci.org/images/rootfs/debian/bullseye/20211126.0/armhf/initrd.cpio.gz


* baseline-nfs.login: https://kernelci.org/test/case/id/61ac07e00a190a3f881a94a4
new failure (last pass: v5.10.8-8301-g3d6168cb89f6)


cip/linux-5.10.y-cip build: 184 builds: 3 failed, 181 passed, 4 errors, 10 warnings (v5.10.83-cip1) #kernelci

kernelci.org bot <bot@...>
 

cip/linux-5.10.y-cip build: 184 builds: 3 failed, 181 passed, 4 errors, 10 warnings (v5.10.83-cip1)

Full Build Summary: https://kernelci.org/build/cip/branch/linux-5.10.y-cip/kernel/v5.10.83-cip1/

Tree: cip
Branch: linux-5.10.y-cip
Git Describe: v5.10.83-cip1
Git Commit: 2332f07a324fd78d7c7436deeed23cd7db441ea7
Git URL: https://git.kernel.org/pub/scm/linux/kernel/git/cip/linux-cip.git
Built: 7 unique architectures

Build Failures Detected:

arm:
rpc_defconfig: (gcc-10) FAIL

mips:
ip27_defconfig: (gcc-10) FAIL
ip28_defconfig: (gcc-10) FAIL

Errors and Warnings Detected:

arc:

arm64:

arm:
rpc_defconfig (gcc-10): 4 errors

i386:

mips:
32r2el_defconfig (gcc-10): 1 warning
decstation_64_defconfig (gcc-10): 1 warning
decstation_defconfig (gcc-10): 1 warning
decstation_r4k_defconfig (gcc-10): 1 warning
lemote2f_defconfig (gcc-10): 1 warning
rm200_defconfig (gcc-10): 1 warning

riscv:
rv32_defconfig (gcc-10): 4 warnings

x86_64:

Errors summary:

2 arm-linux-gnueabihf-gcc: error: unrecognized -march target: armv3m
2 arm-linux-gnueabihf-gcc: error: missing argument to ‘-march=’

Warnings summary:

3 kernel/rcu/tasks.h:707:13: warning: ‘show_rcu_tasks_rude_gp_kthread’ defined but not used [-Wunused-function]
2 <stdin>:830:2: warning: #warning syscall fstat64 not implemented [-Wcpp]
2 <stdin>:1127:2: warning: #warning syscall fstatat64 not implemented [-Wcpp]
1 net/mac80211/mlme.c:4328:1: warning: the frame size of 1040 bytes is larger than 1024 bytes [-Wframe-larger-than=]
1 drivers/block/paride/bpck.c:32: warning: "PC" redefined
1 WARNING: modpost: Symbol info of vmlinux is missing. Unresolved symbol check will be entirely skipped.

================================================================================

Detailed per-defconfig build reports:

--------------------------------------------------------------------------------
32r2el_defconfig (mips, gcc-10) — PASS, 0 errors, 1 warning, 0 section mismatches

Warnings:
WARNING: modpost: Symbol info of vmlinux is missing. Unresolved symbol check will be entirely skipped.

--------------------------------------------------------------------------------
allnoconfig (x86_64, gcc-10) — PASS, 0 errors, 0 warnings, 0 section mismatches

--------------------------------------------------------------------------------
allnoconfig (i386, gcc-10) — PASS, 0 errors, 0 warnings, 0 section mismatches

--------------------------------------------------------------------------------
allnoconfig (arc, gcc-10) — PASS, 0 errors, 0 warnings, 0 section mismatches

--------------------------------------------------------------------------------
am200epdkit_defconfig (arm, gcc-10) — PASS, 0 errors, 0 warnings, 0 section mismatches

--------------------------------------------------------------------------------
ar7_defconfig (mips, gcc-10) — PASS, 0 errors, 0 warnings, 0 section mismatches

--------------------------------------------------------------------------------
aspeed_g4_defconfig (arm, gcc-10) — PASS, 0 errors, 0 warnings, 0 section mismatches

--------------------------------------------------------------------------------
aspeed_g5_defconfig (arm, gcc-10) — PASS, 0 errors, 0 warnings, 0 section mismatches

--------------------------------------------------------------------------------
assabet_defconfig (arm, gcc-10) — PASS, 0 errors, 0 warnings, 0 section mismatches

--------------------------------------------------------------------------------
at91_dt_defconfig (arm, gcc-10) — PASS, 0 errors, 0 warnings, 0 section mismatches

--------------------------------------------------------------------------------
ath25_defconfig (mips, gcc-10) — PASS, 0 errors, 0 warnings, 0 section mismatches

--------------------------------------------------------------------------------
ath79_defconfig (mips, gcc-10) — PASS, 0 errors, 0 warnings, 0 section mismatches

--------------------------------------------------------------------------------
axm55xx_defconfig (arm, gcc-10) — PASS, 0 errors, 0 warnings, 0 section mismatches

--------------------------------------------------------------------------------
axs103_defconfig (arc, gcc-10) — PASS, 0 errors, 0 warnings, 0 section mismatches

--------------------------------------------------------------------------------
axs103_smp_defconfig (arc, gcc-10) — PASS, 0 errors, 0 warnings, 0 section mismatches

--------------------------------------------------------------------------------
badge4_defconfig (arm, gcc-10) — PASS, 0 errors, 0 warnings, 0 section mismatches

--------------------------------------------------------------------------------
bcm2835_defconfig (arm, gcc-10) — PASS, 0 errors, 0 warnings, 0 section mismatches

--------------------------------------------------------------------------------
bcm47xx_defconfig (mips, gcc-10) — PASS, 0 errors, 0 warnings, 0 section mismatches

--------------------------------------------------------------------------------
bcm63xx_defconfig (mips, gcc-10) — PASS, 0 errors, 0 warnings, 0 section mismatches

--------------------------------------------------------------------------------
bigsur_defconfig (mips, gcc-10) — PASS, 0 errors, 0 warnings, 0 section mismatches

--------------------------------------------------------------------------------
bmips_be_defconfig (mips, gcc-10) — PASS, 0 errors, 0 warnings, 0 section mismatches

--------------------------------------------------------------------------------
bmips_stb_defconfig (mips, gcc-10) — PASS, 0 errors, 0 warnings, 0 section mismatches

--------------------------------------------------------------------------------
capcella_defconfig (mips, gcc-10) — PASS, 0 errors, 0 warnings, 0 section mismatches

--------------------------------------------------------------------------------
cavium_octeon_defconfig (mips, gcc-10) — PASS, 0 errors, 0 warnings, 0 section mismatches

--------------------------------------------------------------------------------
cerfcube_defconfig (arm, gcc-10) — PASS, 0 errors, 0 warnings, 0 section mismatches

--------------------------------------------------------------------------------
ci20_defconfig (mips, gcc-10) — PASS, 0 errors, 0 warnings, 0 section mismatches

--------------------------------------------------------------------------------
cm_x300_defconfig (arm, gcc-10) — PASS, 0 errors, 0 warnings, 0 section mismatches

--------------------------------------------------------------------------------
cobalt_defconfig (mips, gcc-10) — PASS, 0 errors, 0 warnings, 0 section mismatches

--------------------------------------------------------------------------------
colibri_pxa270_defconfig (arm, gcc-10) — PASS, 0 errors, 0 warnings, 0 section mismatches

--------------------------------------------------------------------------------
colibri_pxa300_defconfig (arm, gcc-10) — PASS, 0 errors, 0 warnings, 0 section mismatches

--------------------------------------------------------------------------------
collie_defconfig (arm, gcc-10) — PASS, 0 errors, 0 warnings, 0 section mismatches

--------------------------------------------------------------------------------
corgi_defconfig (arm, gcc-10) — PASS, 0 errors, 0 warnings, 0 section mismatches

--------------------------------------------------------------------------------
cu1000-neo_defconfig (mips, gcc-10) — PASS, 0 errors, 0 warnings, 0 section mismatches

--------------------------------------------------------------------------------
cu1830-neo_defconfig (mips, gcc-10) — PASS, 0 errors, 0 warnings, 0 section mismatches

--------------------------------------------------------------------------------
davinci_all_defconfig (arm, gcc-10) — PASS, 0 errors, 0 warnings, 0 section mismatches

--------------------------------------------------------------------------------
db1xxx_defconfig (mips, gcc-10) — PASS, 0 errors, 0 warnings, 0 section mismatches

--------------------------------------------------------------------------------
decstation_64_defconfig (mips, gcc-10) — PASS, 0 errors, 1 warning, 0 section mismatches

Warnings:
kernel/rcu/tasks.h:707:13: warning: ‘show_rcu_tasks_rude_gp_kthread’ defined but not used [-Wunused-function]

--------------------------------------------------------------------------------
decstation_defconfig (mips, gcc-10) — PASS, 0 errors, 1 warning, 0 section mismatches

Warnings:
kernel/rcu/tasks.h:707:13: warning: ‘show_rcu_tasks_rude_gp_kthread’ defined but not used [-Wunused-function]

--------------------------------------------------------------------------------
decstation_r4k_defconfig (mips, gcc-10) — PASS, 0 errors, 1 warning, 0 section mismatches

Warnings:
kernel/rcu/tasks.h:707:13: warning: ‘show_rcu_tasks_rude_gp_kthread’ defined but not used [-Wunused-function]

--------------------------------------------------------------------------------
defconfig (riscv, gcc-10) — PASS, 0 errors, 0 warnings, 0 section mismatches

--------------------------------------------------------------------------------
defconfig (arm64, gcc-10) — PASS, 0 errors, 0 warnings, 0 section mismatches

--------------------------------------------------------------------------------
dove_defconfig (arm, gcc-10) — PASS, 0 errors, 0 warnings, 0 section mismatches

--------------------------------------------------------------------------------
e55_defconfig (mips, gcc-10) — PASS, 0 errors, 0 warnings, 0 section mismatches

--------------------------------------------------------------------------------
ebsa110_defconfig (arm, gcc-10) — PASS, 0 errors, 0 warnings, 0 section mismatches

--------------------------------------------------------------------------------
efm32_defconfig (arm, gcc-10) — PASS, 0 errors, 0 warnings, 0 section mismatches

--------------------------------------------------------------------------------
ep93xx_defconfig (arm, gcc-10) — PASS, 0 errors, 0 warnings, 0 section mismatches

--------------------------------------------------------------------------------
eseries_pxa_defconfig (arm, gcc-10) — PASS, 0 errors, 0 warnings, 0 section mismatches

--------------------------------------------------------------------------------
exynos_defconfig (arm, gcc-10) — PASS, 0 errors, 0 warnings, 0 section mismatches

--------------------------------------------------------------------------------
ezx_defconfig (arm, gcc-10) — PASS, 0 errors, 0 warnings, 0 section mismatches

--------------------------------------------------------------------------------
footbridge_defconfig (arm, gcc-10) — PASS, 0 errors, 0 warnings, 0 section mismatches

--------------------------------------------------------------------------------
fuloong2e_defconfig (mips, gcc-10) — PASS, 0 errors, 0 warnings, 0 section mismatches

--------------------------------------------------------------------------------
gcw0_defconfig (mips, gcc-10) — PASS, 0 errors, 0 warnings, 0 section mismatches

--------------------------------------------------------------------------------
gemini_defconfig (arm, gcc-10) — PASS, 0 errors, 0 warnings, 0 section mismatches

--------------------------------------------------------------------------------
gpr_defconfig (mips, gcc-10) — PASS, 0 errors, 0 warnings, 0 section mismatches

--------------------------------------------------------------------------------
h3600_defconfig (arm, gcc-10) — PASS, 0 errors, 0 warnings, 0 section mismatches

--------------------------------------------------------------------------------
h5000_defconfig (arm, gcc-10) — PASS, 0 errors, 0 warnings, 0 section mismatches

--------------------------------------------------------------------------------
hackkit_defconfig (arm, gcc-10) — PASS, 0 errors, 0 warnings, 0 section mismatches

--------------------------------------------------------------------------------
haps_hs_defconfig (arc, gcc-10) — PASS, 0 errors, 0 warnings, 0 section mismatches

--------------------------------------------------------------------------------
haps_hs_smp_defconfig (arc, gcc-10) — PASS, 0 errors, 0 warnings, 0 section mismatches

--------------------------------------------------------------------------------
hisi_defconfig (arm, gcc-10) — PASS, 0 errors, 0 warnings, 0 section mismatches

--------------------------------------------------------------------------------
hsdk_defconfig (arc, gcc-10) — PASS, 0 errors, 0 warnings, 0 section mismatches

--------------------------------------------------------------------------------
i386_defconfig (i386, gcc-10) — PASS, 0 errors, 0 warnings, 0 section mismatches

--------------------------------------------------------------------------------
imote2_defconfig (arm, gcc-10) — PASS, 0 errors, 0 warnings, 0 section mismatches

--------------------------------------------------------------------------------
imx_v4_v5_defconfig (arm, gcc-10) — PASS, 0 errors, 0 warnings, 0 section mismatches

--------------------------------------------------------------------------------
imx_v6_v7_defconfig (arm, gcc-10) — PASS, 0 errors, 0 warnings, 0 section mismatches

--------------------------------------------------------------------------------
integrator_defconfig (arm, gcc-10) — PASS, 0 errors, 0 warnings, 0 section mismatches

--------------------------------------------------------------------------------
iop32x_defconfig (arm, gcc-10) — PASS, 0 errors, 0 warnings, 0 section mismatches

--------------------------------------------------------------------------------
ip22_defconfig (mips, gcc-10) — PASS, 0 errors, 0 warnings, 0 section mismatches

--------------------------------------------------------------------------------
ip27_defconfig (mips, gcc-10) — FAIL, 0 errors, 0 warnings, 0 section mismatches

--------------------------------------------------------------------------------
ip28_defconfig (mips, gcc-10) — FAIL, 0 errors, 0 warnings, 0 section mismatches

--------------------------------------------------------------------------------
ip32_defconfig (mips, gcc-10) — PASS, 0 errors, 0 warnings, 0 section mismatches

--------------------------------------------------------------------------------
ixp4xx_defconfig (arm, gcc-10) — PASS, 0 errors, 0 warnings, 0 section mismatches

--------------------------------------------------------------------------------
jazz_defconfig (mips, gcc-10) — PASS, 0 errors, 0 warnings, 0 section mismatches

--------------------------------------------------------------------------------
jmr3927_defconfig (mips, gcc-10) — PASS, 0 errors, 0 warnings, 0 section mismatches

--------------------------------------------------------------------------------
jornada720_defconfig (arm, gcc-10) — PASS, 0 errors, 0 warnings, 0 section mismatches

--------------------------------------------------------------------------------
keystone_defconfig (arm, gcc-10) — PASS, 0 errors, 0 warnings, 0 section mismatches

--------------------------------------------------------------------------------
lart_defconfig (arm, gcc-10) — PASS, 0 errors, 0 warnings, 0 section mismatches

--------------------------------------------------------------------------------
lemote2f_defconfig (mips, gcc-10) — PASS, 0 errors, 1 warning, 0 section mismatches

Warnings:
net/mac80211/mlme.c:4328:1: warning: the frame size of 1040 bytes is larger than 1024 bytes [-Wframe-larger-than=]

--------------------------------------------------------------------------------
loongson1b_defconfig (mips, gcc-10) — PASS, 0 errors, 0 warnings, 0 section mismatches

--------------------------------------------------------------------------------
loongson1c_defconfig (mips, gcc-10) — PASS, 0 errors, 0 warnings, 0 section mismatches

--------------------------------------------------------------------------------
loongson3_defconfig (mips, gcc-10) — PASS, 0 errors, 0 warnings, 0 section mismatches

--------------------------------------------------------------------------------
lpc18xx_defconfig (arm, gcc-10) — PASS, 0 errors, 0 warnings, 0 section mismatches

--------------------------------------------------------------------------------
lpc32xx_defconfig (arm, gcc-10) — PASS, 0 errors, 0 warnings, 0 section mismatches

--------------------------------------------------------------------------------
lpd270_defconfig (arm, gcc-10) — PASS, 0 errors, 0 warnings, 0 section mismatches

--------------------------------------------------------------------------------
lubbock_defconfig (arm, gcc-10) — PASS, 0 errors, 0 warnings, 0 section mismatches

--------------------------------------------------------------------------------
magician_defconfig (arm, gcc-10) — PASS, 0 errors, 0 warnings, 0 section mismatches

--------------------------------------------------------------------------------
mainstone_defconfig (arm, gcc-10) — PASS, 0 errors, 0 warnings, 0 section mismatches

--------------------------------------------------------------------------------
malta_defconfig (mips, gcc-10) — PASS, 0 errors, 0 warnings, 0 section mismatches

--------------------------------------------------------------------------------
malta_kvm_defconfig (mips, gcc-10) — PASS, 0 errors, 0 warnings, 0 section mismatches

--------------------------------------------------------------------------------
malta_kvm_guest_defconfig (mips, gcc-10) — PASS, 0 errors, 0 warnings, 0 section mismatches

--------------------------------------------------------------------------------
malta_qemu_32r6_defconfig (mips, gcc-10) — PASS, 0 errors, 0 warnings, 0 section mismatches

--------------------------------------------------------------------------------
maltaaprp_defconfig (mips, gcc-10) — PASS, 0 errors, 0 warnings, 0 section mismatches

--------------------------------------------------------------------------------
maltasmvp_defconfig (mips, gcc-10) — PASS, 0 errors, 0 warnings, 0 section mismatches

--------------------------------------------------------------------------------
maltasmvp_eva_defconfig (mips, gcc-10) — PASS, 0 errors, 0 warnings, 0 section mismatches

--------------------------------------------------------------------------------
maltaup_defconfig (mips, gcc-10) — PASS, 0 errors, 0 warnings, 0 section mismatches

--------------------------------------------------------------------------------
maltaup_xpa_defconfig (mips, gcc-10) — PASS, 0 errors, 0 warnings, 0 section mismatches

--------------------------------------------------------------------------------
milbeaut_m10v_defconfig (arm, gcc-10) — PASS, 0 errors, 0 warnings, 0 section mismatches

--------------------------------------------------------------------------------
mini2440_defconfig (arm, gcc-10) — PASS, 0 errors, 0 warnings, 0 section mismatches

--------------------------------------------------------------------------------
mmp2_defconfig (arm, gcc-10) — PASS, 0 errors, 0 warnings, 0 section mismatches

--------------------------------------------------------------------------------
moxart_defconfig (arm, gcc-10) — PASS, 0 errors, 0 warnings, 0 section mismatches

--------------------------------------------------------------------------------
mpc30x_defconfig (mips, gcc-10) — PASS, 0 errors, 0 warnings, 0 section mismatches

--------------------------------------------------------------------------------
mps2_defconfig (arm, gcc-10) — PASS, 0 errors, 0 warnings, 0 section mismatches

--------------------------------------------------------------------------------
mtx1_defconfig (mips, gcc-10) — PASS, 0 errors, 0 warnings, 0 section mismatches

--------------------------------------------------------------------------------
multi_v4t_defconfig (arm, gcc-10) — PASS, 0 errors, 0 warnings, 0 section mismatches

--------------------------------------------------------------------------------
multi_v5_defconfig (arm, gcc-10) — PASS, 0 errors, 0 warnings, 0 section mismatches

--------------------------------------------------------------------------------
multi_v7_defconfig (arm, gcc-10) — PASS, 0 errors, 0 warnings, 0 section mismatches

--------------------------------------------------------------------------------
mvebu_v5_defconfig (arm, gcc-10) — PASS, 0 errors, 0 warnings, 0 section mismatches

--------------------------------------------------------------------------------
mvebu_v7_defconfig (arm, gcc-10) — PASS, 0 errors, 0 warnings, 0 section mismatches

--------------------------------------------------------------------------------
mxs_defconfig (arm, gcc-10) — PASS, 0 errors, 0 warnings, 0 section mismatches

--------------------------------------------------------------------------------
neponset_defconfig (arm, gcc-10) — PASS, 0 errors, 0 warnings, 0 section mismatches

--------------------------------------------------------------------------------
netwinder_defconfig (arm, gcc-10) — PASS, 0 errors, 0 warnings, 0 section mismatches

--------------------------------------------------------------------------------
nhk8815_defconfig (arm, gcc-10) — PASS, 0 errors, 0 warnings, 0 section mismatches

--------------------------------------------------------------------------------
nlm_xlp_defconfig (mips, gcc-10) — PASS, 0 errors, 0 warnings, 0 section mismatches

--------------------------------------------------------------------------------
nlm_xlr_defconfig (mips, gcc-10) — PASS, 0 errors, 0 warnings, 0 section mismatches

--------------------------------------------------------------------------------
nommu_k210_defconfig (riscv, gcc-10) — PASS, 0 errors, 0 warnings, 0 section mismatches

--------------------------------------------------------------------------------
nsimosci_hs_defconfig (arc, gcc-10) — PASS, 0 errors, 0 warnings, 0 section mismatches

--------------------------------------------------------------------------------
nsimosci_hs_smp_defconfig (arc, gcc-10) — PASS, 0 errors, 0 warnings, 0 section mismatches

--------------------------------------------------------------------------------
omap1_defconfig (arm, gcc-10) — PASS, 0 errors, 0 warnings, 0 section mismatches

--------------------------------------------------------------------------------
omap2plus_defconfig (arm, gcc-10) — PASS, 0 errors, 0 warnings, 0 section mismatches

--------------------------------------------------------------------------------
omega2p_defconfig (mips, gcc-10) — PASS, 0 errors, 0 warnings, 0 section mismatches

--------------------------------------------------------------------------------
orion5x_defconfig (arm, gcc-10) — PASS, 0 errors, 0 warnings, 0 section mismatches

--------------------------------------------------------------------------------
oxnas_v6_defconfig (arm, gcc-10) — PASS, 0 errors, 0 warnings, 0 section mismatches

--------------------------------------------------------------------------------
palmz72_defconfig (arm, gcc-10) — PASS, 0 errors, 0 warnings, 0 section mismatches

--------------------------------------------------------------------------------
pcm027_defconfig (arm, gcc-10) — PASS, 0 errors, 0 warnings, 0 section mismatches

--------------------------------------------------------------------------------
pic32mzda_defconfig (mips, gcc-10) — PASS, 0 errors, 0 warnings, 0 section mismatches

--------------------------------------------------------------------------------
pistachio_defconfig (mips, gcc-10) — PASS, 0 errors, 0 warnings, 0 section mismatches

--------------------------------------------------------------------------------
pleb_defconfig (arm, gcc-10) — PASS, 0 errors, 0 warnings, 0 section mismatches

--------------------------------------------------------------------------------
prima2_defconfig (arm, gcc-10) — PASS, 0 errors, 0 warnings, 0 section mismatches

--------------------------------------------------------------------------------
pxa168_defconfig (arm, gcc-10) — PASS, 0 errors, 0 warnings, 0 section mismatches

--------------------------------------------------------------------------------
pxa255-idp_defconfig (arm, gcc-10) — PASS, 0 errors, 0 warnings, 0 section mismatches

--------------------------------------------------------------------------------
pxa3xx_defconfig (arm, gcc-10) — PASS, 0 errors, 0 warnings, 0 section mismatches

--------------------------------------------------------------------------------
pxa910_defconfig (arm, gcc-10) — PASS, 0 errors, 0 warnings, 0 section mismatches

--------------------------------------------------------------------------------
pxa_defconfig (arm, gcc-10) — PASS, 0 errors, 0 warnings, 0 section mismatches

--------------------------------------------------------------------------------
qcom_defconfig (arm, gcc-10) — PASS, 0 errors, 0 warnings, 0 section mismatches

--------------------------------------------------------------------------------
qi_lb60_defconfig (mips, gcc-10) — PASS, 0 errors, 0 warnings, 0 section mismatches

--------------------------------------------------------------------------------
rb532_defconfig (mips, gcc-10) — PASS, 0 errors, 0 warnings, 0 section mismatches

--------------------------------------------------------------------------------
rbtx49xx_defconfig (mips, gcc-10) — PASS, 0 errors, 0 warnings, 0 section mismatches

--------------------------------------------------------------------------------
realview_defconfig (arm, gcc-10) — PASS, 0 errors, 0 warnings, 0 section mismatches

--------------------------------------------------------------------------------
rm200_defconfig (mips, gcc-10) — PASS, 0 errors, 1 warning, 0 section mismatches

Warnings:
drivers/block/paride/bpck.c:32: warning: "PC" redefined

--------------------------------------------------------------------------------
rpc_defconfig (arm, gcc-10) — FAIL, 4 errors, 0 warnings, 0 section mismatches

Errors:
arm-linux-gnueabihf-gcc: error: unrecognized -march target: armv3m
arm-linux-gnueabihf-gcc: error: missing argument to ‘-march=’
arm-linux-gnueabihf-gcc: error: unrecognized -march target: armv3m
arm-linux-gnueabihf-gcc: error: missing argument to ‘-march=’

--------------------------------------------------------------------------------
rs90_defconfig (mips, gcc-10) — PASS, 0 errors, 0 warnings, 0 section mismatches

--------------------------------------------------------------------------------
rt305x_defconfig (mips, gcc-10) — PASS, 0 errors, 0 warnings, 0 section mismatches

--------------------------------------------------------------------------------
rv32_defconfig (riscv, gcc-10) — PASS, 0 errors, 4 warnings, 0 section mismatches

Warnings:
<stdin>:830:2: warning: #warning syscall fstat64 not implemented [-Wcpp]
<stdin>:1127:2: warning: #warning syscall fstatat64 not implemented [-Wcpp]
<stdin>:830:2: warning: #warning syscall fstat64 not implemented [-Wcpp]
<stdin>:1127:2: warning: #warning syscall fstatat64 not implemented [-Wcpp]

--------------------------------------------------------------------------------
s3c2410_defconfig (arm, gcc-10) — PASS, 0 errors, 0 warnings, 0 section mismatches

--------------------------------------------------------------------------------
s3c6400_defconfig (arm, gcc-10) — PASS, 0 errors, 0 warnings, 0 section mismatches

--------------------------------------------------------------------------------
s5pv210_defconfig (arm, gcc-10) — PASS, 0 errors, 0 warnings, 0 section mismatches

--------------------------------------------------------------------------------
sama5_defconfig (arm, gcc-10) — PASS, 0 errors, 0 warnings, 0 section mismatches

--------------------------------------------------------------------------------
sb1250_swarm_defconfig (mips, gcc-10) — PASS, 0 errors, 0 warnings, 0 section mismatches

--------------------------------------------------------------------------------
shannon_defconfig (arm, gcc-10) — PASS, 0 errors, 0 warnings, 0 section mismatches

--------------------------------------------------------------------------------
shmobile_defconfig (arm, gcc-10) — PASS, 0 errors, 0 warnings, 0 section mismatches

--------------------------------------------------------------------------------
simpad_defconfig (arm, gcc-10) — PASS, 0 errors, 0 warnings, 0 section mismatches

--------------------------------------------------------------------------------
socfpga_defconfig (arm, gcc-10) — PASS, 0 errors, 0 warnings, 0 section mismatches

--------------------------------------------------------------------------------
spear13xx_defconfig (arm, gcc-10) — PASS, 0 errors, 0 warnings, 0 section mismatches

--------------------------------------------------------------------------------
spear3xx_defconfig (arm, gcc-10) — PASS, 0 errors, 0 warnings, 0 section mismatches

--------------------------------------------------------------------------------
spear6xx_defconfig (arm, gcc-10) — PASS, 0 errors, 0 warnings, 0 section mismatches

--------------------------------------------------------------------------------
spitz_defconfig (arm, gcc-10) — PASS, 0 errors, 0 warnings, 0 section mismatches

--------------------------------------------------------------------------------
stm32_defconfig (arm, gcc-10) — PASS, 0 errors, 0 warnings, 0 section mismatches

--------------------------------------------------------------------------------
sunxi_defconfig (arm, gcc-10) — PASS, 0 errors, 0 warnings, 0 section mismatches

--------------------------------------------------------------------------------
tango4_defconfig (arm, gcc-10) — PASS, 0 errors, 0 warnings, 0 section mismatches

--------------------------------------------------------------------------------
tb0219_defconfig (mips, gcc-10) — PASS, 0 errors, 0 warnings, 0 section mismatches

--------------------------------------------------------------------------------
tb0226_defconfig (mips, gcc-10) — PASS, 0 errors, 0 warnings, 0 section mismatches

--------------------------------------------------------------------------------
tb0287_defconfig (mips, gcc-10) — PASS, 0 errors, 0 warnings, 0 section mismatches

--------------------------------------------------------------------------------
tct_hammer_defconfig (arm, gcc-10) — PASS, 0 errors, 0 warnings, 0 section mismatches

--------------------------------------------------------------------------------
tegra_defconfig (arm, gcc-10) — PASS, 0 errors, 0 warnings, 0 section mismatches

--------------------------------------------------------------------------------
tinyconfig (i386, gcc-10) — PASS, 0 errors, 0 warnings, 0 section mismatches

--------------------------------------------------------------------------------
tinyconfig (arc, gcc-10) — PASS, 0 errors, 0 warnings, 0 section mismatches

--------------------------------------------------------------------------------
tinyconfig (x86_64, gcc-10) — PASS, 0 errors, 0 warnings, 0 section mismatches

--------------------------------------------------------------------------------
trizeps4_defconfig (arm, gcc-10) — PASS, 0 errors, 0 warnings, 0 section mismatches

--------------------------------------------------------------------------------
u300_defconfig (arm, gcc-10) — PASS, 0 errors, 0 warnings, 0 section mismatches

--------------------------------------------------------------------------------
u8500_defconfig (arm, gcc-10) — PASS, 0 errors, 0 warnings, 0 section mismatches

--------------------------------------------------------------------------------
vdk_hs38_defconfig (arc, gcc-10) — PASS, 0 errors, 0 warnings, 0 section mismatches

--------------------------------------------------------------------------------
vdk_hs38_smp_defconfig (arc, gcc-10) — PASS, 0 errors, 0 warnings, 0 section mismatches

--------------------------------------------------------------------------------
versatile_defconfig (arm, gcc-10) — PASS, 0 errors, 0 warnings, 0 section mismatches

--------------------------------------------------------------------------------
vexpress_defconfig (arm, gcc-10) — PASS, 0 errors, 0 warnings, 0 section mismatches

--------------------------------------------------------------------------------
vf610m4_defconfig (arm, gcc-10) — PASS, 0 errors, 0 warnings, 0 section mismatches

--------------------------------------------------------------------------------
viper_defconfig (arm, gcc-10) — PASS, 0 errors, 0 warnings, 0 section mismatches

--------------------------------------------------------------------------------
vocore2_defconfig (mips, gcc-10) — PASS, 0 errors, 0 warnings, 0 section mismatches

--------------------------------------------------------------------------------
vt8500_v6_v7_defconfig (arm, gcc-10) — PASS, 0 errors, 0 warnings, 0 section mismatches

--------------------------------------------------------------------------------
workpad_defconfig (mips, gcc-10) — PASS, 0 errors, 0 warnings, 0 section mismatches

--------------------------------------------------------------------------------
x86_64_defconfig (x86_64, gcc-10) — PASS, 0 errors, 0 warnings, 0 section mismatches

--------------------------------------------------------------------------------
x86_64_defconfig+x86-chromebook+kselftest (x86_64, gcc-10) — PASS, 0 errors, 0 warnings, 0 section mismatches

--------------------------------------------------------------------------------
xcep_defconfig (arm, gcc-10) — PASS, 0 errors, 0 warnings, 0 section mismatches

--------------------------------------------------------------------------------
zeus_defconfig (arm, gcc-10) — PASS, 0 errors, 0 warnings, 0 section mismatches

--------------------------------------------------------------------------------
zx_defconfig (arm, gcc-10) — PASS, 0 errors, 0 warnings, 0 section mismatches

---
For more info write to <info@...>


[ANNOUNCE] Release v5.10.83-cip1 / First release of the CIP 5.10.y Linux kernel

Nobuhiro Iwamatsu
 

Hi all,

We release v5.10.83-cip1, which is the first release of the CIP 5.10.y Linux kernel !
This is based on v5.10.83 with some additional updates for the Renesas reference
boards.

You can get this release via the git tree at:

v5.10.83-cip1:
repository:
https://git.kernel.org/pub/scm/linux/kernel/git/cip/linux-cip.git
branch:
linux-5.10.y-cip
commit hash:
2332f07a324fd78d7c7436deeed23cd7db441ea7
added commits:
CIP: Add a number to the version suffix
dt-bindings: pci: rcar-pci-ep: Document missing interrupts property
dt-bindings: timer: renesas: tmu: Document r8a774e1 bindings
dt-bindings: PCI: rcar-pci-host: Document r8a774e1 bindings
memory: renesas-rpc-if: Make rpcif_enable/disable_rpm() as static inline
spi: spi-mem: Fix passing zero to 'PTR_ERR' warning
clk: renesas: r8a774a1: Add RPC clocks
clk: renesas: r8a774b1: Add RPC clocks
clk: renesas: r8a774c0: Add RPC clocks
pinctrl: renesas: r8a77990: Add QSPI[01] pins, groups and functions
pinctrl: renesas: r8a77990: Optimize pinctrl image size for R8A774C0
pinctrl: renesas: r8a77951: Add QSPI[01] pins, groups and functions
pinctrl: renesas: r8a77951: Optimize pinctrl image size for R8A774E1
pinctrl: renesas: r8a7796: Add QSPI[01] pins, groups and functions
pinctrl: renesas: r8a7796: Optimize pinctrl image size for R8A774A1
pinctrl: renesas: r8a77965: Add QSPI[01] pins, groups and functions
pinctrl: renesas: r8a77965: Optimize pinctrl image size for R8A774B1
Add configuration for gitlab-ci.

Best regards,
Nobuhiro
--
Nobuhiro Iwamatsu


Re: Planned maintenance for lab-cip-renesas: 4-5th Dec

Chris Paterson
 

Hello all,

From: cip-dev@... <cip-dev@...> On
Behalf Of Chris Paterson via lists.cip-project.org
Sent: 19 November 2021 12:33

Hello all,

Just a heads up, on the weekend of the 4/5th December the Renesas UK
office will be undergoing maintenance on its power infrastructure.
As such I will be taking lab-cip-renesas offline for the weekend starting from
Friday evening (UK time).
lab-cip-renesas is now offline until Monday morning (UK time).

Kind regards, Chris


Apologies for any inconvenience.

Kind regards, Chris


Re: cip/linux-4.19.y-cip baseline: 121 runs, 1 regressions (v4.19.217-cip62) #kernelci

Alice Ferrazzi
 

On Tue, Nov 30, 2021 at 5:41 PM Pavel Machek <pavel@...> wrote:

Hi!

platform | arch | lab | compiler | defconfig | regressions
---------+------+---------------+----------+---------------------+------------
panda | arm | lab-collabora | gcc-10 | omap2plus_defconfig | 1

Details: https://kernelci.org/test/plan/id/61a587a0ab3b0079bd18f6d7

Results: 5 PASS, 1 FAIL, 0 SKIP
Full config: omap2plus_defconfig
Compiler: gcc-10 (arm-linux-gnueabihf-gcc (Debian 10.2.1-6) 10.2.1 20210110)
Plain log: https://storage.kernelci.org//cip/linux-4.19.y-cip/v4.19.217-cip62/arm/omap2plus_defconfig/gcc-10/lab-collabora/baseline-panda.txt
HTML log:
https://storage.kernelci.org//cip/linux-4.19.y-cip/v4.19.217-cip62/arm/omap2plus_defconfig/gcc-10/lab-collabora/baseline-panda.html
So this has enough information to tell me that we have a kernel
problem there, good:

02:08:17.792502 <6>[ 18.847320] omap-mailbox 4a0f4000.mailbox: omap
mailbox rev 0x400
02:08:17.800596 <0>[ 18.857543] BUG: spinlock bad magic on CPU#0,
udevd/110
02:08:17.808843 <6>[ 18.857788] emif 4c000000.emif: emif_probe:
device configured with addr = (ptrval) and IRQ26
02:08:17.818753 <0>[ 18.863311] lock: emif_lock+0x0/0xffffecfc
[emif], .magic: dead4ead, .owner: <none>/-1, .owner_cpu: -1
02:08:17.825277 <4>[ 18.877502] CPU: 0 PID: 110 Comm: udevd Not
tainted 4.19.217-cip62 #1
02:08:17.831655 <4>[ 18.888275] Hardware name: Generic OMAP4
(Flattened Device Tree)
02:08:17.839660 <4>[ 18.894195] [<c01123bc>] (unwind_backtrace)
from [<c010cc28>] (show_stack+0x10/0x14)
02:08:17.847570 <4>[ 18.900482] [<c010cc28>] (show_stack) from
[<c0949dd4>] (dump_stack+0xe0/0x114)
02:08:17.855211 <4>[ 18.905761] [<c0949dd4>] (dump_stack) from
[<c01a9168>] (do_raw_spin_lock+0xbc/0x124)

Unfortunately, not enough information to debug the problem, I'm
afraid. Questions to start debugging this would be:

a) is the problem deterministic?
as the testing board are actually different is unclear.
The board and results can be seen here:
https://linux.kernelci.org/test/plan/id/61a587a0ab3b0079bd18f6d7/

the output log is here:
https://storage.kernelci.org/cip/linux-4.19.y-cip/v4.19.217-cip62/arm/omap2plus_defconfig/gcc-10/lab-collabora/baseline-panda.html
working board example log is here (works for 4.19.216-cip61 but using
a board on baylibre that could be different from the board on
collabora):
https://storage.kernelci.org/cip/linux-4.19.y-cip/v4.19.216-cip61/arm/omap2plus_defconfig/gcc-10/lab-baylibre/baseline-panda.html
looks like there is also a passed test on lab-baylibre for the panda
board with the same kernel:
https://storage.kernelci.org/cip/linux-4.19.y-cip/v4.19.217-cip62/arm/omap2plus_defconfig/gcc-10/lab-baylibre/baseline-panda.html

The job json file for replicate the job on a lava lab with panda board
can be found here:
https://lava.collabora.co.uk/scheduler/job/5113437/definition


b) is the problem present in v4.19.217 ?
here is the diff with 4.19.217 stable
https://www.diffchecker.com/JjmXiP7b

c) what were the last -stable and -cip kernels that worked?
if you click on the link on the details or the link here under:
https://linux.kernelci.org/test/case/id/61a587a0ab3b0079bd18f6dd/
is wrote:
New regression, last pass: v4.19.216-cip61

This is the one that passed:
https://linux.kernelci.org/test/plan/id/618f6407f33d0dd1e633595d/


- About bisecting the kernel.
We are currently in the process of activating CIP to the list of
automated bisected kernel
for getting more information on this and future problems.
The following issue is the request to KernelCI for adding CIP to the
automated bisected kernel list.
https://github.com/kernelci/kernelci-core/issues/922



Thanks,
Alice


--
======================================
Cybertrust Japan Co.,Ltd.
Alice Ferrazzi
alice.ferrazzi@...
======================================


CIP IRC weekly meeting today on libera.chat

Jan Kiszka
 

Hi all,

Kindly be reminded to attend the weekly meeting through IRC to discuss
technical topics with CIP kernel today.

Please note that we moved from Freenode to libera.chat. Our channel is
the following:

irc:irc.libera.chat:6667/cip

Furthermore note that the IRC meeting is now scheduled to UTC (GMT) 13:00:

https://www.timeanddate.com/worldclock/meetingdetails.html?year=2021&month=12&day=2&hour=13&min=0&sec=0&p1=224&p2=179&p3=136&p4=37&p5=241&p6=248

USWest USEast UK DE TW JP
06:00 09:00 13:00 14:00 21:00 22:00

Last meeting minutes:

https://irclogs.baserock.org/meetings/cip/2021/11/cip.2021-11-25-13.00.log.html

* Action item
1. Combine root filesystem with kselftest binary (finishings) - iwamatsu & alicef
2. Look into S3 artifact upload issues - patersonc
3. Perform initial comparison of KernelCI results 5.10 LTS vs. CIP - iwamatsu & alicef
4. Propose tweet on KernelCI-CIP collaboration progress - alicef
* Kernel maintenance updates
* Kernel testing
* AOB

Jan


New CVE entries in this week

Masami Ichikawa
 

Hi !

It's this week's CVE report.

This week reported 5 new CVEs.

* New CVEs

CVE-2021-4002: hugetlbfs: flush TLBs correctly after huge_pmd_unshare

It's already been fixed in the mainline. This bug was introduced since
3.6-rc1 so that all stable kernels will be affected by this
vulnerability.

CVSS v3 score is not provided

Fixed status

mainline: [a4a118f2eead1d6c49e00765de89878288d4b890]
stable/5.10: [40bc831ab5f630431010d1ff867390b07418a7ee]
stable/5.15: [556d59293a2a94863797a7a50890992aa5e8db16]
stable/5.4: [201340ca4eb748c52062c5e938826ddfbe313088]

CVE-2021-4028: use-after-free in RDMA listen()

CVSS v3 score is not provided

A local attacker can escalate privileges on the system by using this ufa bug.

Fixed status

Not fixed yet.

CVE-2021-4023: Improper IO-uring request cancellation operation allows
local users to cause a crash

According to the red hat bugzilla #2026484, it was fixed by commit
713b982 ("io-wq: fix cancellation on create-worker failure"). This bug
was introduced and fixed in 5.15-rc1. Before 5.15 kernels aren't
affected by this issue.

CVSS v3 score is not provided

Fixed status

mainline: [713b9825a4c47897f66ad69409581e7734a8728e]

CVE-2021-4032: kvm: mishandling of memory error during VCPU
construction can lead to DoS

CVSS v3 score is not provided

According to the suce bugzilla, it was fixed by f7d8a19("Revert "KVM:
x86: Open code necessary bits of kvm_lapic_set_base() at vCPU
RESET""). This bug was introduced in 5.15-rc1 and fixed in 5.15-rc7.
so before 5.15 kernels aren't affected by this issue.

Fixed status

mainline: [f7d8a19f9a056a05c5c509fa65af472a322abfee]

CVE-2021-4037: kernel: security regression for CVE-2018-13405

CVSS v3 score is not provided

According to the redhat bugzilla #2027239, patch for CVE-2018-13405
isn't sufficient when fs is XFS. It looks commit 01ea173("xfs: fix up
non-directory creation in SGID directories") is fixed commit. This
commit was merged in 5.12-rc1-dontuse. The mainline and stable/5.15
contains this patch but it haven't backported to other stable kernels.

Fixed status

Not yet.

* Updated CVEs

CVE-2020-27820: use-after-free in nouveau kernel module

5.10 and 5.15 were fixed this week.

Fixed status

mainline: [aff2299e0d81b26304ccc6a1ec0170e437f38efc,
abae9164a421bc4a41a3769f01ebcd1f9d955e0e,
f55aaf63bde0d0336c3823bb3713bd4a464abbcf]
stable/5.10: [c81c90fbf5775ed1b907230eaaa766fa0e1b7cfa,
9221aff33edb627ea52a51379862f46e63e7c0c9,
82de15ca6b5574fc0e2f54daa1de00b5b2dcf32f]
stable/5.15: [0b1a35d63995497a9186113c60a16e7ae59642c1,
4ee6807a1ad756ca151eaa4ac57c96ffbbac926f,
c3d06f6067bf4a6bb3e988251e1b718a295bb60b]


CVE-2021-4001: bpf: Fix toctou on read-only map''s constant scalar tracking

stable/5.15 was fixed this week.

Fixed status

mainline: [353050be4c19e102178ccc05988101887c25ae53]
stable/5.15: [a5d1d3522232b4af1f5dee02d381e6fa86be8e2d]

CVE-2021-3640:

Fixed status

mainline: [99c23da0eed4fd20cae8243f2b51e10e66aa0951,
e04480920d1eec9c061841399aa6f35b6f987d8b,
734bc5ff783115aa3164f4e9dd5967ae78e0a8ab,
49d8a5606428ca0962d09050a5af81461ff90fbb,
ba316be1b6a00db7126ed9a39f9bee434a508043,
27c24fda62b601d6f9ca5e992502578c4310876f]
stable/4.19: [c1c913f797f3d2441310182ad75b7bd855a327ff,
3719acc161d5c1ce09912cc1c9eddc2c5faa3c66,
3f7b869c1b44108a8cbf3e4a763ddac9df548d73,
728ff4b213cb6d66505e545ab820f3de5be1662a,
48669c81a65628ef234cbdd91b9395952c7c27fe]
stable/4.9: [9bbe312ebea40c9b586c2b07a0d0948ff418beca,
0e77f979a97d3d517fad0b51249ba6fb8ae2d365,
2240cbbd0d710c3b07ef5380fb6a1dfaedaf980b]
stable/5.10: [4dfba42604f08a505f1a1efc69ec5207ea6243de,
f2f856b65ac4b77049c76c0e89ecd3a177e9fcd1,
98d44b7be6f1bcfd4f824c5f8bc2b742f890879f,
c20d8c197454068da758a83e09d93683f520d681,
a1073aad497d0d071a71f61b721966a176d50c08 ]
stable/5.14: [2c2b295af72e4e30d17556375e100ae65ac0b896,
e04480920d1eec9c061841399aa6f35b6f987d8b,
9ebb5a7757073da64d10a12621d0cedaca3aa215,
db63399389bc3f6b0d146f8020ca243a6b700d9d,
b657bba82ff6a007d84fd076bd73b11131726a2b]
stable/5.15: [b990c219c4c9d4993ef65ea9db73d9497e70f697,
e04480920d1eec9c061841399aa6f35b6f987d8b,
734bc5ff783115aa3164f4e9dd5967ae78e0a8ab,
11080de0a75cba7e00c1060d60ea484615d7a3d3,
ba316be1b6a00db7126ed9a39f9bee434a508043,
27c24fda62b601d6f9ca5e992502578c4310876f]
stable/5.4: [d416020f1a9cc5f903ae66649b2c56d9ad5256ab,
ff29fe26ab8679bc13a3f0bf5b2911535a1cfc35,
0d563020b8a3b835afa5c902610de700808546ec,
6237a1685c28c93b6477db46fbf67b7f0a0139e6,
37d7ae2b0578f2373674a755402ee722e96edc08]

CVE-2021-33098: Improper input validation in the Intel(R) Ethernet
ixgbe driver for Linux before version 3.17.3 may allow an
authenticated user to potentially enable denial of service via local
access

The mainline and some of stable kernels are fixed in this week. This
bug was introduced since v3.8-rc1(872844d ("ixgbe: Enable jumbo frames
support w/ SR-IOV")) and fixed in 5.13-rc4. v4.4 contains commit
872844d but this commit requires ETH_MIN_MTU value which is introduced
by commit a52ad51 ("net: deprecate eth_change_mtu, remove usage")
which doesn't exist in 4.4 tree.

Fixed status

mainline: [63e39d29b3da02e901349f6cd71159818a4737a6]
stable/4.14: [5217f9cab7dd28e9c7626cd795e51da98ecb2af4]
stable/4.19: [938ffd6d2dd78fb83b9346c9b689e2a3a6fe7174]
stable/5.10: [3cfd11506ed032446358eedf7e31b4defd819d91]
stable/5.4: [cf20c704a26eb763daf6bfb10369a4f11fef2d9a]

Currently tracking CVEs

CVE-2021-31615: Unencrypted Bluetooth Low Energy baseband links in
Bluetooth Core Specifications 4.0 through 5.2

There is no fix information.

CVE-2020-26555: BR/EDR pin code pairing broken

No fix information

CVE-2020-26556: kernel: malleable commitment Bluetooth Mesh Provisioning

No fix information.

CVE-2020-26557: kernel: predictable Authvalue in Bluetooth Mesh
Provisioning Leads to MITM

No fix information.

CVE-2020-26559: kernel: Authvalue leak in Bluetooth Mesh Provisioning

No fix information.

CVE-2020-26560: kernel: impersonation attack in Bluetooth Mesh Provisioning

No fix information.

Regards,
--
Masami Ichikawa
Cybertrust Japan Co., Ltd.

Email :masami.ichikawa@...
:masami.ichikawa@...


cip/linux-4.19.y-cip-rt build: 195 builds: 6 failed, 189 passed, 2 errors, 32 warnings (v4.19.217-cip62-rt23) #kernelci

kernelci.org bot <bot@...>
 

cip/linux-4.19.y-cip-rt build: 195 builds: 6 failed, 189 passed, 2 errors, 32 warnings (v4.19.217-cip62-rt23)

Full Build Summary: https://kernelci.org/build/cip/branch/linux-4.19.y-cip-rt/kernel/v4.19.217-cip62-rt23/

Tree: cip
Branch: linux-4.19.y-cip-rt
Git Describe: v4.19.217-cip62-rt23
Git Commit: 59a33e49411615ef76ae3a6cb5e7ca0acaca5f1d
Git URL: https://git.kernel.org/pub/scm/linux/kernel/git/cip/linux-cip.git
Built: 6 unique architectures

Build Failures Detected:

arm:
rpc_defconfig: (gcc-10) FAIL

mips:
ip27_defconfig: (gcc-10) FAIL
ip28_defconfig: (gcc-10) FAIL

riscv:
allnoconfig: (gcc-10) FAIL
defconfig: (gcc-10) FAIL
tinyconfig: (gcc-10) FAIL

Errors and Warnings Detected:

arc:

arm:
omap1_defconfig (gcc-10): 1 warning
rpc_defconfig (gcc-10): 2 errors

i386:
allnoconfig (gcc-10): 2 warnings
i386_defconfig (gcc-10): 2 warnings
tinyconfig (gcc-10): 2 warnings

mips:
lemote2f_defconfig (gcc-10): 1 warning
loongson3_defconfig (gcc-10): 1 warning
malta_qemu_32r6_defconfig (gcc-10): 1 warning
mtx1_defconfig (gcc-10): 3 warnings
nlm_xlp_defconfig (gcc-10): 1 warning

riscv:
allnoconfig (gcc-10): 3 warnings
defconfig (gcc-10): 3 warnings
tinyconfig (gcc-10): 3 warnings

x86_64:
allnoconfig (gcc-10): 3 warnings
tinyconfig (gcc-10): 3 warnings
x86_64_defconfig (gcc-10): 3 warnings

Errors summary:

1 arm-linux-gnueabihf-gcc: error: unrecognized -march target: armv3
1 arm-linux-gnueabihf-gcc: error: missing argument to ‘-march=’

Warnings summary:

6 ld: warning: creating DT_TEXTREL in a PIE
3 ld: arch/x86/boot/compressed/head_64.o: warning: relocation in read-only section `.head.text'
3 ld: arch/x86/boot/compressed/head_32.o: warning: relocation in read-only section `.head.text'
3 include/linux/of_clk.h:13:31: warning: ‘struct of_device_id’ declared inside parameter list will not be visible outside of this definition or declaration
3 include/linux/of_clk.h:12:43: warning: ‘struct device_node’ declared inside parameter list will not be visible outside of this definition or declaration
3 include/linux/of_clk.h:11:45: warning: ‘struct device_node’ declared inside parameter list will not be visible outside of this definition or declaration
3 arch/x86/entry/entry_64.S:1756: Warning: no instruction mnemonic suffix given and no register operands; using default for `sysret'
2 sound/pci/echoaudio/echoaudio_dsp.c:647:9: warning: iteration 1073741824 invokes undefined behavior [-Waggressive-loop-optimizations]
2 net/core/rtnetlink.c:3191:1: warning: the frame size of 1328 bytes is larger than 1024 bytes [-Wframe-larger-than=]
1 {standard input}:132: Warning: macro instruction expanded into multiple instructions
1 sound/pci/echoaudio/echoaudio_dsp.c:658:9: warning: iteration 1073741824 invokes undefined behavior [-Waggressive-loop-optimizations]
1 net/core/rtnetlink.c:3191:1: warning: the frame size of 1344 bytes is larger than 1024 bytes [-Wframe-larger-than=]
1 drivers/gpio/gpio-omap.c:1233:34: warning: array ‘omap_gpio_match’ assumed to have one element

================================================================================

Detailed per-defconfig build reports:

--------------------------------------------------------------------------------
32r2el_defconfig (mips, gcc-10) — PASS, 0 errors, 0 warnings, 0 section mismatches

--------------------------------------------------------------------------------
acs5k_defconfig (arm, gcc-10) — PASS, 0 errors, 0 warnings, 0 section mismatches

--------------------------------------------------------------------------------
acs5k_tiny_defconfig (arm, gcc-10) — PASS, 0 errors, 0 warnings, 0 section mismatches

--------------------------------------------------------------------------------
allnoconfig (riscv, gcc-10) — FAIL, 0 errors, 3 warnings, 0 section mismatches

Warnings:
include/linux/of_clk.h:11:45: warning: ‘struct device_node’ declared inside parameter list will not be visible outside of this definition or declaration
include/linux/of_clk.h:12:43: warning: ‘struct device_node’ declared inside parameter list will not be visible outside of this definition or declaration
include/linux/of_clk.h:13:31: warning: ‘struct of_device_id’ declared inside parameter list will not be visible outside of this definition or declaration

--------------------------------------------------------------------------------
allnoconfig (arc, gcc-10) — PASS, 0 errors, 0 warnings, 0 section mismatches

--------------------------------------------------------------------------------
allnoconfig (i386, gcc-10) — PASS, 0 errors, 2 warnings, 0 section mismatches

Warnings:
ld: arch/x86/boot/compressed/head_32.o: warning: relocation in read-only section `.head.text'
ld: warning: creating DT_TEXTREL in a PIE

--------------------------------------------------------------------------------
allnoconfig (x86_64, gcc-10) — PASS, 0 errors, 3 warnings, 0 section mismatches

Warnings:
arch/x86/entry/entry_64.S:1756: Warning: no instruction mnemonic suffix given and no register operands; using default for `sysret'
ld: arch/x86/boot/compressed/head_64.o: warning: relocation in read-only section `.head.text'
ld: warning: creating DT_TEXTREL in a PIE

--------------------------------------------------------------------------------
am200epdkit_defconfig (arm, gcc-10) — PASS, 0 errors, 0 warnings, 0 section mismatches

--------------------------------------------------------------------------------
ar7_defconfig (mips, gcc-10) — PASS, 0 errors, 0 warnings, 0 section mismatches

--------------------------------------------------------------------------------
aspeed_g4_defconfig (arm, gcc-10) — PASS, 0 errors, 0 warnings, 0 section mismatches

--------------------------------------------------------------------------------
aspeed_g5_defconfig (arm, gcc-10) — PASS, 0 errors, 0 warnings, 0 section mismatches

--------------------------------------------------------------------------------
assabet_defconfig (arm, gcc-10) — PASS, 0 errors, 0 warnings, 0 section mismatches

--------------------------------------------------------------------------------
at91_dt_defconfig (arm, gcc-10) — PASS, 0 errors, 0 warnings, 0 section mismatches

--------------------------------------------------------------------------------
ath25_defconfig (mips, gcc-10) — PASS, 0 errors, 0 warnings, 0 section mismatches

--------------------------------------------------------------------------------
ath79_defconfig (mips, gcc-10) — PASS, 0 errors, 0 warnings, 0 section mismatches

--------------------------------------------------------------------------------
axm55xx_defconfig (arm, gcc-10) — PASS, 0 errors, 0 warnings, 0 section mismatches

--------------------------------------------------------------------------------
axs103_defconfig (arc, gcc-10) — PASS, 0 errors, 0 warnings, 0 section mismatches

--------------------------------------------------------------------------------
axs103_smp_defconfig (arc, gcc-10) — PASS, 0 errors, 0 warnings, 0 section mismatches

--------------------------------------------------------------------------------
badge4_defconfig (arm, gcc-10) — PASS, 0 errors, 0 warnings, 0 section mismatches

--------------------------------------------------------------------------------
bcm2835_defconfig (arm, gcc-10) — PASS, 0 errors, 0 warnings, 0 section mismatches

--------------------------------------------------------------------------------
bcm47xx_defconfig (mips, gcc-10) — PASS, 0 errors, 0 warnings, 0 section mismatches

--------------------------------------------------------------------------------
bcm63xx_defconfig (mips, gcc-10) — PASS, 0 errors, 0 warnings, 0 section mismatches

--------------------------------------------------------------------------------
bigsur_defconfig (mips, gcc-10) — PASS, 0 errors, 0 warnings, 0 section mismatches

--------------------------------------------------------------------------------
bmips_be_defconfig (mips, gcc-10) — PASS, 0 errors, 0 warnings, 0 section mismatches

--------------------------------------------------------------------------------
bmips_stb_defconfig (mips, gcc-10) — PASS, 0 errors, 0 warnings, 0 section mismatches

--------------------------------------------------------------------------------
capcella_defconfig (mips, gcc-10) — PASS, 0 errors, 0 warnings, 0 section mismatches

--------------------------------------------------------------------------------
cavium_octeon_defconfig (mips, gcc-10) — PASS, 0 errors, 0 warnings, 0 section mismatches

--------------------------------------------------------------------------------
cerfcube_defconfig (arm, gcc-10) — PASS, 0 errors, 0 warnings, 0 section mismatches

--------------------------------------------------------------------------------
ci20_defconfig (mips, gcc-10) — PASS, 0 errors, 0 warnings, 0 section mismatches

--------------------------------------------------------------------------------
cm_x2xx_defconfig (arm, gcc-10) — PASS, 0 errors, 0 warnings, 0 section mismatches

--------------------------------------------------------------------------------
cm_x300_defconfig (arm, gcc-10) — PASS, 0 errors, 0 warnings, 0 section mismatches

--------------------------------------------------------------------------------
cobalt_defconfig (mips, gcc-10) — PASS, 0 errors, 0 warnings, 0 section mismatches

--------------------------------------------------------------------------------
colibri_pxa270_defconfig (arm, gcc-10) — PASS, 0 errors, 0 warnings, 0 section mismatches

--------------------------------------------------------------------------------
colibri_pxa300_defconfig (arm, gcc-10) — PASS, 0 errors, 0 warnings, 0 section mismatches

--------------------------------------------------------------------------------
collie_defconfig (arm, gcc-10) — PASS, 0 errors, 0 warnings, 0 section mismatches

--------------------------------------------------------------------------------
corgi_defconfig (arm, gcc-10) — PASS, 0 errors, 0 warnings, 0 section mismatches

--------------------------------------------------------------------------------
davinci_all_defconfig (arm, gcc-10) — PASS, 0 errors, 0 warnings, 0 section mismatches

--------------------------------------------------------------------------------
db1xxx_defconfig (mips, gcc-10) — PASS, 0 errors, 0 warnings, 0 section mismatches

--------------------------------------------------------------------------------
decstation_defconfig (mips, gcc-10) — PASS, 0 errors, 0 warnings, 0 section mismatches

--------------------------------------------------------------------------------
defconfig (riscv, gcc-10) — FAIL, 0 errors, 3 warnings, 0 section mismatches

Warnings:
include/linux/of_clk.h:11:45: warning: ‘struct device_node’ declared inside parameter list will not be visible outside of this definition or declaration
include/linux/of_clk.h:12:43: warning: ‘struct device_node’ declared inside parameter list will not be visible outside of this definition or declaration
include/linux/of_clk.h:13:31: warning: ‘struct of_device_id’ declared inside parameter list will not be visible outside of this definition or declaration

--------------------------------------------------------------------------------
dove_defconfig (arm, gcc-10) — PASS, 0 errors, 0 warnings, 0 section mismatches

--------------------------------------------------------------------------------
e55_defconfig (mips, gcc-10) — PASS, 0 errors, 0 warnings, 0 section mismatches

--------------------------------------------------------------------------------
ebsa110_defconfig (arm, gcc-10) — PASS, 0 errors, 0 warnings, 0 section mismatches

--------------------------------------------------------------------------------
efm32_defconfig (arm, gcc-10) — PASS, 0 errors, 0 warnings, 0 section mismatches

--------------------------------------------------------------------------------
em_x270_defconfig (arm, gcc-10) — PASS, 0 errors, 0 warnings, 0 section mismatches

--------------------------------------------------------------------------------
ep93xx_defconfig (arm, gcc-10) — PASS, 0 errors, 0 warnings, 0 section mismatches

--------------------------------------------------------------------------------
eseries_pxa_defconfig (arm, gcc-10) — PASS, 0 errors, 0 warnings, 0 section mismatches

--------------------------------------------------------------------------------
exynos_defconfig (arm, gcc-10) — PASS, 0 errors, 0 warnings, 0 section mismatches

--------------------------------------------------------------------------------
ezx_defconfig (arm, gcc-10) — PASS, 0 errors, 0 warnings, 0 section mismatches

--------------------------------------------------------------------------------
footbridge_defconfig (arm, gcc-10) — PASS, 0 errors, 0 warnings, 0 section mismatches

--------------------------------------------------------------------------------
fuloong2e_defconfig (mips, gcc-10) — PASS, 0 errors, 0 warnings, 0 section mismatches

--------------------------------------------------------------------------------
gcw0_defconfig (mips, gcc-10) — PASS, 0 errors, 0 warnings, 0 section mismatches

--------------------------------------------------------------------------------
gemini_defconfig (arm, gcc-10) — PASS, 0 errors, 0 warnings, 0 section mismatches

--------------------------------------------------------------------------------
gpr_defconfig (mips, gcc-10) — PASS, 0 errors, 0 warnings, 0 section mismatches

--------------------------------------------------------------------------------
h3600_defconfig (arm, gcc-10) — PASS, 0 errors, 0 warnings, 0 section mismatches

--------------------------------------------------------------------------------
h5000_defconfig (arm, gcc-10) — PASS, 0 errors, 0 warnings, 0 section mismatches

--------------------------------------------------------------------------------
hackkit_defconfig (arm, gcc-10) — PASS, 0 errors, 0 warnings, 0 section mismatches

--------------------------------------------------------------------------------
haps_hs_defconfig (arc, gcc-10) — PASS, 0 errors, 0 warnings, 0 section mismatches

--------------------------------------------------------------------------------
haps_hs_smp_defconfig (arc, gcc-10) — PASS, 0 errors, 0 warnings, 0 section mismatches

--------------------------------------------------------------------------------
hisi_defconfig (arm, gcc-10) — PASS, 0 errors, 0 warnings, 0 section mismatches

--------------------------------------------------------------------------------
hsdk_defconfig (arc, gcc-10) — PASS, 0 errors, 0 warnings, 0 section mismatches

--------------------------------------------------------------------------------
i386_defconfig (i386, gcc-10) — PASS, 0 errors, 2 warnings, 0 section mismatches

Warnings:
ld: arch/x86/boot/compressed/head_32.o: warning: relocation in read-only section `.head.text'
ld: warning: creating DT_TEXTREL in a PIE

--------------------------------------------------------------------------------
imote2_defconfig (arm, gcc-10) — PASS, 0 errors, 0 warnings, 0 section mismatches

--------------------------------------------------------------------------------
imx_v4_v5_defconfig (arm, gcc-10) — PASS, 0 errors, 0 warnings, 0 section mismatches

--------------------------------------------------------------------------------
imx_v6_v7_defconfig (arm, gcc-10) — PASS, 0 errors, 0 warnings, 0 section mismatches

--------------------------------------------------------------------------------
integrator_defconfig (arm, gcc-10) — PASS, 0 errors, 0 warnings, 0 section mismatches

--------------------------------------------------------------------------------
iop13xx_defconfig (arm, gcc-10) — PASS, 0 errors, 0 warnings, 0 section mismatches

--------------------------------------------------------------------------------
iop32x_defconfig (arm, gcc-10) — PASS, 0 errors, 0 warnings, 0 section mismatches

--------------------------------------------------------------------------------
iop33x_defconfig (arm, gcc-10) — PASS, 0 errors, 0 warnings, 0 section mismatches

--------------------------------------------------------------------------------
ip22_defconfig (mips, gcc-10) — PASS, 0 errors, 0 warnings, 0 section mismatches

--------------------------------------------------------------------------------
ip27_defconfig (mips, gcc-10) — FAIL, 0 errors, 0 warnings, 0 section mismatches

--------------------------------------------------------------------------------
ip28_defconfig (mips, gcc-10) — FAIL, 0 errors, 0 warnings, 0 section mismatches

--------------------------------------------------------------------------------
ip32_defconfig (mips, gcc-10) — PASS, 0 errors, 0 warnings, 0 section mismatches

--------------------------------------------------------------------------------
ixp4xx_defconfig (arm, gcc-10) — PASS, 0 errors, 0 warnings, 0 section mismatches

--------------------------------------------------------------------------------
jazz_defconfig (mips, gcc-10) — PASS, 0 errors, 0 warnings, 0 section mismatches

--------------------------------------------------------------------------------
jmr3927_defconfig (mips, gcc-10) — PASS, 0 errors, 0 warnings, 0 section mismatches

--------------------------------------------------------------------------------
jornada720_defconfig (arm, gcc-10) — PASS, 0 errors, 0 warnings, 0 section mismatches

--------------------------------------------------------------------------------
keystone_defconfig (arm, gcc-10) — PASS, 0 errors, 0 warnings, 0 section mismatches

--------------------------------------------------------------------------------
ks8695_defconfig (arm, gcc-10) — PASS, 0 errors, 0 warnings, 0 section mismatches

--------------------------------------------------------------------------------
lart_defconfig (arm, gcc-10) — PASS, 0 errors, 0 warnings, 0 section mismatches

--------------------------------------------------------------------------------
lasat_defconfig (mips, gcc-10) — PASS, 0 errors, 0 warnings, 0 section mismatches

--------------------------------------------------------------------------------
lemote2f_defconfig (mips, gcc-10) — PASS, 0 errors, 1 warning, 0 section mismatches

Warnings:
net/core/rtnetlink.c:3191:1: warning: the frame size of 1328 bytes is larger than 1024 bytes [-Wframe-larger-than=]

--------------------------------------------------------------------------------
loongson1b_defconfig (mips, gcc-10) — PASS, 0 errors, 0 warnings, 0 section mismatches

--------------------------------------------------------------------------------
loongson1c_defconfig (mips, gcc-10) — PASS, 0 errors, 0 warnings, 0 section mismatches

--------------------------------------------------------------------------------
loongson3_defconfig (mips, gcc-10) — PASS, 0 errors, 1 warning, 0 section mismatches

Warnings:
net/core/rtnetlink.c:3191:1: warning: the frame size of 1328 bytes is larger than 1024 bytes [-Wframe-larger-than=]

--------------------------------------------------------------------------------
lpc18xx_defconfig (arm, gcc-10) — PASS, 0 errors, 0 warnings, 0 section mismatches

--------------------------------------------------------------------------------
lpc32xx_defconfig (arm, gcc-10) — PASS, 0 errors, 0 warnings, 0 section mismatches

--------------------------------------------------------------------------------
lpd270_defconfig (arm, gcc-10) — PASS, 0 errors, 0 warnings, 0 section mismatches

--------------------------------------------------------------------------------
lubbock_defconfig (arm, gcc-10) — PASS, 0 errors, 0 warnings, 0 section mismatches

--------------------------------------------------------------------------------
magician_defconfig (arm, gcc-10) — PASS, 0 errors, 0 warnings, 0 section mismatches

--------------------------------------------------------------------------------
mainstone_defconfig (arm, gcc-10) — PASS, 0 errors, 0 warnings, 0 section mismatches

--------------------------------------------------------------------------------
malta_defconfig (mips, gcc-10) — PASS, 0 errors, 0 warnings, 0 section mismatches

--------------------------------------------------------------------------------
malta_kvm_defconfig (mips, gcc-10) — PASS, 0 errors, 0 warnings, 0 section mismatches

--------------------------------------------------------------------------------
malta_kvm_guest_defconfig (mips, gcc-10) — PASS, 0 errors, 0 warnings, 0 section mismatches

--------------------------------------------------------------------------------
malta_qemu_32r6_defconfig (mips, gcc-10) — PASS, 0 errors, 1 warning, 0 section mismatches

Warnings:
{standard input}:132: Warning: macro instruction expanded into multiple instructions

--------------------------------------------------------------------------------
maltaaprp_defconfig (mips, gcc-10) — PASS, 0 errors, 0 warnings, 0 section mismatches

--------------------------------------------------------------------------------
maltasmvp_defconfig (mips, gcc-10) — PASS, 0 errors, 0 warnings, 0 section mismatches

--------------------------------------------------------------------------------
maltasmvp_eva_defconfig (mips, gcc-10) — PASS, 0 errors, 0 warnings, 0 section mismatches

--------------------------------------------------------------------------------
maltaup_defconfig (mips, gcc-10) — PASS, 0 errors, 0 warnings, 0 section mismatches

--------------------------------------------------------------------------------
maltaup_xpa_defconfig (mips, gcc-10) — PASS, 0 errors, 0 warnings, 0 section mismatches

--------------------------------------------------------------------------------
markeins_defconfig (mips, gcc-10) — PASS, 0 errors, 0 warnings, 0 section mismatches

--------------------------------------------------------------------------------
mini2440_defconfig (arm, gcc-10) — PASS, 0 errors, 0 warnings, 0 section mismatches

--------------------------------------------------------------------------------
mips_paravirt_defconfig (mips, gcc-10) — PASS, 0 errors, 0 warnings, 0 section mismatches

--------------------------------------------------------------------------------
mmp2_defconfig (arm, gcc-10) — PASS, 0 errors, 0 warnings, 0 section mismatches

--------------------------------------------------------------------------------
moxart_defconfig (arm, gcc-10) — PASS, 0 errors, 0 warnings, 0 section mismatches

--------------------------------------------------------------------------------
mpc30x_defconfig (mips, gcc-10) — PASS, 0 errors, 0 warnings, 0 section mismatches

--------------------------------------------------------------------------------
mps2_defconfig (arm, gcc-10) — PASS, 0 errors, 0 warnings, 0 section mismatches

--------------------------------------------------------------------------------
msp71xx_defconfig (mips, gcc-10) — PASS, 0 errors, 0 warnings, 0 section mismatches

--------------------------------------------------------------------------------
mtx1_defconfig (mips, gcc-10) — PASS, 0 errors, 3 warnings, 0 section mismatches

Warnings:
sound/pci/echoaudio/echoaudio_dsp.c:647:9: warning: iteration 1073741824 invokes undefined behavior [-Waggressive-loop-optimizations]
sound/pci/echoaudio/echoaudio_dsp.c:658:9: warning: iteration 1073741824 invokes undefined behavior [-Waggressive-loop-optimizations]
sound/pci/echoaudio/echoaudio_dsp.c:647:9: warning: iteration 1073741824 invokes undefined behavior [-Waggressive-loop-optimizations]

--------------------------------------------------------------------------------
multi_v4t_defconfig (arm, gcc-10) — PASS, 0 errors, 0 warnings, 0 section mismatches

--------------------------------------------------------------------------------
multi_v5_defconfig (arm, gcc-10) — PASS, 0 errors, 0 warnings, 0 section mismatches

--------------------------------------------------------------------------------
multi_v7_defconfig (arm, gcc-10) — PASS, 0 errors, 0 warnings, 0 section mismatches

--------------------------------------------------------------------------------
mvebu_v5_defconfig (arm, gcc-10) — PASS, 0 errors, 0 warnings, 0 section mismatches

--------------------------------------------------------------------------------
mvebu_v7_defconfig (arm, gcc-10) — PASS, 0 errors, 0 warnings, 0 section mismatches

--------------------------------------------------------------------------------
mxs_defconfig (arm, gcc-10) — PASS, 0 errors, 0 warnings, 0 section mismatches

--------------------------------------------------------------------------------
neponset_defconfig (arm, gcc-10) — PASS, 0 errors, 0 warnings, 0 section mismatches

--------------------------------------------------------------------------------
netwinder_defconfig (arm, gcc-10) — PASS, 0 errors, 0 warnings, 0 section mismatches

--------------------------------------------------------------------------------
netx_defconfig (arm, gcc-10) — PASS, 0 errors, 0 warnings, 0 section mismatches

--------------------------------------------------------------------------------
nhk8815_defconfig (arm, gcc-10) — PASS, 0 errors, 0 warnings, 0 section mismatches

--------------------------------------------------------------------------------
nlm_xlp_defconfig (mips, gcc-10) — PASS, 0 errors, 1 warning, 0 section mismatches

Warnings:
net/core/rtnetlink.c:3191:1: warning: the frame size of 1344 bytes is larger than 1024 bytes [-Wframe-larger-than=]

--------------------------------------------------------------------------------
nlm_xlr_defconfig (mips, gcc-10) — PASS, 0 errors, 0 warnings, 0 section mismatches

--------------------------------------------------------------------------------
nsim_hs_defconfig (arc, gcc-10) — PASS, 0 errors, 0 warnings, 0 section mismatches

--------------------------------------------------------------------------------
nsim_hs_smp_defconfig (arc, gcc-10) — PASS, 0 errors, 0 warnings, 0 section mismatches

--------------------------------------------------------------------------------
nsimosci_hs_defconfig (arc, gcc-10) — PASS, 0 errors, 0 warnings, 0 section mismatches

--------------------------------------------------------------------------------
nsimosci_hs_smp_defconfig (arc, gcc-10) — PASS, 0 errors, 0 warnings, 0 section mismatches

--------------------------------------------------------------------------------
nuc910_defconfig (arm, gcc-10) — PASS, 0 errors, 0 warnings, 0 section mismatches

--------------------------------------------------------------------------------
nuc950_defconfig (arm, gcc-10) — PASS, 0 errors, 0 warnings, 0 section mismatches

--------------------------------------------------------------------------------
nuc960_defconfig (arm, gcc-10) — PASS, 0 errors, 0 warnings, 0 section mismatches

--------------------------------------------------------------------------------
omap1_defconfig (arm, gcc-10) — PASS, 0 errors, 1 warning, 0 section mismatches

Warnings:
drivers/gpio/gpio-omap.c:1233:34: warning: array ‘omap_gpio_match’ assumed to have one element

--------------------------------------------------------------------------------
omap2plus_defconfig (arm, gcc-10) — PASS, 0 errors, 0 warnings, 0 section mismatches

--------------------------------------------------------------------------------
omega2p_defconfig (mips, gcc-10) — PASS, 0 errors, 0 warnings, 0 section mismatches

--------------------------------------------------------------------------------
orion5x_defconfig (arm, gcc-10) — PASS, 0 errors, 0 warnings, 0 section mismatches

--------------------------------------------------------------------------------
oxnas_v6_defconfig (arm, gcc-10) — PASS, 0 errors, 0 warnings, 0 section mismatches

--------------------------------------------------------------------------------
palmz72_defconfig (arm, gcc-10) — PASS, 0 errors, 0 warnings, 0 section mismatches

--------------------------------------------------------------------------------
pcm027_defconfig (arm, gcc-10) — PASS, 0 errors, 0 warnings, 0 section mismatches

--------------------------------------------------------------------------------
pic32mzda_defconfig (mips, gcc-10) — PASS, 0 errors, 0 warnings, 0 section mismatches

--------------------------------------------------------------------------------
pistachio_defconfig (mips, gcc-10) — PASS, 0 errors, 0 warnings, 0 section mismatches

--------------------------------------------------------------------------------
pleb_defconfig (arm, gcc-10) — PASS, 0 errors, 0 warnings, 0 section mismatches

--------------------------------------------------------------------------------
pnx8335_stb225_defconfig (mips, gcc-10) — PASS, 0 errors, 0 warnings, 0 section mismatches

--------------------------------------------------------------------------------
prima2_defconfig (arm, gcc-10) — PASS, 0 errors, 0 warnings, 0 section mismatches

--------------------------------------------------------------------------------
pxa168_defconfig (arm, gcc-10) — PASS, 0 errors, 0 warnings, 0 section mismatches

--------------------------------------------------------------------------------
pxa255-idp_defconfig (arm, gcc-10) — PASS, 0 errors, 0 warnings, 0 section mismatches

--------------------------------------------------------------------------------
pxa3xx_defconfig (arm, gcc-10) — PASS, 0 errors, 0 warnings, 0 section mismatches

--------------------------------------------------------------------------------
pxa910_defconfig (arm, gcc-10) — PASS, 0 errors, 0 warnings, 0 section mismatches

--------------------------------------------------------------------------------
pxa_defconfig (arm, gcc-10) — PASS, 0 errors, 0 warnings, 0 section mismatches

--------------------------------------------------------------------------------
qcom_defconfig (arm, gcc-10) — PASS, 0 errors, 0 warnings, 0 section mismatches

--------------------------------------------------------------------------------
qi_lb60_defconfig (mips, gcc-10) — PASS, 0 errors, 0 warnings, 0 section mismatches

--------------------------------------------------------------------------------
raumfeld_defconfig (arm, gcc-10) — PASS, 0 errors, 0 warnings, 0 section mismatches

--------------------------------------------------------------------------------
rb532_defconfig (mips, gcc-10) — PASS, 0 errors, 0 warnings, 0 section mismatches

--------------------------------------------------------------------------------
rbtx49xx_defconfig (mips, gcc-10) — PASS, 0 errors, 0 warnings, 0 section mismatches

--------------------------------------------------------------------------------
realview_defconfig (arm, gcc-10) — PASS, 0 errors, 0 warnings, 0 section mismatches

--------------------------------------------------------------------------------
rm200_defconfig (mips, gcc-10) — PASS, 0 errors, 0 warnings, 0 section mismatches

--------------------------------------------------------------------------------
rpc_defconfig (arm, gcc-10) — FAIL, 2 errors, 0 warnings, 0 section mismatches

Errors:
arm-linux-gnueabihf-gcc: error: unrecognized -march target: armv3
arm-linux-gnueabihf-gcc: error: missing argument to ‘-march=’

--------------------------------------------------------------------------------
rt305x_defconfig (mips, gcc-10) — PASS, 0 errors, 0 warnings, 0 section mismatches

--------------------------------------------------------------------------------
s3c2410_defconfig (arm, gcc-10) — PASS, 0 errors, 0 warnings, 0 section mismatches

--------------------------------------------------------------------------------
s3c6400_defconfig (arm, gcc-10) — PASS, 0 errors, 0 warnings, 0 section mismatches

--------------------------------------------------------------------------------
s5pv210_defconfig (arm, gcc-10) — PASS, 0 errors, 0 warnings, 0 section mismatches

--------------------------------------------------------------------------------
sama5_defconfig (arm, gcc-10) — PASS, 0 errors, 0 warnings, 0 section mismatches

--------------------------------------------------------------------------------
sb1250_swarm_defconfig (mips, gcc-10) — PASS, 0 errors, 0 warnings, 0 section mismatches

--------------------------------------------------------------------------------
shannon_defconfig (arm, gcc-10) — PASS, 0 errors, 0 warnings, 0 section mismatches

--------------------------------------------------------------------------------
shmobile_defconfig (arm, gcc-10) — PASS, 0 errors, 0 warnings, 0 section mismatches

--------------------------------------------------------------------------------
simpad_defconfig (arm, gcc-10) — PASS, 0 errors, 0 warnings, 0 section mismatches

--------------------------------------------------------------------------------
socfpga_defconfig (arm, gcc-10) — PASS, 0 errors, 0 warnings, 0 section mismatches

--------------------------------------------------------------------------------
spear13xx_defconfig (arm, gcc-10) — PASS, 0 errors, 0 warnings, 0 section mismatches

--------------------------------------------------------------------------------
spear3xx_defconfig (arm, gcc-10) — PASS, 0 errors, 0 warnings, 0 section mismatches

--------------------------------------------------------------------------------
spear6xx_defconfig (arm, gcc-10) — PASS, 0 errors, 0 warnings, 0 section mismatches

--------------------------------------------------------------------------------
spitz_defconfig (arm, gcc-10) — PASS, 0 errors, 0 warnings, 0 section mismatches

--------------------------------------------------------------------------------
stm32_defconfig (arm, gcc-10) — PASS, 0 errors, 0 warnings, 0 section mismatches

--------------------------------------------------------------------------------
sunxi_defconfig (arm, gcc-10) — PASS, 0 errors, 0 warnings, 0 section mismatches

--------------------------------------------------------------------------------
tango4_defconfig (arm, gcc-10) — PASS, 0 errors, 0 warnings, 0 section mismatches

--------------------------------------------------------------------------------
tb0219_defconfig (mips, gcc-10) — PASS, 0 errors, 0 warnings, 0 section mismatches

--------------------------------------------------------------------------------
tb0226_defconfig (mips, gcc-10) — PASS, 0 errors, 0 warnings, 0 section mismatches

--------------------------------------------------------------------------------
tb0287_defconfig (mips, gcc-10) — PASS, 0 errors, 0 warnings, 0 section mismatches

--------------------------------------------------------------------------------
tct_hammer_defconfig (arm, gcc-10) — PASS, 0 errors, 0 warnings, 0 section mismatches

--------------------------------------------------------------------------------
tegra_defconfig (arm, gcc-10) — PASS, 0 errors, 0 warnings, 0 section mismatches

--------------------------------------------------------------------------------
tinyconfig (i386, gcc-10) — PASS, 0 errors, 2 warnings, 0 section mismatches

Warnings:
ld: arch/x86/boot/compressed/head_32.o: warning: relocation in read-only section `.head.text'
ld: warning: creating DT_TEXTREL in a PIE

--------------------------------------------------------------------------------
tinyconfig (riscv, gcc-10) — FAIL, 0 errors, 3 warnings, 0 section mismatches

Warnings:
include/linux/of_clk.h:11:45: warning: ‘struct device_node’ declared inside parameter list will not be visible outside of this definition or declaration
include/linux/of_clk.h:12:43: warning: ‘struct device_node’ declared inside parameter list will not be visible outside of this definition or declaration
include/linux/of_clk.h:13:31: warning: ‘struct of_device_id’ declared inside parameter list will not be visible outside of this definition or declaration

--------------------------------------------------------------------------------
tinyconfig (x86_64, gcc-10) — PASS, 0 errors, 3 warnings, 0 section mismatches

Warnings:
arch/x86/entry/entry_64.S:1756: Warning: no instruction mnemonic suffix given and no register operands; using default for `sysret'
ld: arch/x86/boot/compressed/head_64.o: warning: relocation in read-only section `.head.text'
ld: warning: creating DT_TEXTREL in a PIE

--------------------------------------------------------------------------------
tinyconfig (arc, gcc-10) — PASS, 0 errors, 0 warnings, 0 section mismatches

--------------------------------------------------------------------------------
trizeps4_defconfig (arm, gcc-10) — PASS, 0 errors, 0 warnings, 0 section mismatches

--------------------------------------------------------------------------------
u300_defconfig (arm, gcc-10) — PASS, 0 errors, 0 warnings, 0 section mismatches

--------------------------------------------------------------------------------
u8500_defconfig (arm, gcc-10) — PASS, 0 errors, 0 warnings, 0 section mismatches

--------------------------------------------------------------------------------
vdk_hs38_defconfig (arc, gcc-10) — PASS, 0 errors, 0 warnings, 0 section mismatches

--------------------------------------------------------------------------------
vdk_hs38_smp_defconfig (arc, gcc-10) — PASS, 0 errors, 0 warnings, 0 section mismatches

--------------------------------------------------------------------------------
versatile_defconfig (arm, gcc-10) — PASS, 0 errors, 0 warnings, 0 section mismatches

--------------------------------------------------------------------------------
vexpress_defconfig (arm, gcc-10) — PASS, 0 errors, 0 warnings, 0 section mismatches

--------------------------------------------------------------------------------
vf610m4_defconfig (arm, gcc-10) — PASS, 0 errors, 0 warnings, 0 section mismatches

--------------------------------------------------------------------------------
viper_defconfig (arm, gcc-10) — PASS, 0 errors, 0 warnings, 0 section mismatches

--------------------------------------------------------------------------------
vocore2_defconfig (mips, gcc-10) — PASS, 0 errors, 0 warnings, 0 section mismatches

--------------------------------------------------------------------------------
vt8500_v6_v7_defconfig (arm, gcc-10) — PASS, 0 errors, 0 warnings, 0 section mismatches

--------------------------------------------------------------------------------
workpad_defconfig (mips, gcc-10) — PASS, 0 errors, 0 warnings, 0 section mismatches

--------------------------------------------------------------------------------
x86_64_defconfig (x86_64, gcc-10) — PASS, 0 errors, 3 warnings, 0 section mismatches

Warnings:
arch/x86/entry/entry_64.S:1756: Warning: no instruction mnemonic suffix given and no register operands; using default for `sysret'
ld: arch/x86/boot/compressed/head_64.o: warning: relocation in read-only section `.head.text'
ld: warning: creating DT_TEXTREL in a PIE

--------------------------------------------------------------------------------
xcep_defconfig (arm, gcc-10) — PASS, 0 errors, 0 warnings, 0 section mismatches

--------------------------------------------------------------------------------
zeus_defconfig (arm, gcc-10) — PASS, 0 errors, 0 warnings, 0 section mismatches

--------------------------------------------------------------------------------
zx_defconfig (arm, gcc-10) — PASS, 0 errors, 0 warnings, 0 section mismatches

---
For more info write to <info@...>


[isar-cip-core][PATCH v2] linux-cip: Update to latest releases

Jan Kiszka
 

From: Jan Kiszka <jan.kiszka@...>

Signed-off-by: Jan Kiszka <jan.kiszka@...>
---

Changes in v2:
- include fresh 4.19-rt release

...19.206-cip57-rt22.bb => linux-cip-rt_4.19.217-cip62-rt23.bb} | 2 +-
...4.4.277-cip60-rt35.bb => linux-cip-rt_4.4.285-cip63-rt36.bb} | 2 +-
...{linux-cip_4.19.206-cip57.bb => linux-cip_4.19.217-cip62.bb} | 2 +-
.../{linux-cip_4.4.283-cip62.bb => linux-cip_4.4.291-cip65.bb} | 2 +-
4 files changed, 4 insertions(+), 4 deletions(-)
rename recipes-kernel/linux/{linux-cip-rt_4.19.206-cip57-rt22.bb => linux-cip-rt_4.19.217-cip62-rt23.bb} (68%)
rename recipes-kernel/linux/{linux-cip-rt_4.4.277-cip60-rt35.bb => linux-cip-rt_4.4.285-cip63-rt36.bb} (68%)
rename recipes-kernel/linux/{linux-cip_4.19.206-cip57.bb => linux-cip_4.19.217-cip62.bb} (68%)
rename recipes-kernel/linux/{linux-cip_4.4.283-cip62.bb => linux-cip_4.4.291-cip65.bb} (68%)

diff --git a/recipes-kernel/linux/linux-cip-rt_4.19.206-cip57-rt22.bb b/recipes-kernel/linux/linux-cip-rt_4.19.217-cip62-rt23.bb
similarity index 68%
rename from recipes-kernel/linux/linux-cip-rt_4.19.206-cip57-rt22.bb
rename to recipes-kernel/linux/linux-cip-rt_4.19.217-cip62-rt23.bb
index e6af865..a3a9c43 100644
--- a/recipes-kernel/linux/linux-cip-rt_4.19.206-cip57-rt22.bb
+++ b/recipes-kernel/linux/linux-cip-rt_4.19.217-cip62-rt23.bb
@@ -11,4 +11,4 @@

require linux-cip-rt-common.inc

-SRC_URI[sha256sum] = "586ff1af1c0ee794794db4af40544391d8b2dde88417136e32e6105c6f9d77b3"
+SRC_URI[sha256sum] = "f7584d79132ad99ed5b7ce7430c79a08cb9b81ad40b5982464f95859a00ceb6f"
diff --git a/recipes-kernel/linux/linux-cip-rt_4.4.277-cip60-rt35.bb b/recipes-kernel/linux/linux-cip-rt_4.4.285-cip63-rt36.bb
similarity index 68%
rename from recipes-kernel/linux/linux-cip-rt_4.4.277-cip60-rt35.bb
rename to recipes-kernel/linux/linux-cip-rt_4.4.285-cip63-rt36.bb
index 0a2de66..c051583 100644
--- a/recipes-kernel/linux/linux-cip-rt_4.4.277-cip60-rt35.bb
+++ b/recipes-kernel/linux/linux-cip-rt_4.4.285-cip63-rt36.bb
@@ -11,4 +11,4 @@

require linux-cip-rt-common.inc

-SRC_URI[sha256sum] = "ea4a5de21e6ad82001685bddcfaacd2eaaf524fea61dd774c2895c7adb3b934e"
+SRC_URI[sha256sum] = "c2fe6bcf44fc7a8ee9785adc4dc41d07c50d803883add859648cbbb0461854fa"
diff --git a/recipes-kernel/linux/linux-cip_4.19.206-cip57.bb b/recipes-kernel/linux/linux-cip_4.19.217-cip62.bb
similarity index 68%
rename from recipes-kernel/linux/linux-cip_4.19.206-cip57.bb
rename to recipes-kernel/linux/linux-cip_4.19.217-cip62.bb
index f23ab83..1a60571 100644
--- a/recipes-kernel/linux/linux-cip_4.19.206-cip57.bb
+++ b/recipes-kernel/linux/linux-cip_4.19.217-cip62.bb
@@ -11,4 +11,4 @@

require linux-cip-common.inc

-SRC_URI[sha256sum] = "a88ab84c6cf072743890a11e2f782540ecf1081167f3a2f34311060f99eda44d"
+SRC_URI[sha256sum] = "00b22f2e7b3d4f5787ca92f2e182211ac2c1391c09435174c2b4670b2837b23c"
diff --git a/recipes-kernel/linux/linux-cip_4.4.283-cip62.bb b/recipes-kernel/linux/linux-cip_4.4.291-cip65.bb
similarity index 68%
rename from recipes-kernel/linux/linux-cip_4.4.283-cip62.bb
rename to recipes-kernel/linux/linux-cip_4.4.291-cip65.bb
index bcb754d..e45c57c 100644
--- a/recipes-kernel/linux/linux-cip_4.4.283-cip62.bb
+++ b/recipes-kernel/linux/linux-cip_4.4.291-cip65.bb
@@ -11,4 +11,4 @@

require linux-cip-common.inc

-SRC_URI[sha256sum] = "842c443e6adc43cebe73acb071a59a8c410cc6cd83488502f297ee1a995dbae6"
+SRC_URI[sha256sum] = "9ed7782c067793e684691e99388608ff746f04121cc35dbbbfc2fa5ed6f9e88e"
--
2.31.1


[ANNOUNCE] v4.19.217-cip62-rt23 (-rt95)

Pavel Machek
 

Hi!

New realtime trees should be available at kernel.org.

Trees are available at

https://git.kernel.org/pub/scm/linux/kernel/git/cip/linux-cip.git/log/?h=linux-4.19.y-cip-rt
https://git.kernel.org/pub/scm/linux/kernel/git/cip/linux-cip.git/log/?h=linux-4.19.y-cip-rt-rebase

And their content should be identical.

Best regards,
Pavel

--
DENX Software Engineering GmbH, Managing Director: Wolfgang Denk
HRB 165235 Munich, Office: Kirchenstr.5, D-82194 Groebenzell, Germany


[isar-cip-core][PATCH] linux-cip: Update to latest releases

Jan Kiszka
 

From: Jan Kiszka <jan.kiszka@...>

Signed-off-by: Jan Kiszka <jan.kiszka@...>
---
...4.4.277-cip60-rt35.bb => linux-cip-rt_4.4.285-cip63-rt36.bb} | 2 +-
...{linux-cip_4.19.206-cip57.bb => linux-cip_4.19.217-cip62.bb} | 2 +-
.../{linux-cip_4.4.283-cip62.bb => linux-cip_4.4.291-cip65.bb} | 2 +-
3 files changed, 3 insertions(+), 3 deletions(-)
rename recipes-kernel/linux/{linux-cip-rt_4.4.277-cip60-rt35.bb => linux-cip-rt_4.4.285-cip63-rt36.bb} (68%)
rename recipes-kernel/linux/{linux-cip_4.19.206-cip57.bb => linux-cip_4.19.217-cip62.bb} (68%)
rename recipes-kernel/linux/{linux-cip_4.4.283-cip62.bb => linux-cip_4.4.291-cip65.bb} (68%)

diff --git a/recipes-kernel/linux/linux-cip-rt_4.4.277-cip60-rt35.bb b/recipes-kernel/linux/linux-cip-rt_4.4.285-cip63-rt36.bb
similarity index 68%
rename from recipes-kernel/linux/linux-cip-rt_4.4.277-cip60-rt35.bb
rename to recipes-kernel/linux/linux-cip-rt_4.4.285-cip63-rt36.bb
index 0a2de66..c051583 100644
--- a/recipes-kernel/linux/linux-cip-rt_4.4.277-cip60-rt35.bb
+++ b/recipes-kernel/linux/linux-cip-rt_4.4.285-cip63-rt36.bb
@@ -11,4 +11,4 @@

require linux-cip-rt-common.inc

-SRC_URI[sha256sum] = "ea4a5de21e6ad82001685bddcfaacd2eaaf524fea61dd774c2895c7adb3b934e"
+SRC_URI[sha256sum] = "c2fe6bcf44fc7a8ee9785adc4dc41d07c50d803883add859648cbbb0461854fa"
diff --git a/recipes-kernel/linux/linux-cip_4.19.206-cip57.bb b/recipes-kernel/linux/linux-cip_4.19.217-cip62.bb
similarity index 68%
rename from recipes-kernel/linux/linux-cip_4.19.206-cip57.bb
rename to recipes-kernel/linux/linux-cip_4.19.217-cip62.bb
index f23ab83..1a60571 100644
--- a/recipes-kernel/linux/linux-cip_4.19.206-cip57.bb
+++ b/recipes-kernel/linux/linux-cip_4.19.217-cip62.bb
@@ -11,4 +11,4 @@

require linux-cip-common.inc

-SRC_URI[sha256sum] = "a88ab84c6cf072743890a11e2f782540ecf1081167f3a2f34311060f99eda44d"
+SRC_URI[sha256sum] = "00b22f2e7b3d4f5787ca92f2e182211ac2c1391c09435174c2b4670b2837b23c"
diff --git a/recipes-kernel/linux/linux-cip_4.4.283-cip62.bb b/recipes-kernel/linux/linux-cip_4.4.291-cip65.bb
similarity index 68%
rename from recipes-kernel/linux/linux-cip_4.4.283-cip62.bb
rename to recipes-kernel/linux/linux-cip_4.4.291-cip65.bb
index bcb754d..e45c57c 100644
--- a/recipes-kernel/linux/linux-cip_4.4.283-cip62.bb
+++ b/recipes-kernel/linux/linux-cip_4.4.291-cip65.bb
@@ -11,4 +11,4 @@

require linux-cip-common.inc

-SRC_URI[sha256sum] = "842c443e6adc43cebe73acb071a59a8c410cc6cd83488502f297ee1a995dbae6"
+SRC_URI[sha256sum] = "9ed7782c067793e684691e99388608ff746f04121cc35dbbbfc2fa5ed6f9e88e"
--
2.31.1


Re: [isar-cip-core][RESEND PATCH 0/9] Read-only root file system with dm-verity

Jan Kiszka
 

On 30.11.21 12:47, Q. Gylstorff wrote:
From: Quirin Gylstorff <quirin.gylstorff@...>

*This patch series adds support for a read-only squashfs based root filesystem
wit SWUpdate support and secureboot.

The build is somewhat complex as we need the output of dm-verity to generate
the initramfs. The build is split in the following steps
1. Build the root file system
2. Generate a squashfs image - this can also be replace by another image format(e.g. ext4)
3. Build from the image the dm-verity partition and add it to the end of the image
4. Add the resulting verity environment to the initrd
5. Build the signed efi tool chain.

This series needs SWUpdate 2021.11. The necessary changes are currently backported.

Changes in RFC V2:
- rebase onto orgin/next
- adapt Kconfig to new ebg-secure-boot-snakeoil.yml by deleting unnecessary options
- Cleanup to support different file-systems for verity-img
- tested with ext4 and squashfs
- simplified kernel patching
- prepend not necessary
- added flag to enable/disable
- whitespaces for readability
- integrated into ebg-secure-boot-snakeoil
- make behavior on corruption configurable during build time.
- default is restart on corruption
- add ISAR patch for correct permissions

Changes in RFC V3:
- Configurable size of /tmp
- remove unnecessary overlay-parse-etc.service
- convert etc-sysusers to drop in configuration of systemd-sysusers.service
- extend commit messages

Changes in Patch:
- rebased onto origin/next 2550c34a03ae3c035a1593585f2d8e545c83140d
- initrd verity warning message
- Kconfig: secure-boot element selects also swupdate
as the secureboot kas option contains swupdate
- fixed ci build

Quirin Gylstorff (9):
Add new class to create a squashfs based root file system
Add verity-img.bbclass for dm-verity based rootfs
linux-cip-common: Increase revision kernel config
Create a initrd with support for dm-verity
Create an read-only rootfs with dm-verity
Create systemd mount units for a etc overlay
Mount writable home partition
kas: Patch isar for correct permissions in var and home
swupdate: Backport patches from SWUpdate Master

.gitlab-ci.yml | 11 -
Kconfig | 4 +-
classes/secure-swupdate-img.bbclass | 32 +++
classes/squashfs-img.bbclass | 41 ++++
classes/verity-img.bbclass | 73 +++++++
kas-cip.yml | 4 +
kas/opt/ebg-secure-boot-snakeoil.yml | 12 +-
...when-splitting-rootfs-folders-across.patch | 35 ++++
.../etc-overlay-fs/etc-overlay-fs_0.1.bb | 32 +++
.../etc-overlay-fs/files/etc-hostname.service | 14 ++
.../files/etc-sshd-regen-keys.conf | 7 +
.../etc-overlay-fs/files/etc-sysusers.conf | 4 +
recipes-core/etc-overlay-fs/files/etc.mount | 13 ++
recipes-core/etc-overlay-fs/files/postinst | 4 +
recipes-core/home-fs/files/home.mount | 12 ++
recipes-core/home-fs/files/postinst | 3 +
recipes-core/home-fs/home-fs_0.1.bb | 20 ++
.../images/cip-core-image-read-only.bb | 22 ++
...an-patches-add-patches-for-dm-verity.patch | 191 ++++++++++++++++++
.../swupdate/swupdate_2021.04-1+debian-gbp.bb | 5 +
recipes-core/tmp-fs/files/postinst | 3 +
recipes-core/tmp-fs/files/tmp.mount.tmpl | 11 +
recipes-core/tmp-fs/tmp-fs_0.1.bb | 26 +++
.../cip-core-initramfs/cip-core-initramfs.bb | 10 +-
.../files/verity.conf-hook | 1 +
.../initramfs-verity-hook/files/verity.hook | 23 +++
.../files/verity.script.tmpl | 70 +++++++
.../initramfs-verity-hook_0.1.bb | 51 +++++
recipes-kernel/linux/linux-cip-common.inc | 2 +-
start-qemu.sh | 4 +
wic/qemu-amd64-efibootguard-secureboot.wks | 11 -
wic/qemu-amd64-efibootguard-secureboot.wks.in | 15 ++
32 files changed, 735 insertions(+), 31 deletions(-)
create mode 100644 classes/secure-swupdate-img.bbclass
create mode 100644 classes/squashfs-img.bbclass
create mode 100644 classes/verity-img.bbclass
create mode 100644 patches/isar/0001-Fix-permissions-when-splitting-rootfs-folders-across.patch
create mode 100644 recipes-core/etc-overlay-fs/etc-overlay-fs_0.1.bb
create mode 100644 recipes-core/etc-overlay-fs/files/etc-hostname.service
create mode 100644 recipes-core/etc-overlay-fs/files/etc-sshd-regen-keys.conf
create mode 100644 recipes-core/etc-overlay-fs/files/etc-sysusers.conf
create mode 100644 recipes-core/etc-overlay-fs/files/etc.mount
create mode 100755 recipes-core/etc-overlay-fs/files/postinst
create mode 100644 recipes-core/home-fs/files/home.mount
create mode 100755 recipes-core/home-fs/files/postinst
create mode 100644 recipes-core/home-fs/home-fs_0.1.bb
create mode 100644 recipes-core/images/cip-core-image-read-only.bb
create mode 100644 recipes-core/swupdate/files/0001-debian-patches-add-patches-for-dm-verity.patch
create mode 100755 recipes-core/tmp-fs/files/postinst
create mode 100644 recipes-core/tmp-fs/files/tmp.mount.tmpl
create mode 100644 recipes-core/tmp-fs/tmp-fs_0.1.bb
rename kas/opt/ebg-snakeoil-swu.yml => recipes-initramfs/cip-core-initramfs/cip-core-initramfs.bb (61%)
create mode 100644 recipes-initramfs/initramfs-verity-hook/files/verity.conf-hook
create mode 100644 recipes-initramfs/initramfs-verity-hook/files/verity.hook
create mode 100644 recipes-initramfs/initramfs-verity-hook/files/verity.script.tmpl
create mode 100644 recipes-initramfs/initramfs-verity-hook/initramfs-verity-hook_0.1.bb
delete mode 100644 wic/qemu-amd64-efibootguard-secureboot.wks
create mode 100644 wic/qemu-amd64-efibootguard-secureboot.wks.in
Thanks, applied to next.

Jan

--
Siemens AG, T RDA IOT
Corporate Competence Center Embedded Linux


Re: cip/linux-4.19.y-cip baseline-nfs: 12 runs, 1 regressions (v4.19.217-cip62) #kernelci

Pavel Machek
 

Hi!

On Tue 2021-11-30 10:22:14, Chris Paterson wrote:
+kernelci ML as they will appreciate the feedback.
Thank you, but it looks like they are rejecting the email :-(.

<kernelci@groups.io>: host lb01.groups.io[45.79.81.153] said: 500 This
message
has been flagged as spam. (in reply to end of DATA command)


Best regards,
Pavel
--
DENX Software Engineering GmbH, Managing Director: Wolfgang Denk
HRB 165235 Munich, Office: Kirchenstr.5, D-82194 Groebenzell, Germany


Re: cip/linux-4.19.y-cip baseline-nfs: 12 runs, 1 regressions (v4.19.217-cip62) #kernelci

Pavel Machek
 

Hi!

Then we have:

cip/linux-4.19.y-cip baseline-nfs: 12 runs, 1 regressions (v4.19.217-cip62)
Ok, so we may have an regression. That means it worked before and it
does not work now. I'd expect two versions "worked in v4.19.123-cip12,
now broken in v4.19.217-cip62", but we only have one.

Regressions Summary
-------------------

platform | arch | lab | compiler | defconfig | regressions
-----------------+-------+---------------+----------+-----------+------------
rk3399-gru-kevin | arm64 | lab-collabora | gcc-10 | defconfig | 1
Did you not have a "details" link here? In my copy of the email (attached) it links to
https://linux.kernelci.org/test/job/cip/branch/linux-4.19.y-cip/kernel/v4.19.217-cip62/plan/baseline-nfs/

If you click on the platform in question it says: "New regression, last pass: v4.19.216-cip61", which also links to the relevant build job.
I think it also says this in the email below the failed test case? (baseline-nfs.login)
I did not find the "New regression, last pass" summary, but clicking
on testcase path indeed gave me failing and passing dmesg.

Working test says:

07:05:59.319716 <4>[ 16.957513] cdn-dp fec00000.dp: Direct firmware
load for rockchip/dptx.bin failed with error -2
07:06:00.206271 <6>[ 17.844209] asix 7-1:1.0 enx48f8b3454d72: link
up, 100Mbps, full-duplex, lpa 0xC1E1
07:06:00.551556 IP-Config: no response after 2 secs - giving up
07:06:00.609271 IP-Config: enx48f8b3454d72 hardware address
48:f8:b3:45:4d:72 mtu 1500 DHCP

And after scrolling around it looks enx48f8b3454d72 is usb ethernet
card.

This includes a link to the defconfig used, although perhaps you'd like to know more about the platform.
Yes, knowing more about platform would be nice (one question would be
"Is the ethernet removable?"). But in case like this I'd need someone
to do the tests for me (or to have enough access to do the tests
myself). First question would be "does v4.19.217 work with same
config"? Easist way to debug this is usually bisection....

Is that feasible?

Best regards,
Pavel
--
DENX Software Engineering GmbH, Managing Director: Wolfgang Denk
HRB 165235 Munich, Office: Kirchenstr.5, D-82194 Groebenzell, Germany

2201 - 2220 of 9267