Date   

cip/linux-4.4.y-cip build: 146 builds: 4 failed, 142 passed (v4.4.302-cip68-19-g33cb6f438d5a) #kernelci

kernelci.org bot <bot@...>
 

cip/linux-4.4.y-cip build: 146 builds: 4 failed, 142 passed (v4.4.302-cip68-19-g33cb6f438d5a)

Full Build Summary: https://kernelci.org/build/cip/branch/linux-4.4.y-cip/kernel/v4.4.302-cip68-19-g33cb6f438d5a/

Tree: cip
Branch: linux-4.4.y-cip
Git Describe: v4.4.302-cip68-19-g33cb6f438d5a
Git Commit: 33cb6f438d5acbe92fa6aee23ee3e7e5590a9cca
Git URL: https://git.kernel.org/pub/scm/linux/kernel/git/cip/linux-cip.git
Built: 6 unique architectures

Build Failures Detected:

arm:
rpc_defconfig: (gcc-10) FAIL

mips:
fuloong2e_defconfig: (gcc-10) FAIL
ip27_defconfig: (gcc-10) FAIL
ip28_defconfig: (gcc-10) FAIL

---
For more info write to <info@...>


cip-gitlab/ci/pavel/linux-test build: 188 builds: 68 failed, 120 passed (v4.4.302-cip68-53-geecd00d15fa6c) #kernelci

kernelci.org bot <bot@...>
 

cip-gitlab/ci/pavel/linux-test build: 188 builds: 68 failed, 120 passed (v4.4.302-cip68-53-geecd00d15fa6c)

Full Build Summary: https://kernelci.org/build/cip-gitlab/branch/ci%2Fpavel%2Flinux-test/kernel/v4.4.302-cip68-53-geecd00d15fa6c/

Tree: cip-gitlab
Branch: ci/pavel/linux-test
Git Describe: v4.4.302-cip68-53-geecd00d15fa6c
Git Commit: eecd00d15fa6c31f7dbddf4d2ce81e23210cd92a
Git URL: https://gitlab.com/cip-project/cip-kernel/linux-cip.git
Built: 6 unique architectures

Build Failures Detected:

arm:
at91_dt_defconfig: (gcc-10) FAIL
bcm2835_defconfig: (gcc-10) FAIL
bcm_defconfig: (gcc-10) FAIL
colibri_pxa300_defconfig: (gcc-10) FAIL
corgi_defconfig: (gcc-10) FAIL
davinci_all_defconfig: (gcc-10) FAIL
ebsa110_defconfig: (gcc-10) FAIL
exynos_defconfig: (gcc-10) FAIL
ezx_defconfig: (gcc-10) FAIL
hisi_defconfig: (gcc-10) FAIL
imote2_defconfig: (gcc-10) FAIL
imx_v6_v7_defconfig: (gcc-10) FAIL
keystone_defconfig: (gcc-10) FAIL
lpc32xx_defconfig: (gcc-10) FAIL
multi_v7_defconfig: (gcc-10) FAIL
mvebu_v7_defconfig: (gcc-10) FAIL
netx_defconfig: (gcc-10) FAIL
nhk8815_defconfig: (gcc-10) FAIL
omap1_defconfig: (gcc-10) FAIL
omap2plus_defconfig: (gcc-10) FAIL
raumfeld_defconfig: (gcc-10) FAIL
rpc_defconfig: (gcc-10) FAIL
s3c2410_defconfig: (gcc-10) FAIL
sama5_defconfig: (gcc-10) FAIL
shmobile_defconfig: (gcc-10) FAIL
socfpga_defconfig: (gcc-10) FAIL
spear13xx_defconfig: (gcc-10) FAIL
spitz_defconfig: (gcc-10) FAIL
tegra_defconfig: (gcc-10) FAIL
u8500_defconfig: (gcc-10) FAIL
vt8500_v6_v7_defconfig: (gcc-10) FAIL

i386:
i386_defconfig: (gcc-10) FAIL

mips:
bcm47xx_defconfig: (gcc-10) FAIL
bigsur_defconfig: (gcc-10) FAIL
bmips_be_defconfig: (gcc-10) FAIL
bmips_stb_defconfig: (gcc-10) FAIL
cavium_octeon_defconfig: (gcc-10) FAIL
db1xxx_defconfig: (gcc-10) FAIL
decstation_defconfig: (gcc-10) FAIL
fuloong2e_defconfig: (gcc-10) FAIL
gpr_defconfig: (gcc-10) FAIL
ip22_defconfig: (gcc-10) FAIL
ip27_defconfig: (gcc-10) FAIL
ip28_defconfig: (gcc-10) FAIL
ip32_defconfig: (gcc-10) FAIL
jazz_defconfig: (gcc-10) FAIL
lemote2f_defconfig: (gcc-10) FAIL
loongson3_defconfig: (gcc-10) FAIL
malta_defconfig: (gcc-10) FAIL
malta_kvm_defconfig: (gcc-10) FAIL
malta_kvm_guest_defconfig: (gcc-10) FAIL
malta_qemu_32r6_defconfig: (gcc-10) FAIL
maltaaprp_defconfig: (gcc-10) FAIL
maltasmvp_defconfig: (gcc-10) FAIL
maltasmvp_eva_defconfig: (gcc-10) FAIL
maltaup_defconfig: (gcc-10) FAIL
maltaup_xpa_defconfig: (gcc-10) FAIL
markeins_defconfig: (gcc-10) FAIL
mips_paravirt_defconfig: (gcc-10) FAIL
mtx1_defconfig: (gcc-10) FAIL
nlm_xlp_defconfig: (gcc-10) FAIL
nlm_xlr_defconfig: (gcc-10) FAIL
pistachio_defconfig: (gcc-10) FAIL
rm200_defconfig: (gcc-10) FAIL
tb0219_defconfig: (gcc-10) FAIL
tb0287_defconfig: (gcc-10) FAIL

x86_64:
x86_64_defconfig: (gcc-10) FAIL
x86_64_defconfig+x86-chromebook: (gcc-10) FAIL

---
For more info write to <info@...>


cip-gitlab/ci/pavel/linux-test build: 181 builds: 73 failed, 108 passed (v4.4.302-cip68-55-g24773c542fdd) #kernelci

kernelci.org bot <bot@...>
 

cip-gitlab/ci/pavel/linux-test build: 181 builds: 73 failed, 108 passed (v4.4.302-cip68-55-g24773c542fdd)

Full Build Summary: https://kernelci.org/build/cip-gitlab/branch/ci%2Fpavel%2Flinux-test/kernel/v4.4.302-cip68-55-g24773c542fdd/

Tree: cip-gitlab
Branch: ci/pavel/linux-test
Git Describe: v4.4.302-cip68-55-g24773c542fdd
Git Commit: 24773c542fdde7f383002754ec02b1656e9dc31c
Git URL: https://gitlab.com/cip-project/cip-kernel/linux-cip.git
Built: 6 unique architectures

Build Failures Detected:

arm64:
defconfig: (gcc-10) FAIL
defconfig+arm64-chromebook: (gcc-10) FAIL

arm:
at91_dt_defconfig: (gcc-10) FAIL
axm55xx_defconfig: (gcc-10) FAIL
bcm2835_defconfig: (gcc-10) FAIL
bcm_defconfig: (gcc-10) FAIL
cns3420vb_defconfig: (gcc-10) FAIL
colibri_pxa300_defconfig: (gcc-10) FAIL
corgi_defconfig: (gcc-10) FAIL
ebsa110_defconfig: (gcc-10) FAIL
ezx_defconfig: (gcc-10) FAIL
hisi_defconfig: (gcc-10) FAIL
imx_v4_v5_defconfig: (gcc-10) FAIL
imx_v6_v7_defconfig: (gcc-10) FAIL
keystone_defconfig: (gcc-10) FAIL
lpc32xx_defconfig: (gcc-10) FAIL
multi_v7_defconfig: (gcc-10) FAIL
mvebu_v7_defconfig: (gcc-10) FAIL
netx_defconfig: (gcc-10) FAIL
nhk8815_defconfig: (gcc-10) FAIL
omap1_defconfig: (gcc-10) FAIL
omap2plus_defconfig: (gcc-10) FAIL
raumfeld_defconfig: (gcc-10) FAIL
rpc_defconfig: (gcc-10) FAIL
sama5_defconfig: (gcc-10) FAIL
shmobile_defconfig: (gcc-10) FAIL
socfpga_defconfig: (gcc-10) FAIL
spear13xx_defconfig: (gcc-10) FAIL
spitz_defconfig: (gcc-10) FAIL
sunxi_defconfig: (gcc-10) FAIL
tegra_defconfig: (gcc-10) FAIL
u8500_defconfig: (gcc-10) FAIL
vt8500_v6_v7_defconfig: (gcc-10) FAIL
zx_defconfig: (gcc-10) FAIL

i386:
i386_defconfig: (gcc-10) FAIL

mips:
bcm47xx_defconfig: (gcc-10) FAIL
bigsur_defconfig: (gcc-10) FAIL
bmips_be_defconfig: (gcc-10) FAIL
bmips_stb_defconfig: (gcc-10) FAIL
cavium_octeon_defconfig: (gcc-10) FAIL
ci20_defconfig: (gcc-10) FAIL
db1xxx_defconfig: (gcc-10) FAIL
decstation_defconfig: (gcc-10) FAIL
fuloong2e_defconfig: (gcc-10) FAIL
gpr_defconfig: (gcc-10) FAIL
ip22_defconfig: (gcc-10) FAIL
ip27_defconfig: (gcc-10) FAIL
ip28_defconfig: (gcc-10) FAIL
ip32_defconfig: (gcc-10) FAIL
jazz_defconfig: (gcc-10) FAIL
lemote2f_defconfig: (gcc-10) FAIL
loongson3_defconfig: (gcc-10) FAIL
malta_defconfig: (gcc-10) FAIL
malta_kvm_defconfig: (gcc-10) FAIL
malta_kvm_guest_defconfig: (gcc-10) FAIL
malta_qemu_32r6_defconfig: (gcc-10) FAIL
maltaaprp_defconfig: (gcc-10) FAIL
maltasmvp_defconfig: (gcc-10) FAIL
maltasmvp_eva_defconfig: (gcc-10) FAIL
maltaup_defconfig: (gcc-10) FAIL
maltaup_xpa_defconfig: (gcc-10) FAIL
markeins_defconfig: (gcc-10) FAIL
mips_paravirt_defconfig: (gcc-10) FAIL
mtx1_defconfig: (gcc-10) FAIL
nlm_xlp_defconfig: (gcc-10) FAIL
nlm_xlr_defconfig: (gcc-10) FAIL
pistachio_defconfig: (gcc-10) FAIL
rm200_defconfig: (gcc-10) FAIL
sb1250_swarm_defconfig: (gcc-10) FAIL
tb0219_defconfig: (gcc-10) FAIL
tb0287_defconfig: (gcc-10) FAIL

x86_64:
x86_64_defconfig: (gcc-10) FAIL
x86_64_defconfig+x86-chromebook: (gcc-10) FAIL

---
For more info write to <info@...>


cip/linux-4.4.y-cip build: 140 builds: 4 failed, 136 passed, 6 errors, 31 warnings (v4.4.302-cip68-19-gcfdd1ea3a7ba) #kernelci

kernelci.org bot <bot@...>
 

cip/linux-4.4.y-cip build: 140 builds: 4 failed, 136 passed, 6 errors, 31 warnings (v4.4.302-cip68-19-gcfdd1ea3a7ba)

Full Build Summary: https://kernelci.org/build/cip/branch/linux-4.4.y-cip/kernel/v4.4.302-cip68-19-gcfdd1ea3a7ba/

Tree: cip
Branch: linux-4.4.y-cip
Git Describe: v4.4.302-cip68-19-gcfdd1ea3a7ba
Git Commit: cfdd1ea3a7bab80ea3e513f28e7aa423fedf5d61
Git URL: https://git.kernel.org/pub/scm/linux/kernel/git/cip/linux-cip.git
Built: 6 unique architectures

Build Failures Detected:

arm:
rpc_defconfig: (gcc-10) FAIL

mips:
fuloong2e_defconfig: (gcc-10) FAIL
ip28_defconfig: (gcc-10) FAIL
lemote2f_defconfig: (gcc-10) FAIL

Errors and Warnings Detected:

arc:

arm64:
defconfig+arm64-chromebook (gcc-10): 1 warning

arm:
clps711x_defconfig (gcc-10): 1 warning
mxs_defconfig (gcc-10): 1 warning
omap1_defconfig (gcc-10): 1 warning
omap2plus_defconfig (gcc-10): 1 warning
rpc_defconfig (gcc-10): 2 errors
s3c2410_defconfig (gcc-10): 1 warning
s3c6400_defconfig (gcc-10): 2 warnings

i386:

mips:
fuloong2e_defconfig (gcc-10): 2 errors
ip22_defconfig (gcc-10): 1 warning
lemote2f_defconfig (gcc-10): 2 errors
mtx1_defconfig (gcc-10): 3 warnings

x86_64:
allnoconfig (gcc-10): 4 warnings
tinyconfig (gcc-10): 3 warnings
x86_64_defconfig (gcc-10): 6 warnings
x86_64_defconfig+x86-chromebook (gcc-10): 6 warnings

Errors summary:

4 cc1: error: ‘-mloongson-mmi’ must be used with ‘-mhard-float’
1 arm-linux-gnueabihf-gcc: error: unrecognized -march target: armv3
1 arm-linux-gnueabihf-gcc: error: missing argument to ‘-march=’

Warnings summary:

7 arch/x86/kernel/process.c:456: Warning: no instruction mnemonic suffix given and no register operands; using default for `btr'
4 arch/x86/entry/entry_64.S:487: Warning: no instruction mnemonic suffix given and no register operands; using default for `btr'
4 arch/x86/entry/entry_64.S:1642: Warning: no instruction mnemonic suffix given and no register operands; using default for `sysret'
2 sound/pci/echoaudio/echoaudio_dsp.c:647:9: warning: iteration 1073741824 invokes undefined behavior [-Waggressive-loop-optimizations]
2 ld: warning: creating DT_TEXTREL in a PIE
2 ld: arch/x86/boot/compressed/head_64.o: warning: relocation in read-only section `.head.text'
2 drivers/tty/serial/samsung.c:1780:34: warning: array ‘s3c24xx_uart_dt_match’ assumed to have one element
1 sound/pci/echoaudio/echoaudio_dsp.c:658:9: warning: iteration 1073741824 invokes undefined behavior [-Waggressive-loop-optimizations]
1 drivers/net/ethernet/seeq/sgiseeq.c:804:26: warning: passing argument 5 of ‘dma_free_attrs’ makes pointer from integer without a cast [-Wint-conversion]
1 drivers/net/ethernet/apm/xgene/xgene_enet_main.c:32:36: warning: array ‘xgene_enet_acpi_match’ assumed to have one element
1 drivers/mmc/host/sdhci-s3c.c:429:34: warning: array ‘sdhci_s3c_dt_match’ assumed to have one element
1 drivers/gpio/gpio-omap.c:1161:34: warning: array ‘omap_gpio_match’ assumed to have one element
1 drivers/cpufreq/ti-cpufreq.c:250:24: warning: passing argument 1 of ‘PTR_ERR_OR_ZERO’ makes pointer from integer without a cast [-Wint-conversion]
1 arch/arm/mach-mxs/mach-mxs.c:285:26: warning: duplicate ‘const’ declaration specifier [-Wduplicate-decl-specifier]
1 arch/arm/mach-clps711x/board-autcpu12.c:163:26: warning: duplicate ‘const’ declaration specifier [-Wduplicate-decl-specifier]

================================================================================

Detailed per-defconfig build reports:

--------------------------------------------------------------------------------
acs5k_defconfig (arm, gcc-10) — PASS, 0 errors, 0 warnings, 0 section mismatches

--------------------------------------------------------------------------------
acs5k_tiny_defconfig (arm, gcc-10) — PASS, 0 errors, 0 warnings, 0 section mismatches

--------------------------------------------------------------------------------
allnoconfig (x86_64, gcc-10) — PASS, 0 errors, 4 warnings, 0 section mismatches

Warnings:
arch/x86/entry/entry_64.S:487: Warning: no instruction mnemonic suffix given and no register operands; using default for `btr'
arch/x86/entry/entry_64.S:1642: Warning: no instruction mnemonic suffix given and no register operands; using default for `sysret'
arch/x86/kernel/process.c:456: Warning: no instruction mnemonic suffix given and no register operands; using default for `btr'
arch/x86/kernel/process.c:456: Warning: no instruction mnemonic suffix given and no register operands; using default for `btr'

--------------------------------------------------------------------------------
am200epdkit_defconfig (arm, gcc-10) — PASS, 0 errors, 0 warnings, 0 section mismatches

--------------------------------------------------------------------------------
assabet_defconfig (arm, gcc-10) — PASS, 0 errors, 0 warnings, 0 section mismatches

--------------------------------------------------------------------------------
at91_dt_defconfig (arm, gcc-10) — PASS, 0 errors, 0 warnings, 0 section mismatches

--------------------------------------------------------------------------------
axs103_defconfig (arc, gcc-10) — PASS, 0 errors, 0 warnings, 0 section mismatches

--------------------------------------------------------------------------------
axs103_smp_defconfig (arc, gcc-10) — PASS, 0 errors, 0 warnings, 0 section mismatches

--------------------------------------------------------------------------------
badge4_defconfig (arm, gcc-10) — PASS, 0 errors, 0 warnings, 0 section mismatches

--------------------------------------------------------------------------------
bcm_defconfig (arm, gcc-10) — PASS, 0 errors, 0 warnings, 0 section mismatches

--------------------------------------------------------------------------------
bigsur_defconfig (mips, gcc-10) — PASS, 0 errors, 0 warnings, 0 section mismatches

--------------------------------------------------------------------------------
bmips_be_defconfig (mips, gcc-10) — PASS, 0 errors, 0 warnings, 0 section mismatches

--------------------------------------------------------------------------------
capcella_defconfig (mips, gcc-10) — PASS, 0 errors, 0 warnings, 0 section mismatches

--------------------------------------------------------------------------------
cavium_octeon_defconfig (mips, gcc-10) — PASS, 0 errors, 0 warnings, 0 section mismatches

--------------------------------------------------------------------------------
cerfcube_defconfig (arm, gcc-10) — PASS, 0 errors, 0 warnings, 0 section mismatches

--------------------------------------------------------------------------------
ci20_defconfig (mips, gcc-10) — PASS, 0 errors, 0 warnings, 0 section mismatches

--------------------------------------------------------------------------------
clps711x_defconfig (arm, gcc-10) — PASS, 0 errors, 1 warning, 0 section mismatches

Warnings:
arch/arm/mach-clps711x/board-autcpu12.c:163:26: warning: duplicate ‘const’ declaration specifier [-Wduplicate-decl-specifier]

--------------------------------------------------------------------------------
cm_x2xx_defconfig (arm, gcc-10) — PASS, 0 errors, 0 warnings, 0 section mismatches

--------------------------------------------------------------------------------
cm_x300_defconfig (arm, gcc-10) — PASS, 0 errors, 0 warnings, 0 section mismatches

--------------------------------------------------------------------------------
cobalt_defconfig (mips, gcc-10) — PASS, 0 errors, 0 warnings, 0 section mismatches

--------------------------------------------------------------------------------
colibri_pxa270_defconfig (arm, gcc-10) — PASS, 0 errors, 0 warnings, 0 section mismatches

--------------------------------------------------------------------------------
colibri_pxa300_defconfig (arm, gcc-10) — PASS, 0 errors, 0 warnings, 0 section mismatches

--------------------------------------------------------------------------------
collie_defconfig (arm, gcc-10) — PASS, 0 errors, 0 warnings, 0 section mismatches

--------------------------------------------------------------------------------
db1xxx_defconfig (mips, gcc-10) — PASS, 0 errors, 0 warnings, 0 section mismatches

--------------------------------------------------------------------------------
decstation_defconfig (mips, gcc-10) — PASS, 0 errors, 0 warnings, 0 section mismatches

--------------------------------------------------------------------------------
defconfig+arm64-chromebook (arm64, gcc-10) — PASS, 0 errors, 1 warning, 0 section mismatches

Warnings:
drivers/net/ethernet/apm/xgene/xgene_enet_main.c:32:36: warning: array ‘xgene_enet_acpi_match’ assumed to have one element

--------------------------------------------------------------------------------
dove_defconfig (arm, gcc-10) — PASS, 0 errors, 0 warnings, 0 section mismatches

--------------------------------------------------------------------------------
e55_defconfig (mips, gcc-10) — PASS, 0 errors, 0 warnings, 0 section mismatches

--------------------------------------------------------------------------------
ebsa110_defconfig (arm, gcc-10) — PASS, 0 errors, 0 warnings, 0 section mismatches

--------------------------------------------------------------------------------
em_x270_defconfig (arm, gcc-10) — PASS, 0 errors, 0 warnings, 0 section mismatches

--------------------------------------------------------------------------------
ep93xx_defconfig (arm, gcc-10) — PASS, 0 errors, 0 warnings, 0 section mismatches

--------------------------------------------------------------------------------
eseries_pxa_defconfig (arm, gcc-10) — PASS, 0 errors, 0 warnings, 0 section mismatches

--------------------------------------------------------------------------------
fuloong2e_defconfig (mips, gcc-10) — FAIL, 2 errors, 0 warnings, 0 section mismatches

Errors:
cc1: error: ‘-mloongson-mmi’ must be used with ‘-mhard-float’
cc1: error: ‘-mloongson-mmi’ must be used with ‘-mhard-float’

--------------------------------------------------------------------------------
h3600_defconfig (arm, gcc-10) — PASS, 0 errors, 0 warnings, 0 section mismatches

--------------------------------------------------------------------------------
h5000_defconfig (arm, gcc-10) — PASS, 0 errors, 0 warnings, 0 section mismatches

--------------------------------------------------------------------------------
hackkit_defconfig (arm, gcc-10) — PASS, 0 errors, 0 warnings, 0 section mismatches

--------------------------------------------------------------------------------
hisi_defconfig (arm, gcc-10) — PASS, 0 errors, 0 warnings, 0 section mismatches

--------------------------------------------------------------------------------
imote2_defconfig (arm, gcc-10) — PASS, 0 errors, 0 warnings, 0 section mismatches

--------------------------------------------------------------------------------
imx_v4_v5_defconfig (arm, gcc-10) — PASS, 0 errors, 0 warnings, 0 section mismatches

--------------------------------------------------------------------------------
imx_v6_v7_defconfig (arm, gcc-10) — PASS, 0 errors, 0 warnings, 0 section mismatches

--------------------------------------------------------------------------------
iop13xx_defconfig (arm, gcc-10) — PASS, 0 errors, 0 warnings, 0 section mismatches

--------------------------------------------------------------------------------
iop32x_defconfig (arm, gcc-10) — PASS, 0 errors, 0 warnings, 0 section mismatches

--------------------------------------------------------------------------------
iop33x_defconfig (arm, gcc-10) — PASS, 0 errors, 0 warnings, 0 section mismatches

--------------------------------------------------------------------------------
ip22_defconfig (mips, gcc-10) — PASS, 0 errors, 1 warning, 0 section mismatches

Warnings:
drivers/net/ethernet/seeq/sgiseeq.c:804:26: warning: passing argument 5 of ‘dma_free_attrs’ makes pointer from integer without a cast [-Wint-conversion]

--------------------------------------------------------------------------------
ip28_defconfig (mips, gcc-10) — FAIL, 0 errors, 0 warnings, 0 section mismatches

--------------------------------------------------------------------------------
ip32_defconfig (mips, gcc-10) — PASS, 0 errors, 0 warnings, 0 section mismatches

--------------------------------------------------------------------------------
ixp4xx_defconfig (arm, gcc-10) — PASS, 0 errors, 0 warnings, 0 section mismatches

--------------------------------------------------------------------------------
jazz_defconfig (mips, gcc-10) — PASS, 0 errors, 0 warnings, 0 section mismatches

--------------------------------------------------------------------------------
jmr3927_defconfig (mips, gcc-10) — PASS, 0 errors, 0 warnings, 0 section mismatches

--------------------------------------------------------------------------------
jornada720_defconfig (arm, gcc-10) — PASS, 0 errors, 0 warnings, 0 section mismatches

--------------------------------------------------------------------------------
keystone_defconfig (arm, gcc-10) — PASS, 0 errors, 0 warnings, 0 section mismatches

--------------------------------------------------------------------------------
ks8695_defconfig (arm, gcc-10) — PASS, 0 errors, 0 warnings, 0 section mismatches

--------------------------------------------------------------------------------
lart_defconfig (arm, gcc-10) — PASS, 0 errors, 0 warnings, 0 section mismatches

--------------------------------------------------------------------------------
lasat_defconfig (mips, gcc-10) — PASS, 0 errors, 0 warnings, 0 section mismatches

--------------------------------------------------------------------------------
lemote2f_defconfig (mips, gcc-10) — FAIL, 2 errors, 0 warnings, 0 section mismatches

Errors:
cc1: error: ‘-mloongson-mmi’ must be used with ‘-mhard-float’
cc1: error: ‘-mloongson-mmi’ must be used with ‘-mhard-float’

--------------------------------------------------------------------------------
loongson3_defconfig (mips, gcc-10) — PASS, 0 errors, 0 warnings, 0 section mismatches

--------------------------------------------------------------------------------
lpc18xx_defconfig (arm, gcc-10) — PASS, 0 errors, 0 warnings, 0 section mismatches

--------------------------------------------------------------------------------
lpd270_defconfig (arm, gcc-10) — PASS, 0 errors, 0 warnings, 0 section mismatches

--------------------------------------------------------------------------------
ls1b_defconfig (mips, gcc-10) — PASS, 0 errors, 0 warnings, 0 section mismatches

--------------------------------------------------------------------------------
lubbock_defconfig (arm, gcc-10) — PASS, 0 errors, 0 warnings, 0 section mismatches

--------------------------------------------------------------------------------
magician_defconfig (arm, gcc-10) — PASS, 0 errors, 0 warnings, 0 section mismatches

--------------------------------------------------------------------------------
mainstone_defconfig (arm, gcc-10) — PASS, 0 errors, 0 warnings, 0 section mismatches

--------------------------------------------------------------------------------
malta_kvm_defconfig (mips, gcc-10) — PASS, 0 errors, 0 warnings, 0 section mismatches

--------------------------------------------------------------------------------
malta_kvm_guest_defconfig (mips, gcc-10) — PASS, 0 errors, 0 warnings, 0 section mismatches

--------------------------------------------------------------------------------
malta_qemu_32r6_defconfig (mips, gcc-10) — PASS, 0 errors, 0 warnings, 0 section mismatches

--------------------------------------------------------------------------------
maltaaprp_defconfig (mips, gcc-10) — PASS, 0 errors, 0 warnings, 0 section mismatches

--------------------------------------------------------------------------------
maltasmvp_defconfig (mips, gcc-10) — PASS, 0 errors, 0 warnings, 0 section mismatches

--------------------------------------------------------------------------------
maltasmvp_eva_defconfig (mips, gcc-10) — PASS, 0 errors, 0 warnings, 0 section mismatches

--------------------------------------------------------------------------------
maltaup_xpa_defconfig (mips, gcc-10) — PASS, 0 errors, 0 warnings, 0 section mismatches

--------------------------------------------------------------------------------
markeins_defconfig (mips, gcc-10) — PASS, 0 errors, 0 warnings, 0 section mismatches

--------------------------------------------------------------------------------
mips_paravirt_defconfig (mips, gcc-10) — PASS, 0 errors, 0 warnings, 0 section mismatches

--------------------------------------------------------------------------------
mmp2_defconfig (arm, gcc-10) — PASS, 0 errors, 0 warnings, 0 section mismatches

--------------------------------------------------------------------------------
mpc30x_defconfig (mips, gcc-10) — PASS, 0 errors, 0 warnings, 0 section mismatches

--------------------------------------------------------------------------------
msp71xx_defconfig (mips, gcc-10) — PASS, 0 errors, 0 warnings, 0 section mismatches

--------------------------------------------------------------------------------
mtx1_defconfig (mips, gcc-10) — PASS, 0 errors, 3 warnings, 0 section mismatches

Warnings:
sound/pci/echoaudio/echoaudio_dsp.c:647:9: warning: iteration 1073741824 invokes undefined behavior [-Waggressive-loop-optimizations]
sound/pci/echoaudio/echoaudio_dsp.c:658:9: warning: iteration 1073741824 invokes undefined behavior [-Waggressive-loop-optimizations]
sound/pci/echoaudio/echoaudio_dsp.c:647:9: warning: iteration 1073741824 invokes undefined behavior [-Waggressive-loop-optimizations]

--------------------------------------------------------------------------------
multi_v5_defconfig (arm, gcc-10) — PASS, 0 errors, 0 warnings, 0 section mismatches

--------------------------------------------------------------------------------
multi_v7_defconfig (arm, gcc-10) — PASS, 0 errors, 0 warnings, 0 section mismatches

--------------------------------------------------------------------------------
mvebu_v5_defconfig (arm, gcc-10) — PASS, 0 errors, 0 warnings, 0 section mismatches

--------------------------------------------------------------------------------
mvebu_v7_defconfig (arm, gcc-10) — PASS, 0 errors, 0 warnings, 0 section mismatches

--------------------------------------------------------------------------------
mxs_defconfig (arm, gcc-10) — PASS, 0 errors, 1 warning, 0 section mismatches

Warnings:
arch/arm/mach-mxs/mach-mxs.c:285:26: warning: duplicate ‘const’ declaration specifier [-Wduplicate-decl-specifier]

--------------------------------------------------------------------------------
neponset_defconfig (arm, gcc-10) — PASS, 0 errors, 0 warnings, 0 section mismatches

--------------------------------------------------------------------------------
netwinder_defconfig (arm, gcc-10) — PASS, 0 errors, 0 warnings, 0 section mismatches

--------------------------------------------------------------------------------
netx_defconfig (arm, gcc-10) — PASS, 0 errors, 0 warnings, 0 section mismatches

--------------------------------------------------------------------------------
nlm_xlp_defconfig (mips, gcc-10) — PASS, 0 errors, 0 warnings, 0 section mismatches

--------------------------------------------------------------------------------
nlm_xlr_defconfig (mips, gcc-10) — PASS, 0 errors, 0 warnings, 0 section mismatches

--------------------------------------------------------------------------------
nsim_hs_defconfig (arc, gcc-10) — PASS, 0 errors, 0 warnings, 0 section mismatches

--------------------------------------------------------------------------------
nsim_hs_smp_defconfig (arc, gcc-10) — PASS, 0 errors, 0 warnings, 0 section mismatches

--------------------------------------------------------------------------------
nsimosci_hs_smp_defconfig (arc, gcc-10) — PASS, 0 errors, 0 warnings, 0 section mismatches

--------------------------------------------------------------------------------
nuc910_defconfig (arm, gcc-10) — PASS, 0 errors, 0 warnings, 0 section mismatches

--------------------------------------------------------------------------------
nuc950_defconfig (arm, gcc-10) — PASS, 0 errors, 0 warnings, 0 section mismatches

--------------------------------------------------------------------------------
nuc960_defconfig (arm, gcc-10) — PASS, 0 errors, 0 warnings, 0 section mismatches

--------------------------------------------------------------------------------
omap1_defconfig (arm, gcc-10) — PASS, 0 errors, 1 warning, 0 section mismatches

Warnings:
drivers/gpio/gpio-omap.c:1161:34: warning: array ‘omap_gpio_match’ assumed to have one element

--------------------------------------------------------------------------------
omap2plus_defconfig (arm, gcc-10) — PASS, 0 errors, 1 warning, 0 section mismatches

Warnings:
drivers/cpufreq/ti-cpufreq.c:250:24: warning: passing argument 1 of ‘PTR_ERR_OR_ZERO’ makes pointer from integer without a cast [-Wint-conversion]

--------------------------------------------------------------------------------
orion5x_defconfig (arm, gcc-10) — PASS, 0 errors, 0 warnings, 0 section mismatches

--------------------------------------------------------------------------------
palmz72_defconfig (arm, gcc-10) — PASS, 0 errors, 0 warnings, 0 section mismatches

--------------------------------------------------------------------------------
pcm027_defconfig (arm, gcc-10) — PASS, 0 errors, 0 warnings, 0 section mismatches

--------------------------------------------------------------------------------
pleb_defconfig (arm, gcc-10) — PASS, 0 errors, 0 warnings, 0 section mismatches

--------------------------------------------------------------------------------
prima2_defconfig (arm, gcc-10) — PASS, 0 errors, 0 warnings, 0 section mismatches

--------------------------------------------------------------------------------
pxa3xx_defconfig (arm, gcc-10) — PASS, 0 errors, 0 warnings, 0 section mismatches

--------------------------------------------------------------------------------
pxa910_defconfig (arm, gcc-10) — PASS, 0 errors, 0 warnings, 0 section mismatches

--------------------------------------------------------------------------------
qi_lb60_defconfig (mips, gcc-10) — PASS, 0 errors, 0 warnings, 0 section mismatches

--------------------------------------------------------------------------------
raumfeld_defconfig (arm, gcc-10) — PASS, 0 errors, 0 warnings, 0 section mismatches

--------------------------------------------------------------------------------
rb532_defconfig (mips, gcc-10) — PASS, 0 errors, 0 warnings, 0 section mismatches

--------------------------------------------------------------------------------
rbtx49xx_defconfig (mips, gcc-10) — PASS, 0 errors, 0 warnings, 0 section mismatches

--------------------------------------------------------------------------------
realview-smp_defconfig (arm, gcc-10) — PASS, 0 errors, 0 warnings, 0 section mismatches

--------------------------------------------------------------------------------
rpc_defconfig (arm, gcc-10) — FAIL, 2 errors, 0 warnings, 0 section mismatches

Errors:
arm-linux-gnueabihf-gcc: error: unrecognized -march target: armv3
arm-linux-gnueabihf-gcc: error: missing argument to ‘-march=’

--------------------------------------------------------------------------------
s3c2410_defconfig (arm, gcc-10) — PASS, 0 errors, 1 warning, 0 section mismatches

Warnings:
drivers/tty/serial/samsung.c:1780:34: warning: array ‘s3c24xx_uart_dt_match’ assumed to have one element

--------------------------------------------------------------------------------
s3c6400_defconfig (arm, gcc-10) — PASS, 0 errors, 2 warnings, 0 section mismatches

Warnings:
drivers/mmc/host/sdhci-s3c.c:429:34: warning: array ‘sdhci_s3c_dt_match’ assumed to have one element
drivers/tty/serial/samsung.c:1780:34: warning: array ‘s3c24xx_uart_dt_match’ assumed to have one element

--------------------------------------------------------------------------------
s5pv210_defconfig (arm, gcc-10) — PASS, 0 errors, 0 warnings, 0 section mismatches

--------------------------------------------------------------------------------
sama5_defconfig (arm, gcc-10) — PASS, 0 errors, 0 warnings, 0 section mismatches

--------------------------------------------------------------------------------
sb1250_swarm_defconfig (mips, gcc-10) — PASS, 0 errors, 0 warnings, 0 section mismatches

--------------------------------------------------------------------------------
sead3_defconfig (mips, gcc-10) — PASS, 0 errors, 0 warnings, 0 section mismatches

--------------------------------------------------------------------------------
sead3micro_defconfig (mips, gcc-10) — PASS, 0 errors, 0 warnings, 0 section mismatches

--------------------------------------------------------------------------------
shannon_defconfig (arm, gcc-10) — PASS, 0 errors, 0 warnings, 0 section mismatches

--------------------------------------------------------------------------------
shmobile_defconfig (arm, gcc-10) — PASS, 0 errors, 0 warnings, 0 section mismatches

--------------------------------------------------------------------------------
simpad_defconfig (arm, gcc-10) — PASS, 0 errors, 0 warnings, 0 section mismatches

--------------------------------------------------------------------------------
socfpga_defconfig (arm, gcc-10) — PASS, 0 errors, 0 warnings, 0 section mismatches

--------------------------------------------------------------------------------
spear13xx_defconfig (arm, gcc-10) — PASS, 0 errors, 0 warnings, 0 section mismatches

--------------------------------------------------------------------------------
spear3xx_defconfig (arm, gcc-10) — PASS, 0 errors, 0 warnings, 0 section mismatches

--------------------------------------------------------------------------------
spitz_defconfig (arm, gcc-10) — PASS, 0 errors, 0 warnings, 0 section mismatches

--------------------------------------------------------------------------------
stm32_defconfig (arm, gcc-10) — PASS, 0 errors, 0 warnings, 0 section mismatches

--------------------------------------------------------------------------------
sunxi_defconfig (arm, gcc-10) — PASS, 0 errors, 0 warnings, 0 section mismatches

--------------------------------------------------------------------------------
tb0219_defconfig (mips, gcc-10) — PASS, 0 errors, 0 warnings, 0 section mismatches

--------------------------------------------------------------------------------
tb0287_defconfig (mips, gcc-10) — PASS, 0 errors, 0 warnings, 0 section mismatches

--------------------------------------------------------------------------------
tegra_defconfig (arm, gcc-10) — PASS, 0 errors, 0 warnings, 0 section mismatches

--------------------------------------------------------------------------------
tinyconfig (i386, gcc-10) — PASS, 0 errors, 0 warnings, 0 section mismatches

--------------------------------------------------------------------------------
tinyconfig (x86_64, gcc-10) — PASS, 0 errors, 3 warnings, 0 section mismatches

Warnings:
arch/x86/entry/entry_64.S:487: Warning: no instruction mnemonic suffix given and no register operands; using default for `btr'
arch/x86/entry/entry_64.S:1642: Warning: no instruction mnemonic suffix given and no register operands; using default for `sysret'
arch/x86/kernel/process.c:456: Warning: no instruction mnemonic suffix given and no register operands; using default for `btr'

--------------------------------------------------------------------------------
tinyconfig (mips, gcc-10) — PASS, 0 errors, 0 warnings, 0 section mismatches

--------------------------------------------------------------------------------
u300_defconfig (arm, gcc-10) — PASS, 0 errors, 0 warnings, 0 section mismatches

--------------------------------------------------------------------------------
vdk_hs38_smp_defconfig (arc, gcc-10) — PASS, 0 errors, 0 warnings, 0 section mismatches

--------------------------------------------------------------------------------
versatile_defconfig (arm, gcc-10) — PASS, 0 errors, 0 warnings, 0 section mismatches

--------------------------------------------------------------------------------
vexpress_defconfig (arm, gcc-10) — PASS, 0 errors, 0 warnings, 0 section mismatches

--------------------------------------------------------------------------------
viper_defconfig (arm, gcc-10) — PASS, 0 errors, 0 warnings, 0 section mismatches

--------------------------------------------------------------------------------
vt8500_v6_v7_defconfig (arm, gcc-10) — PASS, 0 errors, 0 warnings, 0 section mismatches

--------------------------------------------------------------------------------
workpad_defconfig (mips, gcc-10) — PASS, 0 errors, 0 warnings, 0 section mismatches

--------------------------------------------------------------------------------
x86_64_defconfig (x86_64, gcc-10) — PASS, 0 errors, 6 warnings, 0 section mismatches

Warnings:
arch/x86/entry/entry_64.S:487: Warning: no instruction mnemonic suffix given and no register operands; using default for `btr'
arch/x86/entry/entry_64.S:1642: Warning: no instruction mnemonic suffix given and no register operands; using default for `sysret'
arch/x86/kernel/process.c:456: Warning: no instruction mnemonic suffix given and no register operands; using default for `btr'
arch/x86/kernel/process.c:456: Warning: no instruction mnemonic suffix given and no register operands; using default for `btr'
ld: arch/x86/boot/compressed/head_64.o: warning: relocation in read-only section `.head.text'
ld: warning: creating DT_TEXTREL in a PIE

--------------------------------------------------------------------------------
x86_64_defconfig+x86-chromebook (x86_64, gcc-10) — PASS, 0 errors, 6 warnings, 0 section mismatches

Warnings:
arch/x86/entry/entry_64.S:487: Warning: no instruction mnemonic suffix given and no register operands; using default for `btr'
arch/x86/entry/entry_64.S:1642: Warning: no instruction mnemonic suffix given and no register operands; using default for `sysret'
arch/x86/kernel/process.c:456: Warning: no instruction mnemonic suffix given and no register operands; using default for `btr'
arch/x86/kernel/process.c:456: Warning: no instruction mnemonic suffix given and no register operands; using default for `btr'
ld: arch/x86/boot/compressed/head_64.o: warning: relocation in read-only section `.head.text'
ld: warning: creating DT_TEXTREL in a PIE

--------------------------------------------------------------------------------
xilfpga_defconfig (mips, gcc-10) — PASS, 0 errors, 0 warnings, 0 section mismatches

--------------------------------------------------------------------------------
xway_defconfig (mips, gcc-10) — PASS, 0 errors, 0 warnings, 0 section mismatches

--------------------------------------------------------------------------------
zx_defconfig (arm, gcc-10) — PASS, 0 errors, 0 warnings, 0 section mismatches

---
For more info write to <info@...>


Re: Disabling XEN in our configs (used by QEMU and Renesas)

Chris Paterson
 

Hello Pavel,

From: Pavel Machek <pavel@...>
Sent: 17 March 2022 09:58

Hi!

There is bunch of XEN security fixes in the pipeline:

CVE-2022-23036, CVE-2022-23037, CVE-2022-23038, CVE-2022-23039,
CVE-2022-23040 : Xen: fix race conditions, resulting in potential data
leaks, data corruption, DoS by malicious backends

CVE-2022-23041: Xen: fix race conditions, resulting in potential data
leaks, data corruption, DoS by malicious backends

CVE-2022-23042: Xen: fix race conditions, resulting in potential data
leaks, data corruption, DoS by malicious backends

There's a bunch of patches fixing those, but backporting them to 4.4
would not be exactly easy. Our scripts show XEN as being used, but I
suspect that's a mistake.

Reneasas, can you confirm if you are using XEN in your arm64 products?
The renesas_defconfig is largely copied from the upstream arm64 defconfig, and upstream renesas_defconfig [0] used for development.
As both of the above have CONFIG_XEN=y, we do in CIP's copy as well.

[0] https://git.kernel.org/pub/scm/linux/kernel/git/geert/renesas-devel.git/tree/arch/arm64/configs/renesas_defconfig

I will check internally to see if there are any known users for XEN, but bear in mind we are an SoC vendor not a system integrator, so we don’t have direct knowledge of all end users/uses.

If not, it would be good to disable it in the configs.
Makes sense.

Kind regards, Chris


Could we disable XEN in qemu configs? I don't believe it makes much
sense.

./4.19.y-cip/arm64/qemu_arm64_defconfig:CONFIG_XEN=y
./4.19.y-cip/arm64/qemu_arm64_defconfig:CONFIG_XEN_GNTDEV=y
./4.19.y-
cip/arm64/qemu_arm64_defconfig:CONFIG_XEN_GRANT_DEV_ALLOC=y
./4.19.y-cip/arm64/renesas_defconfig:CONFIG_XEN=y
./5.10.y-cip/arm64/qemu_arm64_defconfig:CONFIG_XEN=y
./5.10.y-cip/arm64/qemu_arm64_defconfig:CONFIG_XEN_GNTDEV=y
./5.10.y-
cip/arm64/qemu_arm64_defconfig:CONFIG_XEN_GRANT_DEV_ALLOC=y
./5.10.y-cip/arm64/renesas_defconfig:CONFIG_XEN=y
./4.19.y-cip-rt/arm64/renesas-rt_defconfig:CONFIG_XEN=y
./5.10.y-cip-rt/arm64/renesas-rt_defconfig:CONFIG_XEN=y

Best regards,
Pavel
--
DENX Software Engineering GmbH, Managing Director: Wolfgang Denk
HRB 165235 Munich, Office: Kirchenstr.5, D-82194 Groebenzell, Germany


Disabling XEN in our configs (used by QEMU and Renesas)

Pavel Machek
 

Hi!

There is bunch of XEN security fixes in the pipeline:

CVE-2022-23036, CVE-2022-23037, CVE-2022-23038, CVE-2022-23039,
CVE-2022-23040 : Xen: fix race conditions, resulting in potential data
leaks, data corruption, DoS by malicious backends

CVE-2022-23041: Xen: fix race conditions, resulting in potential data
leaks, data corruption, DoS by malicious backends

CVE-2022-23042: Xen: fix race conditions, resulting in potential data
leaks, data corruption, DoS by malicious backends

There's a bunch of patches fixing those, but backporting them to 4.4
would not be exactly easy. Our scripts show XEN as being used, but I
suspect that's a mistake.

Reneasas, can you confirm if you are using XEN in your arm64 products?
If not, it would be good to disable it in the configs.

Could we disable XEN in qemu configs? I don't believe it makes much
sense.

./4.19.y-cip/arm64/qemu_arm64_defconfig:CONFIG_XEN=y
./4.19.y-cip/arm64/qemu_arm64_defconfig:CONFIG_XEN_GNTDEV=y
./4.19.y-cip/arm64/qemu_arm64_defconfig:CONFIG_XEN_GRANT_DEV_ALLOC=y
./4.19.y-cip/arm64/renesas_defconfig:CONFIG_XEN=y
./5.10.y-cip/arm64/qemu_arm64_defconfig:CONFIG_XEN=y
./5.10.y-cip/arm64/qemu_arm64_defconfig:CONFIG_XEN_GNTDEV=y
./5.10.y-cip/arm64/qemu_arm64_defconfig:CONFIG_XEN_GRANT_DEV_ALLOC=y
./5.10.y-cip/arm64/renesas_defconfig:CONFIG_XEN=y
./4.19.y-cip-rt/arm64/renesas-rt_defconfig:CONFIG_XEN=y
./5.10.y-cip-rt/arm64/renesas-rt_defconfig:CONFIG_XEN=y

Best regards,
Pavel
--
DENX Software Engineering GmbH, Managing Director: Wolfgang Denk
HRB 165235 Munich, Office: Kirchenstr.5, D-82194 Groebenzell, Germany


CIP IRC weekly meeting today on libera.chat

Jan Kiszka
 

Hi all,

Kindly be reminded to attend the weekly meeting through IRC to discuss
technical topics with CIP kernel today. Our channel is the following:

irc:irc.libera.chat:6667/cip

The IRC meeting is scheduled to UTC (GMT) 13:00:

https://www.timeanddate.com/worldclock/meetingdetails.html?year=2022&month=3&day=17&hour=13&min=0&sec=0&p1=224&p2=179&p3=136&p4=37&p5=241&p6=248

USWest USEast UK DE TW JP
06:00 09:00 13:00 14:00 21:00 22:00

Last meeting minutes:
https://ircbot.wl.linuxfoundation.org/meetings/cip/2022/03/cip.2022-03-10-13.00.log.html

* Action items
1. Resolve/filter irrelevant failures of KernelCI for 4.4-cip - patersonc & alicefm
* Kernel maintenance updates
* Kernel testing
* AOB

Jan


cip-gitlab/ci/pavel/linux-test smc: 3 runs, 1 regressions (v4.4.302-cip68-19-gcfdd1ea3a7ba) #kernelci

kernelci.org bot <bot@...>
 

cip-gitlab/ci/pavel/linux-test smc: 3 runs, 1 regressions (v4.4.302-cip68-19-gcfdd1ea3a7ba)

Regressions Summary
-------------------

platform | arch | lab | compiler | defconfig | regressions
--------------------------+--------+---------------+----------+------------------------------+------------
hp-x360-12b-n4000-octopus | x86_64 | lab-collabora | gcc-10 | x86_64_defcon...6-chromebook | 1

Details: https://kernelci.org/test/job/cip-gitlab/branch/ci%2Fpavel%2Flinux-test/kernel/v4.4.302-cip68-19-gcfdd1ea3a7ba/plan/smc/

Test: smc
Tree: cip-gitlab
Branch: ci/pavel/linux-test
Describe: v4.4.302-cip68-19-gcfdd1ea3a7ba
URL: https://gitlab.com/cip-project/cip-kernel/linux-cip.git
SHA: cfdd1ea3a7bab80ea3e513f28e7aa423fedf5d61


Test Regressions
----------------


platform | arch | lab | compiler | defconfig | regressions
--------------------------+--------+---------------+----------+------------------------------+------------
hp-x360-12b-n4000-octopus | x86_64 | lab-collabora | gcc-10 | x86_64_defcon...6-chromebook | 1

Details: https://kernelci.org/test/plan/id/6232db1ed60c8cdf42b73938

Results: 0 PASS, 1 FAIL, 0 SKIP
Full config: x86_64_defconfig+x86-chromebook
Compiler: gcc-10 (gcc (Debian 10.2.1-6) 10.2.1 20210110)
Plain log: https://storage.kernelci.org//cip-gitlab/ci-pavel-linux-test/v4.4.302-cip68-19-gcfdd1ea3a7ba/x86_64/x86_64_defconfig+x86-chromebook/gcc-10/lab-collabora/smc-hp-x360-12b-n4000-octopus.txt
HTML log: https://storage.kernelci.org//cip-gitlab/ci-pavel-linux-test/v4.4.302-cip68-19-gcfdd1ea3a7ba/x86_64/x86_64_defconfig+x86-chromebook/gcc-10/lab-collabora/smc-hp-x360-12b-n4000-octopus.html
Rootfs: http://storage.kernelci.org/images/rootfs/buildroot/buildroot-baseline/20220228.1/x86/rootfs.cpio.gz


* smc.login: https://kernelci.org/test/case/id/6232db1ed60c8cdf42b73939
failing since 0 day (last pass: v4.19.233-cip69-1019-g2e5815777e975, first fail: v4.4.302-18-ga78419826225)


cip-gitlab/ci/pavel/linux-test ltp-timers: 4 runs, 4 regressions (v4.4.302-cip68-19-gcfdd1ea3a7ba) #kernelci

kernelci.org bot <bot@...>
 

cip-gitlab/ci/pavel/linux-test ltp-timers: 4 runs, 4 regressions (v4.4.302-cip68-19-gcfdd1ea3a7ba)

Regressions Summary
-------------------

platform | arch | lab | compiler | defconfig | regressions
--------------------------+--------+---------------+----------+------------------------------+------------
asus-C433TA-AJ0005-rammus | x86_64 | lab-collabora | gcc-10 | x86_64_defcon...6-chromebook | 1
asus-C436FA-Flip-hatch | x86_64 | lab-collabora | gcc-10 | x86_64_defcon...6-chromebook | 1
asus-C523NA-A20057-coral | x86_64 | lab-collabora | gcc-10 | x86_64_defcon...6-chromebook | 1
hp-11A-G6-EE-grunt | x86_64 | lab-collabora | gcc-10 | x86_64_defcon...6-chromebook | 1

Details: https://kernelci.org/test/job/cip-gitlab/branch/ci%2Fpavel%2Flinux-test/kernel/v4.4.302-cip68-19-gcfdd1ea3a7ba/plan/ltp-timers/

Test: ltp-timers
Tree: cip-gitlab
Branch: ci/pavel/linux-test
Describe: v4.4.302-cip68-19-gcfdd1ea3a7ba
URL: https://gitlab.com/cip-project/cip-kernel/linux-cip.git
SHA: cfdd1ea3a7bab80ea3e513f28e7aa423fedf5d61

Test suite revisions:
ltp-tests
URL: https://github.com/linux-test-project/ltp.git
SHA: 67eccca54eb68a1bc91cf1f140fc43fa8085d8ed


Test Regressions
----------------


platform | arch | lab | compiler | defconfig | regressions
--------------------------+--------+---------------+----------+------------------------------+------------
asus-C433TA-AJ0005-rammus | x86_64 | lab-collabora | gcc-10 | x86_64_defcon...6-chromebook | 1

Details: https://kernelci.org/test/plan/id/6232cfe2ea6c267af8b73942

Results: 0 PASS, 1 FAIL, 0 SKIP
Full config: x86_64_defconfig+x86-chromebook
Compiler: gcc-10 (gcc (Debian 10.2.1-6) 10.2.1 20210110)
Plain log: https://storage.kernelci.org//cip-gitlab/ci-pavel-linux-test/v4.4.302-cip68-19-gcfdd1ea3a7ba/x86_64/x86_64_defconfig+x86-chromebook/gcc-10/lab-collabora/ltp-timers-asus-C433TA-AJ0005-rammus.txt
HTML log: https://storage.kernelci.org//cip-gitlab/ci-pavel-linux-test/v4.4.302-cip68-19-gcfdd1ea3a7ba/x86_64/x86_64_defconfig+x86-chromebook/gcc-10/lab-collabora/ltp-timers-asus-C433TA-AJ0005-rammus.html
Rootfs: http://storage.kernelci.org/images/rootfs/debian/bullseye-ltp/20220228.1/amd64/initrd.cpio.gz


* ltp-timers.login: https://kernelci.org/test/case/id/6232cfe2ea6c267af8b73943
failing since 0 day (last pass: v4.19.233-cip69-1019-g2e5815777e975, first fail: v4.4.302-18-ga78419826225)



platform | arch | lab | compiler | defconfig | regressions
--------------------------+--------+---------------+----------+------------------------------+------------
asus-C436FA-Flip-hatch | x86_64 | lab-collabora | gcc-10 | x86_64_defcon...6-chromebook | 1

Details: https://kernelci.org/test/plan/id/6232d0e5a2724309b5b73934

Results: 0 PASS, 1 FAIL, 0 SKIP
Full config: x86_64_defconfig+x86-chromebook
Compiler: gcc-10 (gcc (Debian 10.2.1-6) 10.2.1 20210110)
Plain log: https://storage.kernelci.org//cip-gitlab/ci-pavel-linux-test/v4.4.302-cip68-19-gcfdd1ea3a7ba/x86_64/x86_64_defconfig+x86-chromebook/gcc-10/lab-collabora/ltp-timers-asus-C436FA-Flip-hatch.txt
HTML log: https://storage.kernelci.org//cip-gitlab/ci-pavel-linux-test/v4.4.302-cip68-19-gcfdd1ea3a7ba/x86_64/x86_64_defconfig+x86-chromebook/gcc-10/lab-collabora/ltp-timers-asus-C436FA-Flip-hatch.html
Rootfs: http://storage.kernelci.org/images/rootfs/debian/bullseye-ltp/20220228.1/amd64/initrd.cpio.gz


* ltp-timers.login: https://kernelci.org/test/case/id/6232d0e5a2724309b5b73935
failing since 2 days (last pass: v5.10.100-cip2-319-g7182f5032311, first fail: v4.19.233-cip69-1019-g2e5815777e975)



platform | arch | lab | compiler | defconfig | regressions
--------------------------+--------+---------------+----------+------------------------------+------------
asus-C523NA-A20057-coral | x86_64 | lab-collabora | gcc-10 | x86_64_defcon...6-chromebook | 1

Details: https://kernelci.org/test/plan/id/6232d3efa2c1e855dbb7392c

Results: 0 PASS, 1 FAIL, 0 SKIP
Full config: x86_64_defconfig+x86-chromebook
Compiler: gcc-10 (gcc (Debian 10.2.1-6) 10.2.1 20210110)
Plain log: https://storage.kernelci.org//cip-gitlab/ci-pavel-linux-test/v4.4.302-cip68-19-gcfdd1ea3a7ba/x86_64/x86_64_defconfig+x86-chromebook/gcc-10/lab-collabora/ltp-timers-asus-C523NA-A20057-coral.txt
HTML log: https://storage.kernelci.org//cip-gitlab/ci-pavel-linux-test/v4.4.302-cip68-19-gcfdd1ea3a7ba/x86_64/x86_64_defconfig+x86-chromebook/gcc-10/lab-collabora/ltp-timers-asus-C523NA-A20057-coral.html
Rootfs: http://storage.kernelci.org/images/rootfs/debian/bullseye-ltp/20220228.1/amd64/initrd.cpio.gz


* ltp-timers.login: https://kernelci.org/test/case/id/6232d3efa2c1e855dbb7392d
failing since 0 day (last pass: v4.19.233-cip69-1019-g2e5815777e975, first fail: v4.4.302-18-ga78419826225)



platform | arch | lab | compiler | defconfig | regressions
--------------------------+--------+---------------+----------+------------------------------+------------
hp-11A-G6-EE-grunt | x86_64 | lab-collabora | gcc-10 | x86_64_defcon...6-chromebook | 1

Details: https://kernelci.org/test/plan/id/6232d6f0948d3c846fb7392c

Results: 0 PASS, 1 FAIL, 0 SKIP
Full config: x86_64_defconfig+x86-chromebook
Compiler: gcc-10 (gcc (Debian 10.2.1-6) 10.2.1 20210110)
Plain log: https://storage.kernelci.org//cip-gitlab/ci-pavel-linux-test/v4.4.302-cip68-19-gcfdd1ea3a7ba/x86_64/x86_64_defconfig+x86-chromebook/gcc-10/lab-collabora/ltp-timers-hp-11A-G6-EE-grunt.txt
HTML log: https://storage.kernelci.org//cip-gitlab/ci-pavel-linux-test/v4.4.302-cip68-19-gcfdd1ea3a7ba/x86_64/x86_64_defconfig+x86-chromebook/gcc-10/lab-collabora/ltp-timers-hp-11A-G6-EE-grunt.html
Rootfs: http://storage.kernelci.org/images/rootfs/debian/bullseye-ltp/20220228.1/amd64/initrd.cpio.gz


* ltp-timers.login: https://kernelci.org/test/case/id/6232d6f0948d3c846fb7392d
failing since 0 day (last pass: v4.19.233-cip69-1019-g2e5815777e975, first fail: v4.4.302-18-ga78419826225)


cip-gitlab/ci/pavel/linux-test ltp-pty: 3 runs, 3 regressions (v4.4.302-cip68-19-gcfdd1ea3a7ba) #kernelci

kernelci.org bot <bot@...>
 

cip-gitlab/ci/pavel/linux-test ltp-pty: 3 runs, 3 regressions (v4.4.302-cip68-19-gcfdd1ea3a7ba)

Regressions Summary
-------------------

platform | arch | lab | compiler | defconfig | regressions
--------------------------+--------+---------------+----------+------------------------------+------------
asus-C433TA-AJ0005-rammus | x86_64 | lab-collabora | gcc-10 | x86_64_defcon...6-chromebook | 1
asus-C523NA-A20057-coral | x86_64 | lab-collabora | gcc-10 | x86_64_defcon...6-chromebook | 1
hp-11A-G6-EE-grunt | x86_64 | lab-collabora | gcc-10 | x86_64_defcon...6-chromebook | 1

Details: https://kernelci.org/test/job/cip-gitlab/branch/ci%2Fpavel%2Flinux-test/kernel/v4.4.302-cip68-19-gcfdd1ea3a7ba/plan/ltp-pty/

Test: ltp-pty
Tree: cip-gitlab
Branch: ci/pavel/linux-test
Describe: v4.4.302-cip68-19-gcfdd1ea3a7ba
URL: https://gitlab.com/cip-project/cip-kernel/linux-cip.git
SHA: cfdd1ea3a7bab80ea3e513f28e7aa423fedf5d61

Test suite revisions:
ltp-tests
URL: https://github.com/linux-test-project/ltp.git
SHA: 67eccca54eb68a1bc91cf1f140fc43fa8085d8ed


Test Regressions
----------------


platform | arch | lab | compiler | defconfig | regressions
--------------------------+--------+---------------+----------+------------------------------+------------
asus-C433TA-AJ0005-rammus | x86_64 | lab-collabora | gcc-10 | x86_64_defcon...6-chromebook | 1

Details: https://kernelci.org/test/plan/id/6232d04789f2537479b739de

Results: 0 PASS, 1 FAIL, 0 SKIP
Full config: x86_64_defconfig+x86-chromebook
Compiler: gcc-10 (gcc (Debian 10.2.1-6) 10.2.1 20210110)
Plain log: https://storage.kernelci.org//cip-gitlab/ci-pavel-linux-test/v4.4.302-cip68-19-gcfdd1ea3a7ba/x86_64/x86_64_defconfig+x86-chromebook/gcc-10/lab-collabora/ltp-pty-asus-C433TA-AJ0005-rammus.txt
HTML log: https://storage.kernelci.org//cip-gitlab/ci-pavel-linux-test/v4.4.302-cip68-19-gcfdd1ea3a7ba/x86_64/x86_64_defconfig+x86-chromebook/gcc-10/lab-collabora/ltp-pty-asus-C433TA-AJ0005-rammus.html
Rootfs: http://storage.kernelci.org/images/rootfs/debian/bullseye-ltp/20220228.1/amd64/initrd.cpio.gz


* ltp-pty.login: https://kernelci.org/test/case/id/6232d04789f2537479b739df
failing since 0 day (last pass: v4.19.233-cip69-1019-g2e5815777e975, first fail: v4.4.302-18-ga78419826225)



platform | arch | lab | compiler | defconfig | regressions
--------------------------+--------+---------------+----------+------------------------------+------------
asus-C523NA-A20057-coral | x86_64 | lab-collabora | gcc-10 | x86_64_defcon...6-chromebook | 1

Details: https://kernelci.org/test/plan/id/6232d479f97cf29899b73943

Results: 0 PASS, 1 FAIL, 0 SKIP
Full config: x86_64_defconfig+x86-chromebook
Compiler: gcc-10 (gcc (Debian 10.2.1-6) 10.2.1 20210110)
Plain log: https://storage.kernelci.org//cip-gitlab/ci-pavel-linux-test/v4.4.302-cip68-19-gcfdd1ea3a7ba/x86_64/x86_64_defconfig+x86-chromebook/gcc-10/lab-collabora/ltp-pty-asus-C523NA-A20057-coral.txt
HTML log: https://storage.kernelci.org//cip-gitlab/ci-pavel-linux-test/v4.4.302-cip68-19-gcfdd1ea3a7ba/x86_64/x86_64_defconfig+x86-chromebook/gcc-10/lab-collabora/ltp-pty-asus-C523NA-A20057-coral.html
Rootfs: http://storage.kernelci.org/images/rootfs/debian/bullseye-ltp/20220228.1/amd64/initrd.cpio.gz


* ltp-pty.login: https://kernelci.org/test/case/id/6232d479f97cf29899b73944
failing since 0 day (last pass: v4.19.233-cip69-1019-g2e5815777e975, first fail: v4.4.302-18-ga78419826225)



platform | arch | lab | compiler | defconfig | regressions
--------------------------+--------+---------------+----------+------------------------------+------------
hp-11A-G6-EE-grunt | x86_64 | lab-collabora | gcc-10 | x86_64_defcon...6-chromebook | 1

Details: https://kernelci.org/test/plan/id/6232d0deb24fcff7a6b7393a

Results: 0 PASS, 1 FAIL, 0 SKIP
Full config: x86_64_defconfig+x86-chromebook
Compiler: gcc-10 (gcc (Debian 10.2.1-6) 10.2.1 20210110)
Plain log: https://storage.kernelci.org//cip-gitlab/ci-pavel-linux-test/v4.4.302-cip68-19-gcfdd1ea3a7ba/x86_64/x86_64_defconfig+x86-chromebook/gcc-10/lab-collabora/ltp-pty-hp-11A-G6-EE-grunt.txt
HTML log: https://storage.kernelci.org//cip-gitlab/ci-pavel-linux-test/v4.4.302-cip68-19-gcfdd1ea3a7ba/x86_64/x86_64_defconfig+x86-chromebook/gcc-10/lab-collabora/ltp-pty-hp-11A-G6-EE-grunt.html
Rootfs: http://storage.kernelci.org/images/rootfs/debian/bullseye-ltp/20220228.1/amd64/initrd.cpio.gz


* ltp-pty.login: https://kernelci.org/test/case/id/6232d0deb24fcff7a6b7393b
failing since 0 day (last pass: v4.19.233-cip69-1019-g2e5815777e975, first fail: v4.4.302-18-ga78419826225)


cip-gitlab/ci/pavel/linux-test ltp-ipc: 6 runs, 4 regressions (v4.4.302-cip68-19-gcfdd1ea3a7ba) #kernelci

kernelci.org bot <bot@...>
 

cip-gitlab/ci/pavel/linux-test ltp-ipc: 6 runs, 4 regressions (v4.4.302-cip68-19-gcfdd1ea3a7ba)

Regressions Summary
-------------------

platform | arch | lab | compiler | defconfig | regressions
--------------------------+--------+---------------+----------+------------------------------+------------
asus-C436FA-Flip-hatch | x86_64 | lab-collabora | gcc-10 | x86_64_defcon...6-chromebook | 1
asus-cx9400-volteer | x86_64 | lab-collabora | gcc-10 | x86_64_defcon...6-chromebook | 1
hp-11A-G6-EE-grunt | x86_64 | lab-collabora | gcc-10 | x86_64_defcon...6-chromebook | 1
hp-x360-12b-n4000-octopus | x86_64 | lab-collabora | gcc-10 | x86_64_defcon...6-chromebook | 1

Details: https://kernelci.org/test/job/cip-gitlab/branch/ci%2Fpavel%2Flinux-test/kernel/v4.4.302-cip68-19-gcfdd1ea3a7ba/plan/ltp-ipc/

Test: ltp-ipc
Tree: cip-gitlab
Branch: ci/pavel/linux-test
Describe: v4.4.302-cip68-19-gcfdd1ea3a7ba
URL: https://gitlab.com/cip-project/cip-kernel/linux-cip.git
SHA: cfdd1ea3a7bab80ea3e513f28e7aa423fedf5d61

Test suite revisions:
ltp-tests
URL: https://github.com/linux-test-project/ltp.git
SHA: 67eccca54eb68a1bc91cf1f140fc43fa8085d8ed


Test Regressions
----------------


platform | arch | lab | compiler | defconfig | regressions
--------------------------+--------+---------------+----------+------------------------------+------------
asus-C436FA-Flip-hatch | x86_64 | lab-collabora | gcc-10 | x86_64_defcon...6-chromebook | 1

Details: https://kernelci.org/test/plan/id/6232d2983b956a1c95b7391d

Results: 0 PASS, 1 FAIL, 0 SKIP
Full config: x86_64_defconfig+x86-chromebook
Compiler: gcc-10 (gcc (Debian 10.2.1-6) 10.2.1 20210110)
Plain log: https://storage.kernelci.org//cip-gitlab/ci-pavel-linux-test/v4.4.302-cip68-19-gcfdd1ea3a7ba/x86_64/x86_64_defconfig+x86-chromebook/gcc-10/lab-collabora/ltp-ipc-asus-C436FA-Flip-hatch.txt
HTML log: https://storage.kernelci.org//cip-gitlab/ci-pavel-linux-test/v4.4.302-cip68-19-gcfdd1ea3a7ba/x86_64/x86_64_defconfig+x86-chromebook/gcc-10/lab-collabora/ltp-ipc-asus-C436FA-Flip-hatch.html
Rootfs: http://storage.kernelci.org/images/rootfs/debian/bullseye-ltp/20220228.1/amd64/initrd.cpio.gz


* ltp-ipc.login: https://kernelci.org/test/case/id/6232d2983b956a1c95b7391e
failing since 2 days (last pass: v5.10.100-cip2-319-g7182f5032311, first fail: v4.19.233-cip69-1019-g2e5815777e975)



platform | arch | lab | compiler | defconfig | regressions
--------------------------+--------+---------------+----------+------------------------------+------------
asus-cx9400-volteer | x86_64 | lab-collabora | gcc-10 | x86_64_defcon...6-chromebook | 1

Details: https://kernelci.org/test/plan/id/6232d0d8b24fcff7a6b73934

Results: 0 PASS, 1 FAIL, 0 SKIP
Full config: x86_64_defconfig+x86-chromebook
Compiler: gcc-10 (gcc (Debian 10.2.1-6) 10.2.1 20210110)
Plain log: https://storage.kernelci.org//cip-gitlab/ci-pavel-linux-test/v4.4.302-cip68-19-gcfdd1ea3a7ba/x86_64/x86_64_defconfig+x86-chromebook/gcc-10/lab-collabora/ltp-ipc-asus-cx9400-volteer.txt
HTML log: https://storage.kernelci.org//cip-gitlab/ci-pavel-linux-test/v4.4.302-cip68-19-gcfdd1ea3a7ba/x86_64/x86_64_defconfig+x86-chromebook/gcc-10/lab-collabora/ltp-ipc-asus-cx9400-volteer.html
Rootfs: http://storage.kernelci.org/images/rootfs/debian/bullseye-ltp/20220228.1/amd64/initrd.cpio.gz


* ltp-ipc.login: https://kernelci.org/test/case/id/6232d0d8b24fcff7a6b73935
failing since 2 days (last pass: v5.10.100-cip2-319-g7182f5032311, first fail: v4.19.233-cip69-1019-g2e5815777e975)



platform | arch | lab | compiler | defconfig | regressions
--------------------------+--------+---------------+----------+------------------------------+------------
hp-11A-G6-EE-grunt | x86_64 | lab-collabora | gcc-10 | x86_64_defcon...6-chromebook | 1

Details: https://kernelci.org/test/plan/id/6232d0ebb24fcff7a6b73976

Results: 0 PASS, 1 FAIL, 0 SKIP
Full config: x86_64_defconfig+x86-chromebook
Compiler: gcc-10 (gcc (Debian 10.2.1-6) 10.2.1 20210110)
Plain log: https://storage.kernelci.org//cip-gitlab/ci-pavel-linux-test/v4.4.302-cip68-19-gcfdd1ea3a7ba/x86_64/x86_64_defconfig+x86-chromebook/gcc-10/lab-collabora/ltp-ipc-hp-11A-G6-EE-grunt.txt
HTML log: https://storage.kernelci.org//cip-gitlab/ci-pavel-linux-test/v4.4.302-cip68-19-gcfdd1ea3a7ba/x86_64/x86_64_defconfig+x86-chromebook/gcc-10/lab-collabora/ltp-ipc-hp-11A-G6-EE-grunt.html
Rootfs: http://storage.kernelci.org/images/rootfs/debian/bullseye-ltp/20220228.1/amd64/initrd.cpio.gz


* ltp-ipc.login: https://kernelci.org/test/case/id/6232d0ebb24fcff7a6b73977
failing since 0 day (last pass: v4.19.233-cip69-1019-g2e5815777e975, first fail: v4.4.302-18-ga78419826225)



platform | arch | lab | compiler | defconfig | regressions
--------------------------+--------+---------------+----------+------------------------------+------------
hp-x360-12b-n4000-octopus | x86_64 | lab-collabora | gcc-10 | x86_64_defcon...6-chromebook | 1

Details: https://kernelci.org/test/plan/id/6232daa659c334c8acb7395b

Results: 0 PASS, 1 FAIL, 0 SKIP
Full config: x86_64_defconfig+x86-chromebook
Compiler: gcc-10 (gcc (Debian 10.2.1-6) 10.2.1 20210110)
Plain log: https://storage.kernelci.org//cip-gitlab/ci-pavel-linux-test/v4.4.302-cip68-19-gcfdd1ea3a7ba/x86_64/x86_64_defconfig+x86-chromebook/gcc-10/lab-collabora/ltp-ipc-hp-x360-12b-n4000-octopus.txt
HTML log: https://storage.kernelci.org//cip-gitlab/ci-pavel-linux-test/v4.4.302-cip68-19-gcfdd1ea3a7ba/x86_64/x86_64_defconfig+x86-chromebook/gcc-10/lab-collabora/ltp-ipc-hp-x360-12b-n4000-octopus.html
Rootfs: http://storage.kernelci.org/images/rootfs/debian/bullseye-ltp/20220228.1/amd64/initrd.cpio.gz


* ltp-ipc.login: https://kernelci.org/test/case/id/6232daa659c334c8acb7395c
failing since 0 day (last pass: v4.19.233-cip69-1019-g2e5815777e975, first fail: v4.4.302-18-ga78419826225)


cip-gitlab/ci/pavel/linux-test ltp-mm: 4 runs, 4 regressions (v4.4.302-cip68-19-gcfdd1ea3a7ba) #kernelci

kernelci.org bot <bot@...>
 

cip-gitlab/ci/pavel/linux-test ltp-mm: 4 runs, 4 regressions (v4.4.302-cip68-19-gcfdd1ea3a7ba)

Regressions Summary
-------------------

platform | arch | lab | compiler | defconfig | regressions
--------------------------+--------+---------------+----------+------------------------------+------------
asus-C436FA-Flip-hatch | x86_64 | lab-collabora | gcc-10 | x86_64_defcon...6-chromebook | 1
asus-C523NA-A20057-coral | x86_64 | lab-collabora | gcc-10 | x86_64_defcon...6-chromebook | 1
hp-11A-G6-EE-grunt | x86_64 | lab-collabora | gcc-10 | x86_64_defcon...6-chromebook | 1
hp-x360-12b-n4000-octopus | x86_64 | lab-collabora | gcc-10 | x86_64_defcon...6-chromebook | 1

Details: https://kernelci.org/test/job/cip-gitlab/branch/ci%2Fpavel%2Flinux-test/kernel/v4.4.302-cip68-19-gcfdd1ea3a7ba/plan/ltp-mm/

Test: ltp-mm
Tree: cip-gitlab
Branch: ci/pavel/linux-test
Describe: v4.4.302-cip68-19-gcfdd1ea3a7ba
URL: https://gitlab.com/cip-project/cip-kernel/linux-cip.git
SHA: cfdd1ea3a7bab80ea3e513f28e7aa423fedf5d61

Test suite revisions:
ltp-tests
URL: https://github.com/linux-test-project/ltp.git
SHA: 67eccca54eb68a1bc91cf1f140fc43fa8085d8ed


Test Regressions
----------------


platform | arch | lab | compiler | defconfig | regressions
--------------------------+--------+---------------+----------+------------------------------+------------
asus-C436FA-Flip-hatch | x86_64 | lab-collabora | gcc-10 | x86_64_defcon...6-chromebook | 1

Details: https://kernelci.org/test/plan/id/6232d22624aee9082ab7393b

Results: 0 PASS, 1 FAIL, 0 SKIP
Full config: x86_64_defconfig+x86-chromebook
Compiler: gcc-10 (gcc (Debian 10.2.1-6) 10.2.1 20210110)
Plain log: https://storage.kernelci.org//cip-gitlab/ci-pavel-linux-test/v4.4.302-cip68-19-gcfdd1ea3a7ba/x86_64/x86_64_defconfig+x86-chromebook/gcc-10/lab-collabora/ltp-mm-asus-C436FA-Flip-hatch.txt
HTML log: https://storage.kernelci.org//cip-gitlab/ci-pavel-linux-test/v4.4.302-cip68-19-gcfdd1ea3a7ba/x86_64/x86_64_defconfig+x86-chromebook/gcc-10/lab-collabora/ltp-mm-asus-C436FA-Flip-hatch.html
Rootfs: http://storage.kernelci.org/images/rootfs/debian/bullseye-ltp/20220228.1/amd64/initrd.cpio.gz


* ltp-mm.login: https://kernelci.org/test/case/id/6232d22624aee9082ab7393c
failing since 2 days (last pass: v5.10.100-cip2-319-g7182f5032311, first fail: v4.19.233-cip69-1019-g2e5815777e975)



platform | arch | lab | compiler | defconfig | regressions
--------------------------+--------+---------------+----------+------------------------------+------------
asus-C523NA-A20057-coral | x86_64 | lab-collabora | gcc-10 | x86_64_defcon...6-chromebook | 1

Details: https://kernelci.org/test/plan/id/6232d3908181e32a6eb7394c

Results: 0 PASS, 1 FAIL, 0 SKIP
Full config: x86_64_defconfig+x86-chromebook
Compiler: gcc-10 (gcc (Debian 10.2.1-6) 10.2.1 20210110)
Plain log: https://storage.kernelci.org//cip-gitlab/ci-pavel-linux-test/v4.4.302-cip68-19-gcfdd1ea3a7ba/x86_64/x86_64_defconfig+x86-chromebook/gcc-10/lab-collabora/ltp-mm-asus-C523NA-A20057-coral.txt
HTML log: https://storage.kernelci.org//cip-gitlab/ci-pavel-linux-test/v4.4.302-cip68-19-gcfdd1ea3a7ba/x86_64/x86_64_defconfig+x86-chromebook/gcc-10/lab-collabora/ltp-mm-asus-C523NA-A20057-coral.html
Rootfs: http://storage.kernelci.org/images/rootfs/debian/bullseye-ltp/20220228.1/amd64/initrd.cpio.gz


* ltp-mm.login: https://kernelci.org/test/case/id/6232d3908181e32a6eb7394d
failing since 0 day (last pass: v4.19.233-cip69-1019-g2e5815777e975, first fail: v4.4.302-18-ga78419826225)



platform | arch | lab | compiler | defconfig | regressions
--------------------------+--------+---------------+----------+------------------------------+------------
hp-11A-G6-EE-grunt | x86_64 | lab-collabora | gcc-10 | x86_64_defcon...6-chromebook | 1

Details: https://kernelci.org/test/plan/id/6232d12698ee26924fb7394b

Results: 0 PASS, 1 FAIL, 0 SKIP
Full config: x86_64_defconfig+x86-chromebook
Compiler: gcc-10 (gcc (Debian 10.2.1-6) 10.2.1 20210110)
Plain log: https://storage.kernelci.org//cip-gitlab/ci-pavel-linux-test/v4.4.302-cip68-19-gcfdd1ea3a7ba/x86_64/x86_64_defconfig+x86-chromebook/gcc-10/lab-collabora/ltp-mm-hp-11A-G6-EE-grunt.txt
HTML log: https://storage.kernelci.org//cip-gitlab/ci-pavel-linux-test/v4.4.302-cip68-19-gcfdd1ea3a7ba/x86_64/x86_64_defconfig+x86-chromebook/gcc-10/lab-collabora/ltp-mm-hp-11A-G6-EE-grunt.html
Rootfs: http://storage.kernelci.org/images/rootfs/debian/bullseye-ltp/20220228.1/amd64/initrd.cpio.gz


* ltp-mm.login: https://kernelci.org/test/case/id/6232d12698ee26924fb7394c
failing since 0 day (last pass: v4.19.233-cip69-1019-g2e5815777e975, first fail: v4.4.302-18-ga78419826225)



platform | arch | lab | compiler | defconfig | regressions
--------------------------+--------+---------------+----------+------------------------------+------------
hp-x360-12b-n4000-octopus | x86_64 | lab-collabora | gcc-10 | x86_64_defcon...6-chromebook | 1

Details: https://kernelci.org/test/plan/id/6232dc36c2d5735643b73921

Results: 0 PASS, 1 FAIL, 0 SKIP
Full config: x86_64_defconfig+x86-chromebook
Compiler: gcc-10 (gcc (Debian 10.2.1-6) 10.2.1 20210110)
Plain log: https://storage.kernelci.org//cip-gitlab/ci-pavel-linux-test/v4.4.302-cip68-19-gcfdd1ea3a7ba/x86_64/x86_64_defconfig+x86-chromebook/gcc-10/lab-collabora/ltp-mm-hp-x360-12b-n4000-octopus.txt
HTML log: https://storage.kernelci.org//cip-gitlab/ci-pavel-linux-test/v4.4.302-cip68-19-gcfdd1ea3a7ba/x86_64/x86_64_defconfig+x86-chromebook/gcc-10/lab-collabora/ltp-mm-hp-x360-12b-n4000-octopus.html
Rootfs: http://storage.kernelci.org/images/rootfs/debian/bullseye-ltp/20220228.1/amd64/initrd.cpio.gz


* ltp-mm.login: https://kernelci.org/test/case/id/6232dc36c2d5735643b73922
failing since 0 day (last pass: v4.19.233-cip69-1019-g2e5815777e975, first fail: v4.4.302-18-ga78419826225)


cip-gitlab/ci/pavel/linux-test ltp-fcntl-locktests: 3 runs, 3 regressions (v4.4.302-cip68-19-gcfdd1ea3a7ba) #kernelci

kernelci.org bot <bot@...>
 

cip-gitlab/ci/pavel/linux-test ltp-fcntl-locktests: 3 runs, 3 regressions (v4.4.302-cip68-19-gcfdd1ea3a7ba)

Regressions Summary
-------------------

platform | arch | lab | compiler | defconfig | regressions
--------------------------+--------+---------------+----------+------------------------------+------------
asus-C433TA-AJ0005-rammus | x86_64 | lab-collabora | gcc-10 | x86_64_defcon...6-chromebook | 1
asus-C523NA-A20057-coral | x86_64 | lab-collabora | gcc-10 | x86_64_defcon...6-chromebook | 1
hp-11A-G6-EE-grunt | x86_64 | lab-collabora | gcc-10 | x86_64_defcon...6-chromebook | 1

Details: https://kernelci.org/test/job/cip-gitlab/branch/ci%2Fpavel%2Flinux-test/kernel/v4.4.302-cip68-19-gcfdd1ea3a7ba/plan/ltp-fcntl-locktests/

Test: ltp-fcntl-locktests
Tree: cip-gitlab
Branch: ci/pavel/linux-test
Describe: v4.4.302-cip68-19-gcfdd1ea3a7ba
URL: https://gitlab.com/cip-project/cip-kernel/linux-cip.git
SHA: cfdd1ea3a7bab80ea3e513f28e7aa423fedf5d61

Test suite revisions:
ltp-tests
URL: https://github.com/linux-test-project/ltp.git
SHA: 67eccca54eb68a1bc91cf1f140fc43fa8085d8ed


Test Regressions
----------------


platform | arch | lab | compiler | defconfig | regressions
--------------------------+--------+---------------+----------+------------------------------+------------
asus-C433TA-AJ0005-rammus | x86_64 | lab-collabora | gcc-10 | x86_64_defcon...6-chromebook | 1

Details: https://kernelci.org/test/plan/id/6232cfe5439499724fb7391e

Results: 0 PASS, 1 FAIL, 0 SKIP
Full config: x86_64_defconfig+x86-chromebook
Compiler: gcc-10 (gcc (Debian 10.2.1-6) 10.2.1 20210110)
Plain log: https://storage.kernelci.org//cip-gitlab/ci-pavel-linux-test/v4.4.302-cip68-19-gcfdd1ea3a7ba/x86_64/x86_64_defconfig+x86-chromebook/gcc-10/lab-collabora/ltp-fcntl-locktests-asus-C433TA-AJ0005-rammus.txt
HTML log: https://storage.kernelci.org//cip-gitlab/ci-pavel-linux-test/v4.4.302-cip68-19-gcfdd1ea3a7ba/x86_64/x86_64_defconfig+x86-chromebook/gcc-10/lab-collabora/ltp-fcntl-locktests-asus-C433TA-AJ0005-rammus.html
Rootfs: http://storage.kernelci.org/images/rootfs/debian/bullseye-ltp/20220228.1/amd64/initrd.cpio.gz


* ltp-fcntl-locktests.login: https://kernelci.org/test/case/id/6232cfe5439499724fb7391f
failing since 2 days (last pass: v5.10.100-cip2-319-g7182f5032311, first fail: v4.19.233-cip69-1019-g2e5815777e975)



platform | arch | lab | compiler | defconfig | regressions
--------------------------+--------+---------------+----------+------------------------------+------------
asus-C523NA-A20057-coral | x86_64 | lab-collabora | gcc-10 | x86_64_defcon...6-chromebook | 1

Details: https://kernelci.org/test/plan/id/6232d429c0ff4c1e2ab7392a

Results: 0 PASS, 1 FAIL, 0 SKIP
Full config: x86_64_defconfig+x86-chromebook
Compiler: gcc-10 (gcc (Debian 10.2.1-6) 10.2.1 20210110)
Plain log: https://storage.kernelci.org//cip-gitlab/ci-pavel-linux-test/v4.4.302-cip68-19-gcfdd1ea3a7ba/x86_64/x86_64_defconfig+x86-chromebook/gcc-10/lab-collabora/ltp-fcntl-locktests-asus-C523NA-A20057-coral.txt
HTML log: https://storage.kernelci.org//cip-gitlab/ci-pavel-linux-test/v4.4.302-cip68-19-gcfdd1ea3a7ba/x86_64/x86_64_defconfig+x86-chromebook/gcc-10/lab-collabora/ltp-fcntl-locktests-asus-C523NA-A20057-coral.html
Rootfs: http://storage.kernelci.org/images/rootfs/debian/bullseye-ltp/20220228.1/amd64/initrd.cpio.gz


* ltp-fcntl-locktests.login: https://kernelci.org/test/case/id/6232d429c0ff4c1e2ab7392b
failing since 0 day (last pass: v4.19.233-cip69-1019-g2e5815777e975, first fail: v4.4.302-18-ga78419826225)



platform | arch | lab | compiler | defconfig | regressions
--------------------------+--------+---------------+----------+------------------------------+------------
hp-11A-G6-EE-grunt | x86_64 | lab-collabora | gcc-10 | x86_64_defcon...6-chromebook | 1

Details: https://kernelci.org/test/plan/id/6232d068dcd024414cb7396d

Results: 0 PASS, 1 FAIL, 0 SKIP
Full config: x86_64_defconfig+x86-chromebook
Compiler: gcc-10 (gcc (Debian 10.2.1-6) 10.2.1 20210110)
Plain log: https://storage.kernelci.org//cip-gitlab/ci-pavel-linux-test/v4.4.302-cip68-19-gcfdd1ea3a7ba/x86_64/x86_64_defconfig+x86-chromebook/gcc-10/lab-collabora/ltp-fcntl-locktests-hp-11A-G6-EE-grunt.txt
HTML log: https://storage.kernelci.org//cip-gitlab/ci-pavel-linux-test/v4.4.302-cip68-19-gcfdd1ea3a7ba/x86_64/x86_64_defconfig+x86-chromebook/gcc-10/lab-collabora/ltp-fcntl-locktests-hp-11A-G6-EE-grunt.html
Rootfs: http://storage.kernelci.org/images/rootfs/debian/bullseye-ltp/20220228.1/amd64/initrd.cpio.gz


* ltp-fcntl-locktests.login: https://kernelci.org/test/case/id/6232d068dcd024414cb7396e
failing since 0 day (last pass: v4.19.233-cip69-1019-g2e5815777e975, first fail: v4.4.302-18-ga78419826225)


cip-gitlab/ci/pavel/linux-test baseline-nfs: 9 runs, 5 regressions (v4.4.302-cip68-19-gcfdd1ea3a7ba) #kernelci

kernelci.org bot <bot@...>
 

cip-gitlab/ci/pavel/linux-test baseline-nfs: 9 runs, 5 regressions (v4.4.302-cip68-19-gcfdd1ea3a7ba)

Regressions Summary
-------------------

platform | arch | lab | compiler | defconfig | regressions
--------------------------+--------+---------------+----------+------------------------------+------------
asus-C433TA-AJ0005-rammus | x86_64 | lab-collabora | gcc-10 | x86_64_defcon...6-chromebook | 1
asus-C523NA-A20057-coral | x86_64 | lab-collabora | gcc-10 | x86_64_defcon...6-chromebook | 1
asus-cx9400-volteer | x86_64 | lab-collabora | gcc-10 | x86_64_defcon...6-chromebook | 1
hp-11A-G6-EE-grunt | x86_64 | lab-collabora | gcc-10 | x86_64_defcon...6-chromebook | 1
hp-x360-14-G1-sona | x86_64 | lab-collabora | gcc-10 | x86_64_defcon...6-chromebook | 1

Details: https://kernelci.org/test/job/cip-gitlab/branch/ci%2Fpavel%2Flinux-test/kernel/v4.4.302-cip68-19-gcfdd1ea3a7ba/plan/baseline-nfs/

Test: baseline-nfs
Tree: cip-gitlab
Branch: ci/pavel/linux-test
Describe: v4.4.302-cip68-19-gcfdd1ea3a7ba
URL: https://gitlab.com/cip-project/cip-kernel/linux-cip.git
SHA: cfdd1ea3a7bab80ea3e513f28e7aa423fedf5d61


Test Regressions
----------------


platform | arch | lab | compiler | defconfig | regressions
--------------------------+--------+---------------+----------+------------------------------+------------
asus-C433TA-AJ0005-rammus | x86_64 | lab-collabora | gcc-10 | x86_64_defcon...6-chromebook | 1

Details: https://kernelci.org/test/plan/id/6232d049d41d2e7d84b7392d

Results: 0 PASS, 1 FAIL, 0 SKIP
Full config: x86_64_defconfig+x86-chromebook
Compiler: gcc-10 (gcc (Debian 10.2.1-6) 10.2.1 20210110)
Plain log: https://storage.kernelci.org//cip-gitlab/ci-pavel-linux-test/v4.4.302-cip68-19-gcfdd1ea3a7ba/x86_64/x86_64_defconfig+x86-chromebook/gcc-10/lab-collabora/baseline-nfs-asus-C433TA-AJ0005-rammus.txt
HTML log: https://storage.kernelci.org//cip-gitlab/ci-pavel-linux-test/v4.4.302-cip68-19-gcfdd1ea3a7ba/x86_64/x86_64_defconfig+x86-chromebook/gcc-10/lab-collabora/baseline-nfs-asus-C433TA-AJ0005-rammus.html
Rootfs: http://storage.kernelci.org/images/rootfs/debian/bullseye/20220228.1/amd64/initrd.cpio.gz


* baseline-nfs.login: https://kernelci.org/test/case/id/6232d049d41d2e7d84b7392e
failing since 0 day (last pass: v4.19.233-cip69-1019-g2e5815777e975, first fail: v4.4.302-18-ga78419826225)



platform | arch | lab | compiler | defconfig | regressions
--------------------------+--------+---------------+----------+------------------------------+------------
asus-C523NA-A20057-coral | x86_64 | lab-collabora | gcc-10 | x86_64_defcon...6-chromebook | 1

Details: https://kernelci.org/test/plan/id/6232d3b147ebc35befb73935

Results: 0 PASS, 1 FAIL, 0 SKIP
Full config: x86_64_defconfig+x86-chromebook
Compiler: gcc-10 (gcc (Debian 10.2.1-6) 10.2.1 20210110)
Plain log: https://storage.kernelci.org//cip-gitlab/ci-pavel-linux-test/v4.4.302-cip68-19-gcfdd1ea3a7ba/x86_64/x86_64_defconfig+x86-chromebook/gcc-10/lab-collabora/baseline-nfs-asus-C523NA-A20057-coral.txt
HTML log: https://storage.kernelci.org//cip-gitlab/ci-pavel-linux-test/v4.4.302-cip68-19-gcfdd1ea3a7ba/x86_64/x86_64_defconfig+x86-chromebook/gcc-10/lab-collabora/baseline-nfs-asus-C523NA-A20057-coral.html
Rootfs: http://storage.kernelci.org/images/rootfs/debian/bullseye/20220228.1/amd64/initrd.cpio.gz


* baseline-nfs.login: https://kernelci.org/test/case/id/6232d3b147ebc35befb73936
failing since 0 day (last pass: v4.19.233-cip69-1019-g2e5815777e975, first fail: v4.4.302-18-ga78419826225)



platform | arch | lab | compiler | defconfig | regressions
--------------------------+--------+---------------+----------+------------------------------+------------
asus-cx9400-volteer | x86_64 | lab-collabora | gcc-10 | x86_64_defcon...6-chromebook | 1

Details: https://kernelci.org/test/plan/id/6232d0d5b24fcff7a6b7391d

Results: 0 PASS, 1 FAIL, 0 SKIP
Full config: x86_64_defconfig+x86-chromebook
Compiler: gcc-10 (gcc (Debian 10.2.1-6) 10.2.1 20210110)
Plain log: https://storage.kernelci.org//cip-gitlab/ci-pavel-linux-test/v4.4.302-cip68-19-gcfdd1ea3a7ba/x86_64/x86_64_defconfig+x86-chromebook/gcc-10/lab-collabora/baseline-nfs-asus-cx9400-volteer.txt
HTML log: https://storage.kernelci.org//cip-gitlab/ci-pavel-linux-test/v4.4.302-cip68-19-gcfdd1ea3a7ba/x86_64/x86_64_defconfig+x86-chromebook/gcc-10/lab-collabora/baseline-nfs-asus-cx9400-volteer.html
Rootfs: http://storage.kernelci.org/images/rootfs/debian/bullseye/20220228.1/amd64/initrd.cpio.gz


* baseline-nfs.login: https://kernelci.org/test/case/id/6232d0d5b24fcff7a6b7391e
failing since 2 days (last pass: v5.10.100-cip2-319-g7182f5032311, first fail: v4.19.233-cip69-1019-g2e5815777e975)



platform | arch | lab | compiler | defconfig | regressions
--------------------------+--------+---------------+----------+------------------------------+------------
hp-11A-G6-EE-grunt | x86_64 | lab-collabora | gcc-10 | x86_64_defcon...6-chromebook | 1

Details: https://kernelci.org/test/plan/id/6232d7f07e9cc2403db7391d

Results: 0 PASS, 1 FAIL, 0 SKIP
Full config: x86_64_defconfig+x86-chromebook
Compiler: gcc-10 (gcc (Debian 10.2.1-6) 10.2.1 20210110)
Plain log: https://storage.kernelci.org//cip-gitlab/ci-pavel-linux-test/v4.4.302-cip68-19-gcfdd1ea3a7ba/x86_64/x86_64_defconfig+x86-chromebook/gcc-10/lab-collabora/baseline-nfs-hp-11A-G6-EE-grunt.txt
HTML log: https://storage.kernelci.org//cip-gitlab/ci-pavel-linux-test/v4.4.302-cip68-19-gcfdd1ea3a7ba/x86_64/x86_64_defconfig+x86-chromebook/gcc-10/lab-collabora/baseline-nfs-hp-11A-G6-EE-grunt.html
Rootfs: http://storage.kernelci.org/images/rootfs/debian/bullseye/20220228.1/amd64/initrd.cpio.gz


* baseline-nfs.login: https://kernelci.org/test/case/id/6232d7f07e9cc2403db7391e
failing since 0 day (last pass: v4.19.233-cip69-1019-g2e5815777e975, first fail: v4.4.302-18-ga78419826225)



platform | arch | lab | compiler | defconfig | regressions
--------------------------+--------+---------------+----------+------------------------------+------------
hp-x360-14-G1-sona | x86_64 | lab-collabora | gcc-10 | x86_64_defcon...6-chromebook | 1

Details: https://kernelci.org/test/plan/id/6232d6c4060fe8cef1b73943

Results: 0 PASS, 1 FAIL, 0 SKIP
Full config: x86_64_defconfig+x86-chromebook
Compiler: gcc-10 (gcc (Debian 10.2.1-6) 10.2.1 20210110)
Plain log: https://storage.kernelci.org//cip-gitlab/ci-pavel-linux-test/v4.4.302-cip68-19-gcfdd1ea3a7ba/x86_64/x86_64_defconfig+x86-chromebook/gcc-10/lab-collabora/baseline-nfs-hp-x360-14-G1-sona.txt
HTML log: https://storage.kernelci.org//cip-gitlab/ci-pavel-linux-test/v4.4.302-cip68-19-gcfdd1ea3a7ba/x86_64/x86_64_defconfig+x86-chromebook/gcc-10/lab-collabora/baseline-nfs-hp-x360-14-G1-sona.html
Rootfs: http://storage.kernelci.org/images/rootfs/debian/bullseye/20220228.1/amd64/initrd.cpio.gz


* baseline-nfs.login: https://kernelci.org/test/case/id/6232d6c4060fe8cef1b73944
failing since 0 day (last pass: v4.19.233-cip69-1019-g2e5815777e975, first fail: v4.4.302-18-ga78419826225)


cip-gitlab/ci/pavel/linux-test baseline: 24 runs, 11 regressions (v4.4.302-cip68-19-gcfdd1ea3a7ba) #kernelci

kernelci.org bot <bot@...>
 

cip-gitlab/ci/pavel/linux-test baseline: 24 runs, 11 regressions (v4.4.302-cip68-19-gcfdd1ea3a7ba)

Regressions Summary
-------------------

platform | arch | lab | compiler | defconfig | regressions
---------------------------+--------+---------------+----------+------------------------------+------------
asus-C436FA-Flip-hatch | x86_64 | lab-collabora | gcc-10 | x86_64_defcon...6-chromebook | 1
asus-cx9400-volteer | x86_64 | lab-collabora | gcc-10 | x86_64_defcon...6-chromebook | 1
beagle-xm | arm | lab-baylibre | gcc-10 | omap2plus_defconfig | 2
meson8b-odroidc1 | arm | lab-baylibre | gcc-10 | multi_v7_defconfig | 1
qemu_arm-virt-gicv2 | arm | lab-baylibre | gcc-10 | multi_v7_defconfig | 1
qemu_arm-virt-gicv2-uefi | arm | lab-baylibre | gcc-10 | multi_v7_defconfig | 1
qemu_arm-virt-gicv3 | arm | lab-baylibre | gcc-10 | multi_v7_defconfig | 1
qemu_arm-virt-gicv3-uefi | arm | lab-baylibre | gcc-10 | multi_v7_defconfig | 1
qemu_arm64-virt-gicv2-uefi | arm64 | lab-baylibre | gcc-10 | defconfig+arm64-chromebook | 1
qemu_arm64-virt-gicv3-uefi | arm64 | lab-baylibre | gcc-10 | defconfig+arm64-chromebook | 1

Details: https://kernelci.org/test/job/cip-gitlab/branch/ci%2Fpavel%2Flinux-test/kernel/v4.4.302-cip68-19-gcfdd1ea3a7ba/plan/baseline/

Test: baseline
Tree: cip-gitlab
Branch: ci/pavel/linux-test
Describe: v4.4.302-cip68-19-gcfdd1ea3a7ba
URL: https://gitlab.com/cip-project/cip-kernel/linux-cip.git
SHA: cfdd1ea3a7bab80ea3e513f28e7aa423fedf5d61


Test Regressions
----------------


platform | arch | lab | compiler | defconfig | regressions
---------------------------+--------+---------------+----------+------------------------------+------------
asus-C436FA-Flip-hatch | x86_64 | lab-collabora | gcc-10 | x86_64_defcon...6-chromebook | 1

Details: https://kernelci.org/test/plan/id/6232d133e44c15ba51b7391d

Results: 0 PASS, 1 FAIL, 0 SKIP
Full config: x86_64_defconfig+x86-chromebook
Compiler: gcc-10 (gcc (Debian 10.2.1-6) 10.2.1 20210110)
Plain log: https://storage.kernelci.org//cip-gitlab/ci-pavel-linux-test/v4.4.302-cip68-19-gcfdd1ea3a7ba/x86_64/x86_64_defconfig+x86-chromebook/gcc-10/lab-collabora/baseline-asus-C436FA-Flip-hatch.txt
HTML log: https://storage.kernelci.org//cip-gitlab/ci-pavel-linux-test/v4.4.302-cip68-19-gcfdd1ea3a7ba/x86_64/x86_64_defconfig+x86-chromebook/gcc-10/lab-collabora/baseline-asus-C436FA-Flip-hatch.html
Rootfs: http://storage.kernelci.org/images/rootfs/buildroot/buildroot-baseline/20220228.1/x86/rootfs.cpio.gz


* baseline.login: https://kernelci.org/test/case/id/6232d133e44c15ba51b7391e
failing since 2 days (last pass: v5.10.100-cip2-319-g7182f5032311, first fail: v4.19.233-cip69-1019-g2e5815777e975)



platform | arch | lab | compiler | defconfig | regressions
---------------------------+--------+---------------+----------+------------------------------+------------
asus-cx9400-volteer | x86_64 | lab-collabora | gcc-10 | x86_64_defcon...6-chromebook | 1

Details: https://kernelci.org/test/plan/id/6232d0d37953c5873cb739a7

Results: 0 PASS, 1 FAIL, 0 SKIP
Full config: x86_64_defconfig+x86-chromebook
Compiler: gcc-10 (gcc (Debian 10.2.1-6) 10.2.1 20210110)
Plain log: https://storage.kernelci.org//cip-gitlab/ci-pavel-linux-test/v4.4.302-cip68-19-gcfdd1ea3a7ba/x86_64/x86_64_defconfig+x86-chromebook/gcc-10/lab-collabora/baseline-asus-cx9400-volteer.txt
HTML log: https://storage.kernelci.org//cip-gitlab/ci-pavel-linux-test/v4.4.302-cip68-19-gcfdd1ea3a7ba/x86_64/x86_64_defconfig+x86-chromebook/gcc-10/lab-collabora/baseline-asus-cx9400-volteer.html
Rootfs: http://storage.kernelci.org/images/rootfs/buildroot/buildroot-baseline/20220228.1/x86/rootfs.cpio.gz


* baseline.login: https://kernelci.org/test/case/id/6232d0d37953c5873cb739a8
failing since 2 days (last pass: v5.10.100-cip2-319-g7182f5032311, first fail: v4.19.233-cip69-1019-g2e5815777e975)



platform | arch | lab | compiler | defconfig | regressions
---------------------------+--------+---------------+----------+------------------------------+------------
beagle-xm | arm | lab-baylibre | gcc-10 | omap2plus_defconfig | 2

Details: https://kernelci.org/test/plan/id/6232d5f1e0ebfe8ff7b73957

Results: 3 PASS, 2 FAIL, 2 SKIP
Full config: omap2plus_defconfig
Compiler: gcc-10 (arm-linux-gnueabihf-gcc (Debian 10.2.1-6) 10.2.1 20210110)
Plain log: https://storage.kernelci.org//cip-gitlab/ci-pavel-linux-test/v4.4.302-cip68-19-gcfdd1ea3a7ba/arm/omap2plus_defconfig/gcc-10/lab-baylibre/baseline-beagle-xm.txt
HTML log: https://storage.kernelci.org//cip-gitlab/ci-pavel-linux-test/v4.4.302-cip68-19-gcfdd1ea3a7ba/arm/omap2plus_defconfig/gcc-10/lab-baylibre/baseline-beagle-xm.html
Rootfs: http://storage.kernelci.org/images/rootfs/buildroot/buildroot-baseline/20220228.1/armel/rootfs.cpio.gz


* baseline.dmesg.crit: https://kernelci.org/test/case/id/6232d5f1e0ebfe8ff7b7395e
new failure (last pass: v4.4.302-18-ga78419826225)
1 lines

2022-03-17T06:32:05.962435 / #
2022-03-17T06:32:05.963031 #
2022-03-17T06:32:06.066165 / # #
2022-03-17T06:32:06.066754
2022-03-17T06:32:06.168056 / # #export SHELL=/bin/sh
2022-03-17T06:32:06.168472
2022-03-17T06:32:06.269654 / # export SHELL=/bin/sh. /lava-1712706/environment
2022-03-17T06:32:06.270088
2022-03-17T06:32:06.371231 / # . /lava-1712706/environment/lava-1712706/bin/lava-test-runner /lava-1712706/0
2022-03-17T06:32:06.372289
... (10 line(s) more)

* baseline.dmesg.emerg: https://kernelci.org/test/case/id/6232d5f1e0ebfe8ff7b73960
new failure (last pass: v4.4.302-18-ga78419826225)
29 lines

2022-03-17T06:32:06.835249 [ 49.892852] <LAVA_SIGNAL_TESTCASE TEST_CASE_ID=alert RESULT=pass UNITS=lines MEASUREMENT=0>
2022-03-17T06:32:06.899338 kern :emerg : Internal error: Oops - BUG: 0 [#1] SMP ARM
2022-03-17T06:32:06.905130 kern :emerg : Process udevd (pid: 109, stack limit = 0xcbfc0218)
2022-03-17T06:32:06.909666 kern :emerg : Stack: (0xcbfc1cf8 to 0xcbfc2000)
2022-03-17T06:32:06.918727 kern :emerg : 1ce0: bf02bdc4 60000013
2022-03-17T06:32:06.931248 kern :emerg : 1d00: bf02bdc8 c06a55bc 00000001 00[ 49.984893] <LAVA_SIGNAL_TESTCASE TEST_CASE_ID=emerg RESULT=fail UNITS=lines MEASUREMENT=29>



platform | arch | lab | compiler | defconfig | regressions
---------------------------+--------+---------------+----------+------------------------------+------------
meson8b-odroidc1 | arm | lab-baylibre | gcc-10 | multi_v7_defconfig | 1

Details: https://kernelci.org/test/plan/id/6232cf64983c1efbe0b73929

Results: 4 PASS, 1 FAIL, 2 SKIP
Full config: multi_v7_defconfig
Compiler: gcc-10 (arm-linux-gnueabihf-gcc (Debian 10.2.1-6) 10.2.1 20210110)
Plain log: https://storage.kernelci.org//cip-gitlab/ci-pavel-linux-test/v4.4.302-cip68-19-gcfdd1ea3a7ba/arm/multi_v7_defconfig/gcc-10/lab-baylibre/baseline-meson8b-odroidc1.txt
HTML log: https://storage.kernelci.org//cip-gitlab/ci-pavel-linux-test/v4.4.302-cip68-19-gcfdd1ea3a7ba/arm/multi_v7_defconfig/gcc-10/lab-baylibre/baseline-meson8b-odroidc1.html
Rootfs: http://storage.kernelci.org/images/rootfs/buildroot/buildroot-baseline/20220228.1/armel/rootfs.cpio.gz


* baseline.bootrr.all-cpus-are-online: https://kernelci.org/test/case/id/6232cf64983c1efbe0b7392d
failing since 0 day (last pass: v4.19.233-cip69-1019-g2e5815777e975, first fail: v4.4.302-18-ga78419826225)

2022-03-17T06:04:08.423988 /lava-1712644/1/../bin/lava-test-case
2022-03-17T06:04:08.424600 [ 17.312081] <LAVA_SIGNAL_TESTCASE TEST_CASE_ID=all-cpus-are-online RESULT=fail>
2022-03-17T06:04:08.424844 /lava-1712644/1/../bin/lava-test-case
2022-03-17T06:04:08.425068 [ 17.329264] <LAVA_SIGNAL_TESTCASE TEST_CASE_ID=tpm-chip-is-online RESULT=skip>
2022-03-17T06:04:08.425284 + set +x
2022-03-17T06:04:08.425498 [ 17.340484] <LAVA_SIGNAL_ENDRUN 1_bootrr 1712644_1.5.2.4.5>



platform | arch | lab | compiler | defconfig | regressions
---------------------------+--------+---------------+----------+------------------------------+------------
qemu_arm-virt-gicv2 | arm | lab-baylibre | gcc-10 | multi_v7_defconfig | 1

Details: https://kernelci.org/test/plan/id/6232d7474f3f762c41b73927

Results: 0 PASS, 1 FAIL, 0 SKIP
Full config: multi_v7_defconfig
Compiler: gcc-10 (arm-linux-gnueabihf-gcc (Debian 10.2.1-6) 10.2.1 20210110)
Plain log: https://storage.kernelci.org//cip-gitlab/ci-pavel-linux-test/v4.4.302-cip68-19-gcfdd1ea3a7ba/arm/multi_v7_defconfig/gcc-10/lab-baylibre/baseline-qemu_arm-virt-gicv2.txt
HTML log: https://storage.kernelci.org//cip-gitlab/ci-pavel-linux-test/v4.4.302-cip68-19-gcfdd1ea3a7ba/arm/multi_v7_defconfig/gcc-10/lab-baylibre/baseline-qemu_arm-virt-gicv2.html
Rootfs: http://storage.kernelci.org/images/rootfs/buildroot/buildroot-baseline/20220228.1/armel/rootfs.cpio.gz


* baseline.login: https://kernelci.org/test/case/id/6232d7474f3f762c41b73928
failing since 0 day (last pass: v4.19.233-cip69-1019-g2e5815777e975, first fail: v4.4.302-18-ga78419826225)



platform | arch | lab | compiler | defconfig | regressions
---------------------------+--------+---------------+----------+------------------------------+------------
qemu_arm-virt-gicv2-uefi | arm | lab-baylibre | gcc-10 | multi_v7_defconfig | 1

Details: https://kernelci.org/test/plan/id/6232d8108d7a173f71b7391e

Results: 0 PASS, 1 FAIL, 0 SKIP
Full config: multi_v7_defconfig
Compiler: gcc-10 (arm-linux-gnueabihf-gcc (Debian 10.2.1-6) 10.2.1 20210110)
Plain log: https://storage.kernelci.org//cip-gitlab/ci-pavel-linux-test/v4.4.302-cip68-19-gcfdd1ea3a7ba/arm/multi_v7_defconfig/gcc-10/lab-baylibre/baseline-qemu_arm-virt-gicv2-uefi.txt
HTML log: https://storage.kernelci.org//cip-gitlab/ci-pavel-linux-test/v4.4.302-cip68-19-gcfdd1ea3a7ba/arm/multi_v7_defconfig/gcc-10/lab-baylibre/baseline-qemu_arm-virt-gicv2-uefi.html
Rootfs: http://storage.kernelci.org/images/rootfs/buildroot/buildroot-baseline/20220228.1/armel/rootfs.cpio.gz


* baseline.login: https://kernelci.org/test/case/id/6232d8108d7a173f71b7391f
failing since 0 day (last pass: v4.19.233-cip69-1019-g2e5815777e975, first fail: v4.4.302-18-ga78419826225)



platform | arch | lab | compiler | defconfig | regressions
---------------------------+--------+---------------+----------+------------------------------+------------
qemu_arm-virt-gicv3 | arm | lab-baylibre | gcc-10 | multi_v7_defconfig | 1

Details: https://kernelci.org/test/plan/id/6232d7c06527933676b7393e

Results: 0 PASS, 1 FAIL, 0 SKIP
Full config: multi_v7_defconfig
Compiler: gcc-10 (arm-linux-gnueabihf-gcc (Debian 10.2.1-6) 10.2.1 20210110)
Plain log: https://storage.kernelci.org//cip-gitlab/ci-pavel-linux-test/v4.4.302-cip68-19-gcfdd1ea3a7ba/arm/multi_v7_defconfig/gcc-10/lab-baylibre/baseline-qemu_arm-virt-gicv3.txt
HTML log: https://storage.kernelci.org//cip-gitlab/ci-pavel-linux-test/v4.4.302-cip68-19-gcfdd1ea3a7ba/arm/multi_v7_defconfig/gcc-10/lab-baylibre/baseline-qemu_arm-virt-gicv3.html
Rootfs: http://storage.kernelci.org/images/rootfs/buildroot/buildroot-baseline/20220228.1/armel/rootfs.cpio.gz


* baseline.login: https://kernelci.org/test/case/id/6232d7c06527933676b7393f
failing since 0 day (last pass: v4.19.233-cip69-1019-g2e5815777e975, first fail: v4.4.302-18-ga78419826225)



platform | arch | lab | compiler | defconfig | regressions
---------------------------+--------+---------------+----------+------------------------------+------------
qemu_arm-virt-gicv3-uefi | arm | lab-baylibre | gcc-10 | multi_v7_defconfig | 1

Details: https://kernelci.org/test/plan/id/6232d823f4fe2fd539b739a4

Results: 0 PASS, 1 FAIL, 0 SKIP
Full config: multi_v7_defconfig
Compiler: gcc-10 (arm-linux-gnueabihf-gcc (Debian 10.2.1-6) 10.2.1 20210110)
Plain log: https://storage.kernelci.org//cip-gitlab/ci-pavel-linux-test/v4.4.302-cip68-19-gcfdd1ea3a7ba/arm/multi_v7_defconfig/gcc-10/lab-baylibre/baseline-qemu_arm-virt-gicv3-uefi.txt
HTML log: https://storage.kernelci.org//cip-gitlab/ci-pavel-linux-test/v4.4.302-cip68-19-gcfdd1ea3a7ba/arm/multi_v7_defconfig/gcc-10/lab-baylibre/baseline-qemu_arm-virt-gicv3-uefi.html
Rootfs: http://storage.kernelci.org/images/rootfs/buildroot/buildroot-baseline/20220228.1/armel/rootfs.cpio.gz


* baseline.login: https://kernelci.org/test/case/id/6232d823f4fe2fd539b739a5
failing since 0 day (last pass: v4.19.233-cip69-1019-g2e5815777e975, first fail: v4.4.302-18-ga78419826225)



platform | arch | lab | compiler | defconfig | regressions
---------------------------+--------+---------------+----------+------------------------------+------------
qemu_arm64-virt-gicv2-uefi | arm64 | lab-baylibre | gcc-10 | defconfig+arm64-chromebook | 1

Details: https://kernelci.org/test/plan/id/6232d7718a993fe3fbb73932

Results: 0 PASS, 1 FAIL, 0 SKIP
Full config: defconfig+arm64-chromebook
Compiler: gcc-10 (aarch64-linux-gnu-gcc (Debian 10.2.1-6) 10.2.1 20210110)
Plain log: https://storage.kernelci.org//cip-gitlab/ci-pavel-linux-test/v4.4.302-cip68-19-gcfdd1ea3a7ba/arm64/defconfig+arm64-chromebook/gcc-10/lab-baylibre/baseline-qemu_arm64-virt-gicv2-uefi.txt
HTML log: https://storage.kernelci.org//cip-gitlab/ci-pavel-linux-test/v4.4.302-cip68-19-gcfdd1ea3a7ba/arm64/defconfig+arm64-chromebook/gcc-10/lab-baylibre/baseline-qemu_arm64-virt-gicv2-uefi.html
Rootfs: http://storage.kernelci.org/images/rootfs/buildroot/buildroot-baseline/20220228.1/arm64/rootfs.cpio.gz


* baseline.login: https://kernelci.org/test/case/id/6232d7718a993fe3fbb73933
failing since 0 day (last pass: v4.19.233-cip69-1019-g2e5815777e975, first fail: v4.4.302-18-ga78419826225)



platform | arch | lab | compiler | defconfig | regressions
---------------------------+--------+---------------+----------+------------------------------+------------
qemu_arm64-virt-gicv3-uefi | arm64 | lab-baylibre | gcc-10 | defconfig+arm64-chromebook | 1

Details: https://kernelci.org/test/plan/id/6232d76fb9e1904249b73929

Results: 0 PASS, 1 FAIL, 0 SKIP
Full config: defconfig+arm64-chromebook
Compiler: gcc-10 (aarch64-linux-gnu-gcc (Debian 10.2.1-6) 10.2.1 20210110)
Plain log: https://storage.kernelci.org//cip-gitlab/ci-pavel-linux-test/v4.4.302-cip68-19-gcfdd1ea3a7ba/arm64/defconfig+arm64-chromebook/gcc-10/lab-baylibre/baseline-qemu_arm64-virt-gicv3-uefi.txt
HTML log: https://storage.kernelci.org//cip-gitlab/ci-pavel-linux-test/v4.4.302-cip68-19-gcfdd1ea3a7ba/arm64/defconfig+arm64-chromebook/gcc-10/lab-baylibre/baseline-qemu_arm64-virt-gicv3-uefi.html
Rootfs: http://storage.kernelci.org/images/rootfs/buildroot/buildroot-baseline/20220228.1/arm64/rootfs.cpio.gz


* baseline.login: https://kernelci.org/test/case/id/6232d76fb9e1904249b7392a
failing since 0 day (last pass: v4.19.233-cip69-1019-g2e5815777e975, first fail: v4.4.302-18-ga78419826225)


cip-gitlab/ci/pavel/linux-test baseline-cip-nfs: 3 runs, 1 regressions (v4.4.302-cip68-19-gcfdd1ea3a7ba) #kernelci

kernelci.org bot <bot@...>
 

cip-gitlab/ci/pavel/linux-test baseline-cip-nfs: 3 runs, 1 regressions (v4.4.302-cip68-19-gcfdd1ea3a7ba)

Regressions Summary
-------------------

platform | arch | lab | compiler | defconfig | regressions
-------------------+--------+---------------+----------+------------------------------+------------
hp-11A-G6-EE-grunt | x86_64 | lab-collabora | gcc-10 | x86_64_defcon...6-chromebook | 1

Details: https://kernelci.org/test/job/cip-gitlab/branch/ci%2Fpavel%2Flinux-test/kernel/v4.4.302-cip68-19-gcfdd1ea3a7ba/plan/baseline-cip-nfs/

Test: baseline-cip-nfs
Tree: cip-gitlab
Branch: ci/pavel/linux-test
Describe: v4.4.302-cip68-19-gcfdd1ea3a7ba
URL: https://gitlab.com/cip-project/cip-kernel/linux-cip.git
SHA: cfdd1ea3a7bab80ea3e513f28e7aa423fedf5d61


Test Regressions
----------------


platform | arch | lab | compiler | defconfig | regressions
-------------------+--------+---------------+----------+------------------------------+------------
hp-11A-G6-EE-grunt | x86_64 | lab-collabora | gcc-10 | x86_64_defcon...6-chromebook | 1

Details: https://kernelci.org/test/plan/id/6232d05350d84c4852b73951

Results: 0 PASS, 1 FAIL, 0 SKIP
Full config: x86_64_defconfig+x86-chromebook
Compiler: gcc-10 (gcc (Debian 10.2.1-6) 10.2.1 20210110)
Plain log: https://storage.kernelci.org//cip-gitlab/ci-pavel-linux-test/v4.4.302-cip68-19-gcfdd1ea3a7ba/x86_64/x86_64_defconfig+x86-chromebook/gcc-10/lab-collabora/baseline-cip-nfs-hp-11A-G6-EE-grunt.txt
HTML log: https://storage.kernelci.org//cip-gitlab/ci-pavel-linux-test/v4.4.302-cip68-19-gcfdd1ea3a7ba/x86_64/x86_64_defconfig+x86-chromebook/gcc-10/lab-collabora/baseline-cip-nfs-hp-11A-G6-EE-grunt.html
Rootfs: https://storage.kernelci.org/images/rootfs/cip/20211105/qemu-amd64/cip-core-image-kernelci-cip-core-buster-qemu-amd64-initrd.img.gz


* baseline-cip-nfs.login: https://kernelci.org/test/case/id/6232d05350d84c4852b73952
failing since 0 day (last pass: v4.19.233-cip69-1019-g2e5815777e975, first fail: v4.4.302-18-ga78419826225)


cip-gitlab/ci/pavel/linux-test build: 187 builds: 5 failed, 182 passed, 8 errors, 37 warnings (v4.4.302-cip68-19-gcfdd1ea3a7ba) #kernelci

kernelci.org bot <bot@...>
 

cip-gitlab/ci/pavel/linux-test build: 187 builds: 5 failed, 182 passed, 8 errors, 37 warnings (v4.4.302-cip68-19-gcfdd1ea3a7ba)

Full Build Summary: https://kernelci.org/build/cip-gitlab/branch/ci%2Fpavel%2Flinux-test/kernel/v4.4.302-cip68-19-gcfdd1ea3a7ba/

Tree: cip-gitlab
Branch: ci/pavel/linux-test
Git Describe: v4.4.302-cip68-19-gcfdd1ea3a7ba
Git Commit: cfdd1ea3a7bab80ea3e513f28e7aa423fedf5d61
Git URL: https://gitlab.com/cip-project/cip-kernel/linux-cip.git
Built: 6 unique architectures

Build Failures Detected:

arm:
rpc_defconfig: (gcc-10) FAIL

mips:
fuloong2e_defconfig: (gcc-10) FAIL
ip27_defconfig: (gcc-10) FAIL
ip28_defconfig: (gcc-10) FAIL
lemote2f_defconfig: (gcc-10) FAIL

Errors and Warnings Detected:

arc:

arm64:
defconfig (gcc-10): 1 warning
defconfig+arm64-chromebook (gcc-10): 1 warning

arm:
clps711x_defconfig (gcc-10): 1 warning
davinci_all_defconfig (gcc-10): 1 warning
lpc32xx_defconfig (gcc-10): 1 warning
mini2440_defconfig (gcc-10): 1 warning
mxs_defconfig (gcc-10): 1 warning
omap1_defconfig (gcc-10): 1 warning
omap2plus_defconfig (gcc-10): 1 warning
rpc_defconfig (gcc-10): 4 errors
s3c2410_defconfig (gcc-10): 1 warning
s3c6400_defconfig (gcc-10): 2 warnings

i386:
i386_defconfig (gcc-10): 2 warnings

mips:
fuloong2e_defconfig (gcc-10): 2 errors
ip22_defconfig (gcc-10): 1 warning
lemote2f_defconfig (gcc-10): 2 errors
mtx1_defconfig (gcc-10): 3 warnings

x86_64:
allnoconfig (gcc-10): 4 warnings
tinyconfig (gcc-10): 3 warnings
x86_64_defconfig (gcc-10): 6 warnings
x86_64_defconfig+x86-chromebook (gcc-10): 6 warnings

Errors summary:

4 cc1: error: ‘-mloongson-mmi’ must be used with ‘-mhard-float’
2 arm-linux-gnueabihf-gcc: error: unrecognized -march target: armv3
2 arm-linux-gnueabihf-gcc: error: missing argument to ‘-march=’

Warnings summary:

7 arch/x86/kernel/process.c:456: Warning: no instruction mnemonic suffix given and no register operands; using default for `btr'
4 arch/x86/entry/entry_64.S:487: Warning: no instruction mnemonic suffix given and no register operands; using default for `btr'
4 arch/x86/entry/entry_64.S:1642: Warning: no instruction mnemonic suffix given and no register operands; using default for `sysret'
3 ld: warning: creating DT_TEXTREL in a PIE
3 drivers/tty/serial/samsung.c:1780:34: warning: array ‘s3c24xx_uart_dt_match’ assumed to have one element
2 sound/pci/echoaudio/echoaudio_dsp.c:647:9: warning: iteration 1073741824 invokes undefined behavior [-Waggressive-loop-optimizations]
2 ld: arch/x86/boot/compressed/head_64.o: warning: relocation in read-only section `.head.text'
2 drivers/net/ethernet/apm/xgene/xgene_enet_main.c:32:36: warning: array ‘xgene_enet_acpi_match’ assumed to have one element
1 sound/pci/echoaudio/echoaudio_dsp.c:658:9: warning: iteration 1073741824 invokes undefined behavior [-Waggressive-loop-optimizations]
1 ld: arch/x86/boot/compressed/head_32.o: warning: relocation in read-only section `.head.text'
1 drivers/net/ethernet/seeq/sgiseeq.c:804:26: warning: passing argument 5 of ‘dma_free_attrs’ makes pointer from integer without a cast [-Wint-conversion]
1 drivers/mmc/host/sdhci-s3c.c:429:34: warning: array ‘sdhci_s3c_dt_match’ assumed to have one element
1 drivers/gpio/gpio-omap.c:1161:34: warning: array ‘omap_gpio_match’ assumed to have one element
1 drivers/cpufreq/ti-cpufreq.c:250:24: warning: passing argument 1 of ‘PTR_ERR_OR_ZERO’ makes pointer from integer without a cast [-Wint-conversion]
1 arch/arm/mach-mxs/mach-mxs.c:285:26: warning: duplicate ‘const’ declaration specifier [-Wduplicate-decl-specifier]
1 arch/arm/mach-lpc32xx/phy3250.c:215:36: warning: duplicate ‘const’ declaration specifier [-Wduplicate-decl-specifier]
1 arch/arm/mach-davinci/da8xx-dt.c:23:34: warning: duplicate ‘const’ declaration specifier [-Wduplicate-decl-specifier]
1 arch/arm/mach-clps711x/board-autcpu12.c:163:26: warning: duplicate ‘const’ declaration specifier [-Wduplicate-decl-specifier]

================================================================================

Detailed per-defconfig build reports:

--------------------------------------------------------------------------------
acs5k_defconfig (arm, gcc-10) — PASS, 0 errors, 0 warnings, 0 section mismatches

--------------------------------------------------------------------------------
acs5k_tiny_defconfig (arm, gcc-10) — PASS, 0 errors, 0 warnings, 0 section mismatches

--------------------------------------------------------------------------------
allnoconfig (arc, gcc-10) — PASS, 0 errors, 0 warnings, 0 section mismatches

--------------------------------------------------------------------------------
allnoconfig (x86_64, gcc-10) — PASS, 0 errors, 4 warnings, 0 section mismatches

Warnings:
arch/x86/entry/entry_64.S:487: Warning: no instruction mnemonic suffix given and no register operands; using default for `btr'
arch/x86/entry/entry_64.S:1642: Warning: no instruction mnemonic suffix given and no register operands; using default for `sysret'
arch/x86/kernel/process.c:456: Warning: no instruction mnemonic suffix given and no register operands; using default for `btr'
arch/x86/kernel/process.c:456: Warning: no instruction mnemonic suffix given and no register operands; using default for `btr'

--------------------------------------------------------------------------------
allnoconfig (arm, gcc-10) — PASS, 0 errors, 0 warnings, 0 section mismatches

--------------------------------------------------------------------------------
allnoconfig (mips, gcc-10) — PASS, 0 errors, 0 warnings, 0 section mismatches

--------------------------------------------------------------------------------
allnoconfig (i386, gcc-10) — PASS, 0 errors, 0 warnings, 0 section mismatches

--------------------------------------------------------------------------------
am200epdkit_defconfig (arm, gcc-10) — PASS, 0 errors, 0 warnings, 0 section mismatches

--------------------------------------------------------------------------------
ar7_defconfig (mips, gcc-10) — PASS, 0 errors, 0 warnings, 0 section mismatches

--------------------------------------------------------------------------------
assabet_defconfig (arm, gcc-10) — PASS, 0 errors, 0 warnings, 0 section mismatches

--------------------------------------------------------------------------------
at91_dt_defconfig (arm, gcc-10) — PASS, 0 errors, 0 warnings, 0 section mismatches

--------------------------------------------------------------------------------
ath79_defconfig (mips, gcc-10) — PASS, 0 errors, 0 warnings, 0 section mismatches

--------------------------------------------------------------------------------
axm55xx_defconfig (arm, gcc-10) — PASS, 0 errors, 0 warnings, 0 section mismatches

--------------------------------------------------------------------------------
axs103_defconfig (arc, gcc-10) — PASS, 0 errors, 0 warnings, 0 section mismatches

--------------------------------------------------------------------------------
axs103_smp_defconfig (arc, gcc-10) — PASS, 0 errors, 0 warnings, 0 section mismatches

--------------------------------------------------------------------------------
badge4_defconfig (arm, gcc-10) — PASS, 0 errors, 0 warnings, 0 section mismatches

--------------------------------------------------------------------------------
bcm2835_defconfig (arm, gcc-10) — PASS, 0 errors, 0 warnings, 0 section mismatches

--------------------------------------------------------------------------------
bcm47xx_defconfig (mips, gcc-10) — PASS, 0 errors, 0 warnings, 0 section mismatches

--------------------------------------------------------------------------------
bcm63xx_defconfig (mips, gcc-10) — PASS, 0 errors, 0 warnings, 0 section mismatches

--------------------------------------------------------------------------------
bcm_defconfig (arm, gcc-10) — PASS, 0 errors, 0 warnings, 0 section mismatches

--------------------------------------------------------------------------------
bigsur_defconfig (mips, gcc-10) — PASS, 0 errors, 0 warnings, 0 section mismatches

--------------------------------------------------------------------------------
bmips_be_defconfig (mips, gcc-10) — PASS, 0 errors, 0 warnings, 0 section mismatches

--------------------------------------------------------------------------------
bmips_stb_defconfig (mips, gcc-10) — PASS, 0 errors, 0 warnings, 0 section mismatches

--------------------------------------------------------------------------------
capcella_defconfig (mips, gcc-10) — PASS, 0 errors, 0 warnings, 0 section mismatches

--------------------------------------------------------------------------------
cavium_octeon_defconfig (mips, gcc-10) — PASS, 0 errors, 0 warnings, 0 section mismatches

--------------------------------------------------------------------------------
cerfcube_defconfig (arm, gcc-10) — PASS, 0 errors, 0 warnings, 0 section mismatches

--------------------------------------------------------------------------------
ci20_defconfig (mips, gcc-10) — PASS, 0 errors, 0 warnings, 0 section mismatches

--------------------------------------------------------------------------------
clps711x_defconfig (arm, gcc-10) — PASS, 0 errors, 1 warning, 0 section mismatches

Warnings:
arch/arm/mach-clps711x/board-autcpu12.c:163:26: warning: duplicate ‘const’ declaration specifier [-Wduplicate-decl-specifier]

--------------------------------------------------------------------------------
cm_x2xx_defconfig (arm, gcc-10) — PASS, 0 errors, 0 warnings, 0 section mismatches

--------------------------------------------------------------------------------
cm_x300_defconfig (arm, gcc-10) — PASS, 0 errors, 0 warnings, 0 section mismatches

--------------------------------------------------------------------------------
cobalt_defconfig (mips, gcc-10) — PASS, 0 errors, 0 warnings, 0 section mismatches

--------------------------------------------------------------------------------
colibri_pxa270_defconfig (arm, gcc-10) — PASS, 0 errors, 0 warnings, 0 section mismatches

--------------------------------------------------------------------------------
colibri_pxa300_defconfig (arm, gcc-10) — PASS, 0 errors, 0 warnings, 0 section mismatches

--------------------------------------------------------------------------------
collie_defconfig (arm, gcc-10) — PASS, 0 errors, 0 warnings, 0 section mismatches

--------------------------------------------------------------------------------
corgi_defconfig (arm, gcc-10) — PASS, 0 errors, 0 warnings, 0 section mismatches

--------------------------------------------------------------------------------
davinci_all_defconfig (arm, gcc-10) — PASS, 0 errors, 1 warning, 0 section mismatches

Warnings:
arch/arm/mach-davinci/da8xx-dt.c:23:34: warning: duplicate ‘const’ declaration specifier [-Wduplicate-decl-specifier]

--------------------------------------------------------------------------------
db1xxx_defconfig (mips, gcc-10) — PASS, 0 errors, 0 warnings, 0 section mismatches

--------------------------------------------------------------------------------
decstation_defconfig (mips, gcc-10) — PASS, 0 errors, 0 warnings, 0 section mismatches

--------------------------------------------------------------------------------
defconfig (arm64, gcc-10) — PASS, 0 errors, 1 warning, 0 section mismatches

Warnings:
drivers/net/ethernet/apm/xgene/xgene_enet_main.c:32:36: warning: array ‘xgene_enet_acpi_match’ assumed to have one element

--------------------------------------------------------------------------------
defconfig+arm64-chromebook (arm64, gcc-10) — PASS, 0 errors, 1 warning, 0 section mismatches

Warnings:
drivers/net/ethernet/apm/xgene/xgene_enet_main.c:32:36: warning: array ‘xgene_enet_acpi_match’ assumed to have one element

--------------------------------------------------------------------------------
dove_defconfig (arm, gcc-10) — PASS, 0 errors, 0 warnings, 0 section mismatches

--------------------------------------------------------------------------------
e55_defconfig (mips, gcc-10) — PASS, 0 errors, 0 warnings, 0 section mismatches

--------------------------------------------------------------------------------
ebsa110_defconfig (arm, gcc-10) — PASS, 0 errors, 0 warnings, 0 section mismatches

--------------------------------------------------------------------------------
efm32_defconfig (arm, gcc-10) — PASS, 0 errors, 0 warnings, 0 section mismatches

--------------------------------------------------------------------------------
em_x270_defconfig (arm, gcc-10) — PASS, 0 errors, 0 warnings, 0 section mismatches

--------------------------------------------------------------------------------
ep93xx_defconfig (arm, gcc-10) — PASS, 0 errors, 0 warnings, 0 section mismatches

--------------------------------------------------------------------------------
eseries_pxa_defconfig (arm, gcc-10) — PASS, 0 errors, 0 warnings, 0 section mismatches

--------------------------------------------------------------------------------
exynos_defconfig (arm, gcc-10) — PASS, 0 errors, 0 warnings, 0 section mismatches

--------------------------------------------------------------------------------
ezx_defconfig (arm, gcc-10) — PASS, 0 errors, 0 warnings, 0 section mismatches

--------------------------------------------------------------------------------
footbridge_defconfig (arm, gcc-10) — PASS, 0 errors, 0 warnings, 0 section mismatches

--------------------------------------------------------------------------------
fuloong2e_defconfig (mips, gcc-10) — FAIL, 2 errors, 0 warnings, 0 section mismatches

Errors:
cc1: error: ‘-mloongson-mmi’ must be used with ‘-mhard-float’
cc1: error: ‘-mloongson-mmi’ must be used with ‘-mhard-float’

--------------------------------------------------------------------------------
gpr_defconfig (mips, gcc-10) — PASS, 0 errors, 0 warnings, 0 section mismatches

--------------------------------------------------------------------------------
h3600_defconfig (arm, gcc-10) — PASS, 0 errors, 0 warnings, 0 section mismatches

--------------------------------------------------------------------------------
h5000_defconfig (arm, gcc-10) — PASS, 0 errors, 0 warnings, 0 section mismatches

--------------------------------------------------------------------------------
hackkit_defconfig (arm, gcc-10) — PASS, 0 errors, 0 warnings, 0 section mismatches

--------------------------------------------------------------------------------
hisi_defconfig (arm, gcc-10) — PASS, 0 errors, 0 warnings, 0 section mismatches

--------------------------------------------------------------------------------
i386_defconfig (i386, gcc-10) — PASS, 0 errors, 2 warnings, 0 section mismatches

Warnings:
ld: arch/x86/boot/compressed/head_32.o: warning: relocation in read-only section `.head.text'
ld: warning: creating DT_TEXTREL in a PIE

--------------------------------------------------------------------------------
imote2_defconfig (arm, gcc-10) — PASS, 0 errors, 0 warnings, 0 section mismatches

--------------------------------------------------------------------------------
imx_v4_v5_defconfig (arm, gcc-10) — PASS, 0 errors, 0 warnings, 0 section mismatches

--------------------------------------------------------------------------------
imx_v6_v7_defconfig (arm, gcc-10) — PASS, 0 errors, 0 warnings, 0 section mismatches

--------------------------------------------------------------------------------
integrator_defconfig (arm, gcc-10) — PASS, 0 errors, 0 warnings, 0 section mismatches

--------------------------------------------------------------------------------
iop13xx_defconfig (arm, gcc-10) — PASS, 0 errors, 0 warnings, 0 section mismatches

--------------------------------------------------------------------------------
iop32x_defconfig (arm, gcc-10) — PASS, 0 errors, 0 warnings, 0 section mismatches

--------------------------------------------------------------------------------
iop33x_defconfig (arm, gcc-10) — PASS, 0 errors, 0 warnings, 0 section mismatches

--------------------------------------------------------------------------------
ip22_defconfig (mips, gcc-10) — PASS, 0 errors, 1 warning, 0 section mismatches

Warnings:
drivers/net/ethernet/seeq/sgiseeq.c:804:26: warning: passing argument 5 of ‘dma_free_attrs’ makes pointer from integer without a cast [-Wint-conversion]

--------------------------------------------------------------------------------
ip27_defconfig (mips, gcc-10) — FAIL, 0 errors, 0 warnings, 0 section mismatches

--------------------------------------------------------------------------------
ip28_defconfig (mips, gcc-10) — FAIL, 0 errors, 0 warnings, 0 section mismatches

--------------------------------------------------------------------------------
ip32_defconfig (mips, gcc-10) — PASS, 0 errors, 0 warnings, 0 section mismatches

--------------------------------------------------------------------------------
ixp4xx_defconfig (arm, gcc-10) — PASS, 0 errors, 0 warnings, 0 section mismatches

--------------------------------------------------------------------------------
jazz_defconfig (mips, gcc-10) — PASS, 0 errors, 0 warnings, 0 section mismatches

--------------------------------------------------------------------------------
jmr3927_defconfig (mips, gcc-10) — PASS, 0 errors, 0 warnings, 0 section mismatches

--------------------------------------------------------------------------------
jornada720_defconfig (arm, gcc-10) — PASS, 0 errors, 0 warnings, 0 section mismatches

--------------------------------------------------------------------------------
keystone_defconfig (arm, gcc-10) — PASS, 0 errors, 0 warnings, 0 section mismatches

--------------------------------------------------------------------------------
ks8695_defconfig (arm, gcc-10) — PASS, 0 errors, 0 warnings, 0 section mismatches

--------------------------------------------------------------------------------
lart_defconfig (arm, gcc-10) — PASS, 0 errors, 0 warnings, 0 section mismatches

--------------------------------------------------------------------------------
lasat_defconfig (mips, gcc-10) — PASS, 0 errors, 0 warnings, 0 section mismatches

--------------------------------------------------------------------------------
lemote2f_defconfig (mips, gcc-10) — FAIL, 2 errors, 0 warnings, 0 section mismatches

Errors:
cc1: error: ‘-mloongson-mmi’ must be used with ‘-mhard-float’
cc1: error: ‘-mloongson-mmi’ must be used with ‘-mhard-float’

--------------------------------------------------------------------------------
loongson3_defconfig (mips, gcc-10) — PASS, 0 errors, 0 warnings, 0 section mismatches

--------------------------------------------------------------------------------
lpc18xx_defconfig (arm, gcc-10) — PASS, 0 errors, 0 warnings, 0 section mismatches

--------------------------------------------------------------------------------
lpc32xx_defconfig (arm, gcc-10) — PASS, 0 errors, 1 warning, 0 section mismatches

Warnings:
arch/arm/mach-lpc32xx/phy3250.c:215:36: warning: duplicate ‘const’ declaration specifier [-Wduplicate-decl-specifier]

--------------------------------------------------------------------------------
lpd270_defconfig (arm, gcc-10) — PASS, 0 errors, 0 warnings, 0 section mismatches

--------------------------------------------------------------------------------
ls1b_defconfig (mips, gcc-10) — PASS, 0 errors, 0 warnings, 0 section mismatches

--------------------------------------------------------------------------------
lubbock_defconfig (arm, gcc-10) — PASS, 0 errors, 0 warnings, 0 section mismatches

--------------------------------------------------------------------------------
magician_defconfig (arm, gcc-10) — PASS, 0 errors, 0 warnings, 0 section mismatches

--------------------------------------------------------------------------------
mainstone_defconfig (arm, gcc-10) — PASS, 0 errors, 0 warnings, 0 section mismatches

--------------------------------------------------------------------------------
malta_defconfig (mips, gcc-10) — PASS, 0 errors, 0 warnings, 0 section mismatches

--------------------------------------------------------------------------------
malta_kvm_defconfig (mips, gcc-10) — PASS, 0 errors, 0 warnings, 0 section mismatches

--------------------------------------------------------------------------------
malta_kvm_guest_defconfig (mips, gcc-10) — PASS, 0 errors, 0 warnings, 0 section mismatches

--------------------------------------------------------------------------------
malta_qemu_32r6_defconfig (mips, gcc-10) — PASS, 0 errors, 0 warnings, 0 section mismatches

--------------------------------------------------------------------------------
maltaaprp_defconfig (mips, gcc-10) — PASS, 0 errors, 0 warnings, 0 section mismatches

--------------------------------------------------------------------------------
maltasmvp_defconfig (mips, gcc-10) — PASS, 0 errors, 0 warnings, 0 section mismatches

--------------------------------------------------------------------------------
maltasmvp_eva_defconfig (mips, gcc-10) — PASS, 0 errors, 0 warnings, 0 section mismatches

--------------------------------------------------------------------------------
maltaup_defconfig (mips, gcc-10) — PASS, 0 errors, 0 warnings, 0 section mismatches

--------------------------------------------------------------------------------
maltaup_xpa_defconfig (mips, gcc-10) — PASS, 0 errors, 0 warnings, 0 section mismatches

--------------------------------------------------------------------------------
markeins_defconfig (mips, gcc-10) — PASS, 0 errors, 0 warnings, 0 section mismatches

--------------------------------------------------------------------------------
mini2440_defconfig (arm, gcc-10) — PASS, 0 errors, 1 warning, 0 section mismatches

Warnings:
drivers/tty/serial/samsung.c:1780:34: warning: array ‘s3c24xx_uart_dt_match’ assumed to have one element

--------------------------------------------------------------------------------
mips_paravirt_defconfig (mips, gcc-10) — PASS, 0 errors, 0 warnings, 0 section mismatches

--------------------------------------------------------------------------------
mmp2_defconfig (arm, gcc-10) — PASS, 0 errors, 0 warnings, 0 section mismatches

--------------------------------------------------------------------------------
mpc30x_defconfig (mips, gcc-10) — PASS, 0 errors, 0 warnings, 0 section mismatches

--------------------------------------------------------------------------------
msp71xx_defconfig (mips, gcc-10) — PASS, 0 errors, 0 warnings, 0 section mismatches

--------------------------------------------------------------------------------
mtx1_defconfig (mips, gcc-10) — PASS, 0 errors, 3 warnings, 0 section mismatches

Warnings:
sound/pci/echoaudio/echoaudio_dsp.c:647:9: warning: iteration 1073741824 invokes undefined behavior [-Waggressive-loop-optimizations]
sound/pci/echoaudio/echoaudio_dsp.c:658:9: warning: iteration 1073741824 invokes undefined behavior [-Waggressive-loop-optimizations]
sound/pci/echoaudio/echoaudio_dsp.c:647:9: warning: iteration 1073741824 invokes undefined behavior [-Waggressive-loop-optimizations]

--------------------------------------------------------------------------------
multi_v5_defconfig (arm, gcc-10) — PASS, 0 errors, 0 warnings, 0 section mismatches

--------------------------------------------------------------------------------
multi_v7_defconfig (arm, gcc-10) — PASS, 0 errors, 0 warnings, 0 section mismatches

--------------------------------------------------------------------------------
mv78xx0_defconfig (arm, gcc-10) — PASS, 0 errors, 0 warnings, 0 section mismatches

--------------------------------------------------------------------------------
mvebu_v5_defconfig (arm, gcc-10) — PASS, 0 errors, 0 warnings, 0 section mismatches

--------------------------------------------------------------------------------
mvebu_v7_defconfig (arm, gcc-10) — PASS, 0 errors, 0 warnings, 0 section mismatches

--------------------------------------------------------------------------------
mxs_defconfig (arm, gcc-10) — PASS, 0 errors, 1 warning, 0 section mismatches

Warnings:
arch/arm/mach-mxs/mach-mxs.c:285:26: warning: duplicate ‘const’ declaration specifier [-Wduplicate-decl-specifier]

--------------------------------------------------------------------------------
neponset_defconfig (arm, gcc-10) — PASS, 0 errors, 0 warnings, 0 section mismatches

--------------------------------------------------------------------------------
netwinder_defconfig (arm, gcc-10) — PASS, 0 errors, 0 warnings, 0 section mismatches

--------------------------------------------------------------------------------
netx_defconfig (arm, gcc-10) — PASS, 0 errors, 0 warnings, 0 section mismatches

--------------------------------------------------------------------------------
nhk8815_defconfig (arm, gcc-10) — PASS, 0 errors, 0 warnings, 0 section mismatches

--------------------------------------------------------------------------------
nlm_xlp_defconfig (mips, gcc-10) — PASS, 0 errors, 0 warnings, 0 section mismatches

--------------------------------------------------------------------------------
nlm_xlr_defconfig (mips, gcc-10) — PASS, 0 errors, 0 warnings, 0 section mismatches

--------------------------------------------------------------------------------
nsim_hs_defconfig (arc, gcc-10) — PASS, 0 errors, 0 warnings, 0 section mismatches

--------------------------------------------------------------------------------
nsim_hs_smp_defconfig (arc, gcc-10) — PASS, 0 errors, 0 warnings, 0 section mismatches

--------------------------------------------------------------------------------
nsimosci_hs_defconfig (arc, gcc-10) — PASS, 0 errors, 0 warnings, 0 section mismatches

--------------------------------------------------------------------------------
nsimosci_hs_smp_defconfig (arc, gcc-10) — PASS, 0 errors, 0 warnings, 0 section mismatches

--------------------------------------------------------------------------------
nuc910_defconfig (arm, gcc-10) — PASS, 0 errors, 0 warnings, 0 section mismatches

--------------------------------------------------------------------------------
nuc950_defconfig (arm, gcc-10) — PASS, 0 errors, 0 warnings, 0 section mismatches

--------------------------------------------------------------------------------
nuc960_defconfig (arm, gcc-10) — PASS, 0 errors, 0 warnings, 0 section mismatches

--------------------------------------------------------------------------------
omap1_defconfig (arm, gcc-10) — PASS, 0 errors, 1 warning, 0 section mismatches

Warnings:
drivers/gpio/gpio-omap.c:1161:34: warning: array ‘omap_gpio_match’ assumed to have one element

--------------------------------------------------------------------------------
omap2plus_defconfig (arm, gcc-10) — PASS, 0 errors, 1 warning, 0 section mismatches

Warnings:
drivers/cpufreq/ti-cpufreq.c:250:24: warning: passing argument 1 of ‘PTR_ERR_OR_ZERO’ makes pointer from integer without a cast [-Wint-conversion]

--------------------------------------------------------------------------------
orion5x_defconfig (arm, gcc-10) — PASS, 0 errors, 0 warnings, 0 section mismatches

--------------------------------------------------------------------------------
palmz72_defconfig (arm, gcc-10) — PASS, 0 errors, 0 warnings, 0 section mismatches

--------------------------------------------------------------------------------
pcm027_defconfig (arm, gcc-10) — PASS, 0 errors, 0 warnings, 0 section mismatches

--------------------------------------------------------------------------------
pleb_defconfig (arm, gcc-10) — PASS, 0 errors, 0 warnings, 0 section mismatches

--------------------------------------------------------------------------------
pnx8335_stb225_defconfig (mips, gcc-10) — PASS, 0 errors, 0 warnings, 0 section mismatches

--------------------------------------------------------------------------------
prima2_defconfig (arm, gcc-10) — PASS, 0 errors, 0 warnings, 0 section mismatches

--------------------------------------------------------------------------------
pxa168_defconfig (arm, gcc-10) — PASS, 0 errors, 0 warnings, 0 section mismatches

--------------------------------------------------------------------------------
pxa255-idp_defconfig (arm, gcc-10) — PASS, 0 errors, 0 warnings, 0 section mismatches

--------------------------------------------------------------------------------
pxa3xx_defconfig (arm, gcc-10) — PASS, 0 errors, 0 warnings, 0 section mismatches

--------------------------------------------------------------------------------
pxa910_defconfig (arm, gcc-10) — PASS, 0 errors, 0 warnings, 0 section mismatches

--------------------------------------------------------------------------------
qcom_defconfig (arm, gcc-10) — PASS, 0 errors, 0 warnings, 0 section mismatches

--------------------------------------------------------------------------------
qi_lb60_defconfig (mips, gcc-10) — PASS, 0 errors, 0 warnings, 0 section mismatches

--------------------------------------------------------------------------------
raumfeld_defconfig (arm, gcc-10) — PASS, 0 errors, 0 warnings, 0 section mismatches

--------------------------------------------------------------------------------
rb532_defconfig (mips, gcc-10) — PASS, 0 errors, 0 warnings, 0 section mismatches

--------------------------------------------------------------------------------
rbtx49xx_defconfig (mips, gcc-10) — PASS, 0 errors, 0 warnings, 0 section mismatches

--------------------------------------------------------------------------------
realview-smp_defconfig (arm, gcc-10) — PASS, 0 errors, 0 warnings, 0 section mismatches

--------------------------------------------------------------------------------
realview_defconfig (arm, gcc-10) — PASS, 0 errors, 0 warnings, 0 section mismatches

--------------------------------------------------------------------------------
rm200_defconfig (mips, gcc-10) — PASS, 0 errors, 0 warnings, 0 section mismatches

--------------------------------------------------------------------------------
rpc_defconfig (arm, gcc-10) — FAIL, 4 errors, 0 warnings, 0 section mismatches

Errors:
arm-linux-gnueabihf-gcc: error: unrecognized -march target: armv3
arm-linux-gnueabihf-gcc: error: missing argument to ‘-march=’
arm-linux-gnueabihf-gcc: error: unrecognized -march target: armv3
arm-linux-gnueabihf-gcc: error: missing argument to ‘-march=’

--------------------------------------------------------------------------------
rt305x_defconfig (mips, gcc-10) — PASS, 0 errors, 0 warnings, 0 section mismatches

--------------------------------------------------------------------------------
s3c2410_defconfig (arm, gcc-10) — PASS, 0 errors, 1 warning, 0 section mismatches

Warnings:
drivers/tty/serial/samsung.c:1780:34: warning: array ‘s3c24xx_uart_dt_match’ assumed to have one element

--------------------------------------------------------------------------------
s3c6400_defconfig (arm, gcc-10) — PASS, 0 errors, 2 warnings, 0 section mismatches

Warnings:
drivers/mmc/host/sdhci-s3c.c:429:34: warning: array ‘sdhci_s3c_dt_match’ assumed to have one element
drivers/tty/serial/samsung.c:1780:34: warning: array ‘s3c24xx_uart_dt_match’ assumed to have one element

--------------------------------------------------------------------------------
s5pv210_defconfig (arm, gcc-10) — PASS, 0 errors, 0 warnings, 0 section mismatches

--------------------------------------------------------------------------------
sama5_defconfig (arm, gcc-10) — PASS, 0 errors, 0 warnings, 0 section mismatches

--------------------------------------------------------------------------------
sb1250_swarm_defconfig (mips, gcc-10) — PASS, 0 errors, 0 warnings, 0 section mismatches

--------------------------------------------------------------------------------
sead3_defconfig (mips, gcc-10) — PASS, 0 errors, 0 warnings, 0 section mismatches

--------------------------------------------------------------------------------
sead3micro_defconfig (mips, gcc-10) — PASS, 0 errors, 0 warnings, 0 section mismatches

--------------------------------------------------------------------------------
shannon_defconfig (arm, gcc-10) — PASS, 0 errors, 0 warnings, 0 section mismatches

--------------------------------------------------------------------------------
shmobile_defconfig (arm, gcc-10) — PASS, 0 errors, 0 warnings, 0 section mismatches

--------------------------------------------------------------------------------
simpad_defconfig (arm, gcc-10) — PASS, 0 errors, 0 warnings, 0 section mismatches

--------------------------------------------------------------------------------
socfpga_defconfig (arm, gcc-10) — PASS, 0 errors, 0 warnings, 0 section mismatches

--------------------------------------------------------------------------------
spear13xx_defconfig (arm, gcc-10) — PASS, 0 errors, 0 warnings, 0 section mismatches

--------------------------------------------------------------------------------
spear3xx_defconfig (arm, gcc-10) — PASS, 0 errors, 0 warnings, 0 section mismatches

--------------------------------------------------------------------------------
spear6xx_defconfig (arm, gcc-10) — PASS, 0 errors, 0 warnings, 0 section mismatches

--------------------------------------------------------------------------------
spitz_defconfig (arm, gcc-10) — PASS, 0 errors, 0 warnings, 0 section mismatches

--------------------------------------------------------------------------------
stm32_defconfig (arm, gcc-10) — PASS, 0 errors, 0 warnings, 0 section mismatches

--------------------------------------------------------------------------------
sunxi_defconfig (arm, gcc-10) — PASS, 0 errors, 0 warnings, 0 section mismatches

--------------------------------------------------------------------------------
tb0219_defconfig (mips, gcc-10) — PASS, 0 errors, 0 warnings, 0 section mismatches

--------------------------------------------------------------------------------
tb0226_defconfig (mips, gcc-10) — PASS, 0 errors, 0 warnings, 0 section mismatches

--------------------------------------------------------------------------------
tb0287_defconfig (mips, gcc-10) — PASS, 0 errors, 0 warnings, 0 section mismatches

--------------------------------------------------------------------------------
tct_hammer_defconfig (arm, gcc-10) — PASS, 0 errors, 0 warnings, 0 section mismatches

--------------------------------------------------------------------------------
tegra_defconfig (arm, gcc-10) — PASS, 0 errors, 0 warnings, 0 section mismatches

--------------------------------------------------------------------------------
tinyconfig (i386, gcc-10) — PASS, 0 errors, 0 warnings, 0 section mismatches

--------------------------------------------------------------------------------
tinyconfig (mips, gcc-10) — PASS, 0 errors, 0 warnings, 0 section mismatches

--------------------------------------------------------------------------------
tinyconfig (arc, gcc-10) — PASS, 0 errors, 0 warnings, 0 section mismatches

--------------------------------------------------------------------------------
tinyconfig (arm, gcc-10) — PASS, 0 errors, 0 warnings, 0 section mismatches

--------------------------------------------------------------------------------
tinyconfig (x86_64, gcc-10) — PASS, 0 errors, 3 warnings, 0 section mismatches

Warnings:
arch/x86/entry/entry_64.S:487: Warning: no instruction mnemonic suffix given and no register operands; using default for `btr'
arch/x86/entry/entry_64.S:1642: Warning: no instruction mnemonic suffix given and no register operands; using default for `sysret'
arch/x86/kernel/process.c:456: Warning: no instruction mnemonic suffix given and no register operands; using default for `btr'

--------------------------------------------------------------------------------
trizeps4_defconfig (arm, gcc-10) — PASS, 0 errors, 0 warnings, 0 section mismatches

--------------------------------------------------------------------------------
u300_defconfig (arm, gcc-10) — PASS, 0 errors, 0 warnings, 0 section mismatches

--------------------------------------------------------------------------------
u8500_defconfig (arm, gcc-10) — PASS, 0 errors, 0 warnings, 0 section mismatches

--------------------------------------------------------------------------------
vdk_hs38_defconfig (arc, gcc-10) — PASS, 0 errors, 0 warnings, 0 section mismatches

--------------------------------------------------------------------------------
vdk_hs38_smp_defconfig (arc, gcc-10) — PASS, 0 errors, 0 warnings, 0 section mismatches

--------------------------------------------------------------------------------
versatile_defconfig (arm, gcc-10) — PASS, 0 errors, 0 warnings, 0 section mismatches

--------------------------------------------------------------------------------
vexpress_defconfig (arm, gcc-10) — PASS, 0 errors, 0 warnings, 0 section mismatches

--------------------------------------------------------------------------------
vf610m4_defconfig (arm, gcc-10) — PASS, 0 errors, 0 warnings, 0 section mismatches

--------------------------------------------------------------------------------
viper_defconfig (arm, gcc-10) — PASS, 0 errors, 0 warnings, 0 section mismatches

--------------------------------------------------------------------------------
vt8500_v6_v7_defconfig (arm, gcc-10) — PASS, 0 errors, 0 warnings, 0 section mismatches

--------------------------------------------------------------------------------
workpad_defconfig (mips, gcc-10) — PASS, 0 errors, 0 warnings, 0 section mismatches

--------------------------------------------------------------------------------
x86_64_defconfig (x86_64, gcc-10) — PASS, 0 errors, 6 warnings, 0 section mismatches

Warnings:
arch/x86/entry/entry_64.S:487: Warning: no instruction mnemonic suffix given and no register operands; using default for `btr'
arch/x86/entry/entry_64.S:1642: Warning: no instruction mnemonic suffix given and no register operands; using default for `sysret'
arch/x86/kernel/process.c:456: Warning: no instruction mnemonic suffix given and no register operands; using default for `btr'
arch/x86/kernel/process.c:456: Warning: no instruction mnemonic suffix given and no register operands; using default for `btr'
ld: arch/x86/boot/compressed/head_64.o: warning: relocation in read-only section `.head.text'
ld: warning: creating DT_TEXTREL in a PIE

--------------------------------------------------------------------------------
x86_64_defconfig+x86-chromebook (x86_64, gcc-10) — PASS, 0 errors, 6 warnings, 0 section mismatches

Warnings:
arch/x86/entry/entry_64.S:487: Warning: no instruction mnemonic suffix given and no register operands; using default for `btr'
arch/x86/entry/entry_64.S:1642: Warning: no instruction mnemonic suffix given and no register operands; using default for `sysret'
arch/x86/kernel/process.c:456: Warning: no instruction mnemonic suffix given and no register operands; using default for `btr'
arch/x86/kernel/process.c:456: Warning: no instruction mnemonic suffix given and no register operands; using default for `btr'
ld: arch/x86/boot/compressed/head_64.o: warning: relocation in read-only section `.head.text'
ld: warning: creating DT_TEXTREL in a PIE

--------------------------------------------------------------------------------
xcep_defconfig (arm, gcc-10) — PASS, 0 errors, 0 warnings, 0 section mismatches

--------------------------------------------------------------------------------
xilfpga_defconfig (mips, gcc-10) — PASS, 0 errors, 0 warnings, 0 section mismatches

--------------------------------------------------------------------------------
xway_defconfig (mips, gcc-10) — PASS, 0 errors, 0 warnings, 0 section mismatches

--------------------------------------------------------------------------------
zeus_defconfig (arm, gcc-10) — PASS, 0 errors, 0 warnings, 0 section mismatches

--------------------------------------------------------------------------------
zx_defconfig (arm, gcc-10) — PASS, 0 errors, 0 warnings, 0 section mismatches

---
For more info write to <info@...>


New CVE entries this week

Masami Ichikawa
 

Hi !

It's this week's CVE report.

This week reported 11 new CVEs and 5 updated CVE.
Seven of eleven new CVEs are Xen's vulnerabilities.

* New CVEs

CVE-2022-23036, CVE-2022-23037, CVE-2022-23038, CVE-2022-23039,
CVE-2022-23040 : Xen: fix race conditions, resulting in potential data
leaks, data corruption, DoS by malicious backends

CVSS v3 score is not provided

CVE-2022-23036, CVE-2022-23037, CVE-2022-23038, CVE-2022-23039, and
CVE-2022-23040 are kind of group. These CVEs are Xen's vulnerability.
These vulnerability will cause race conditions, resulting in potential
data leaks, data corruption, DoS by malicious backends(blkfront,
netfront, scsifront, gntalloc, xenbus).

Xen advisory said that "blkfront, netfront, scsifront and the gntalloc
driver are testing
whether a grant reference is still in use. If this is not the case,
they assume that a following removal of the granted access will always
succeed, which is not true in case the backend has mapped the granted
page between those two operations. As a result the backend can keep
access to the memory page of the guest no matter how the page will be
used after the frontend I/O has finished. The xenbus driver has a
similar problem, as it doesn't check the success of removing the
granted access of a shared ring buffer."

Each CVE is assigned to each backend.

CVE-2022-23036 : blkfront
CVE-2022-23037 : netfront
CVE-2022-23038 : scsifront
CVE-2022-23039 : gntalloc
CVE-2022-23040 : xenbus

For 4.4.

6b1775f: can be applied
abf1fd5: backport 3df0e50 ("xen/blkfront: pseudo support for multi
hardware queues/rings") or modify abf1fd5 is needed
31185df: can be applied
33172ab: can be applied with a small modification
d3b6372: can be applied

Fixed status

CVE-2022-23036:
mainline: [6b1775f26a2da2b05a6dc8ec2b5d14e9a4701a1a,
abf1fd5919d6238ee3bc5eb4a9b6c3947caa6638]
stable/4.19: [17659846fe336366b1663194f5669d10f5947f53,
423a3a50dce9a48d10d2d2a70cd2f78064c13703]
stable/4.9: [73e1d9b33f2bd93ce30719dfc8990b6328243b7e,
f306575016dcf47ed6cd40e1fe872a4d8c665a8b]
stable/5.10: [3d81e85f30a8f712c3e4f2a507553d9063a20ed6,
96219af4e504d0e96a231a0ba86062ec5b3af979]

CVE-2022-23037:
mainline: [31185df7e2b1d2fa1de4900247a12d7b9c7087eb]
stable/4.19: [927e4eb8ddf4968b6a33be992b28063f84552c72]
stable/4.9: [1112bb311ec13e7e6e7045ae4a0b7091bedc6b7a]
stable/5.10: [f6690dd9446a2a4bd9b024f00f71dd827a98317f]

CVE-2022-23038:
mainline: [6b1775f26a2da2b05a6dc8ec2b5d14e9a4701a1a,
33172ab50a53578a95691310f49567c9266968b0]
stable/4.9: [73e1d9b33f2bd93ce30719dfc8990b6328243b7e,
98bdfdf89e987406f4afdc7694cbdbb715383d8e]
stable/5.10: [3d81e85f30a8f712c3e4f2a507553d9063a20ed6,
3047255182774266950b22acc29c22a2d76e859e]

CVE-2022-23039:
mainline: [d3b6372c5881cb54925212abb62c521df8ba4809]
stable/4.19: [fbc57368ea527dcfa909908fc47a851a56e4e5ce]
stable/4.9: [97b835c6de03a24db79d374b02d532f0b562fd38]
stable/5.10: [5f36ae75b847e7f87e4144602f418a624ca074b7]

CVE-2022-23040:
mainline: [3777ea7bac3113005b7180e6b9dadf16d19a5827]
stable/4.19: [8d521d960aef22781ff499e16899c30af899de8d]
stable/4.9: [8f80d12f6946a6fe7c64bfc204c062a57f83c7f8]
stable/5.10: [5c600371b8fd02cbbb0eb83a9f664e3f0b75c28e]

CVE-2022-23041: Xen: fix race conditions, resulting in potential data
leaks, data corruption, DoS by malicious backends

CVSS v3 score is not provided

Xen advisory said that "blkfront, netfront, scsifront, usbfront,
dmabuf, xenbus, 9p, kbdfront,
and pvcalls are using a functionality to delay freeing a grant reference
until it is no longer in use, but the freeing of the related data page
is not synchronized with dropping the granted access. As a result the
backend can keep access to the memory page even after it has been freed
and then re-used for a different purpose."

for 4.4
5cadd4b: Patch to net/9p/trans_xen.c but 4.4.302 doesn't have it. may be ignored
b0576cc: Patch to drivers/xen/pvcalls-front. but 4.4.302 doesn't have
it. can be ignored
42baefa: can be applied with modification

Fixed status

mainline: [5cadd4bb1d7fc9ab201ac14620d1a478357e4ebd,
b0576cc9c6b843d99c6982888d59a56209341888,
42baefac638f06314298087394b982ead9ec444b]
stable/4.19: [2466bed361f3274e3e0ca9d8e539532481c06fea,
f85d03f0f482cc28a2ee15a1fed2ae57ae359412,
92dc0e4a219602242407dedd987dc9c8263c959b]
stable/4.9: [ae6f8a67b98144827e78874c8dba41cccb02be5b]
stable/5.10: [8357d75bfdb85ea63253cf369f405830c7b13d78,
c4b16486d6023f6365a4f8671351961e97428f2d,
39c00d09286c67567cdf23ebc8e00e47722ef769]

CVE-2022-23042: Xen: fix race conditions, resulting in potential data
leaks, data corruption, DoS by malicious backends

CVSS v3 score is not provided

Xen advisory said that "netfront will fail a BUG_ON() assertion if it
fails to revoke access in
the rx path. This will result in a Denial of Service (DoS) situation of
the guest which can be triggered by the backend."

for 4.4
66e3531: need to modify

Fixed status

mainline: [66e3531b33ee51dad17c463b4d9c9f52e341503d]
stable/4.19: [c307029d811e03546d18d0e512fe295b3103b8e5]
stable/4.9: [c4497b057b14274e159434f0ed70439a21f3d2a9]
stable/5.10: [206c8e271ba2630f1d809123945d9c428f93b0f0]

CVE-2022-26878: Bluetooth: virtio_bt: fix memory leak in virtbt_rx_handle()

CVSS v3 score is not provided

This bug was introduced since 5.13-rc1, so before this versions aren't
affected by this issue.
The mainline and all stable kernels are already fixed.

Fixed status

mainline: [1d0688421449718c6c5f46e458a378c9b530ba18]
stable/5.15: [1f2270e161f978912100dd7acdfe1894bebcd4f6]
stable/5.16: [ad7cb5f6fa5f7ea37208c98a9457dd98025a89ca]

CVE-2022-26966: sr9700: sanity check for packet length

CVSS v3 score is not provided

This bug will cause heap data leak to user space.
The mainline and all stable kernels are already fixed.

for 4.4
4.4 kernel doesn't check packet length. Therefore 4.4 has same issue.
Patch can be applied to 4.4.

Fixed status

mainline: [e9da0b56fe27206b49f39805f7dcda8a89379062]
stable/4.14: [fbc3c962b6eb42b1483d00d8ea28b61b9f2fff26]
stable/4.19: [dde5ddf02a47487dd6efcc7077307f1d4e1ba337]
stable/4.9: [89260e0e191e8a3a9872f72836bdf0641853c87f]
stable/5.10: [4f5f5411f0c14ac0b61d5e6a77d996dd3d5b5fd3]
stable/5.15: [9f2d614779906f3d8ad4fb882c5b3e5ad6150bbe]
stable/5.16: [639f72dce8667a3d601561e0e47d53ad999e7f8a]
stable/5.4: [b95d71abeb7d31d4d51cd836d80f99fd783fd6d5]

CVE-2022-0742: A memory leak flaw was found in the Linux kernel’s
ICMPv6 networking protocol

CVSS v3 score is not provided

A remote attacker can crash victim host via malicious ICMP6 packet.
This vulnerability was introduced at commit f185de2 ("mld: add new
workqueues for process mld events").
This commit was merged in 5.13-rc1, so before this versions are not
affected by this issue.
The mainline and stable kernels are fixed.

Fixed status

mainline: [2d3916f3189172d5c69d33065c3c21119fe539fc]
stable/5.15: [771aca9bc70709771f66c3e7c00ce87339aa1790]
stable/5.16: [5ed9983ce67341b405cf6fda826e29aed26a7371]

CVE-2022-27223: USB: gadget: validate endpoint index for xilinx udc

The endpoint index is not validated and might be manipulated by the
host for out-of-array access.

For 4.4
Patch can be applied to 4.4 without modification.

Fixed status

mainline: [7f14c7227f342d9932f9b918893c8814f86d2a0d]
stable/4.14: [fdc22192d49fa577d8397b39f8ef8141cb1d62aa]
stable/4.19: [ebc465e894890a534ce05e035eae4829a2a47ba1]
stable/4.9: [958b6ab4d70bf991e8c90233504d4cb863aaef8a]
stable/5.10: [bfa8ffbaaaaf9752f66bc7cabcef2de715e7621f]
stable/5.15: [2c775ad1fd5e014b35e483da2aab8400933fb09d]
stable/5.16: [3221ef49ba18924e55a4d42a2ea4080cfea12c6c]
stable/5.4: [6b23eda989236fd75b4a9893cc816cd690c29dfc]

* Updated CVEs

CVE-2022-0001: Sharing of branch predictor selectors between contexts
on Intel CPUs

Stable 4.14, 4.19, 4.9, 5.10, 5.15, 5.16, and 5.4 kernels were updated.

Fixed status

mainline: [d45476d9832409371537013ebdd8dc1a7781f97a,
1e19da8522c81bf46b335f84137165741e0d82b7,
5ad3eb1132453b9795ce5fd4572b1c18b292cca9,
44a3918c8245ab10c6c9719dd12e7a8d291980d8,
244d00b5dd4755f8df892c86cab35fb2cfd4f14b,
e9b6013a7ce31535b04b02ba99babefe8a8599fa,
eafd987d4a82c7bb5aa12f0e3b4f8f3dea93e678,
0de05d056afdb00eca8c7bbb0c79a3438daf700c]
stable/4.14: [35c13d13becb5b951ea0fc708dda03fe900cf879,
716c06c7196f2ff22777b5bb3c713094ec677a93,
d2109c347ec237f6a4cf4d44336abdeeab82ec8f,
383973dc1a9dfc7baf12652b9e75498bef16aed9,
85938688be23ecd36a06757096896b2779b80d97,
416ec8f017b368ab953f624b075a7b0ffd296b9e,
2b871b5fedb85c1962ccab26c64bef9bf6f377d4,
38c557efd4cd5e59dee1d021009278b491523fee]
stable/4.19: [25440a8c77dd2fde6a8e9cfc0c616916febf408e,
3f66bedb96ff4c064a819e68499f79b38297ba26,
7af95ef3ec6248696300fce5c68f6c8c4f50e4a4,
995629e1d8e6751936c6e2b738f70b392b0461de,
d3cb3a6927222268a10b2f12dfb8c9444f7cc39e,
c034d344e733a3ac574dd09e39e911a50025c607,
8bfdba77595aee5c3e83ed1c9994c35d6d409605,
9711b12a3f4c0fc73dd257c1e467e6e42155a5f1]
stable/4.9: [a771511caa8e31cb5cac4fa39165ebbca3e62795,
d0ba50275860b456ff570edf3dcc2db5d2eb9eb8,
f9238d33710d74ac3dd668abaa53b2274f8e6fe6,
6481835a9a5b74e349e5c20ae8a9cb10a2e907fa,
b6a1aec08a84ccb331ce526c051df074150cf3c5,
0db1c4307aded2c5e618654f9341a249e0c1051f,
8edabefdc13294a9b15671937d165b948cf34d69,
0753760184745250e39018bb25ba77557390fe91]
stable/5.10: [f38774bb6e231d647d40ceeb8ddf9082eabde667,
a6a119d647ad1f73067d3cffb43104df3f920bcc,
071e8b69d7808d96f388d7c5ed606e75fd3d518d,
afc2d635b5e18e2b33116d8e121ee149882e33eb,
2fdf67a1d215574c31b1a716f80fa0fdccd401d7,
e335384560d1e106b609e8febd7e0427075a8938,
cc9e3e55bde71b2fac1494f503d5ffc560c7fb8d,
d04937ae94903087279e4a016b7741cdee59d521]
stable/5.15: [f150b6fccf7fa0e7e7275f0785798547db832c7b,
d7771f380c90e53a7b22f8e8a20b09c09e3583c7,
eb459641775636c3b4382ecc43ba3d6aa16892d5,
316e4a16524a2d2ce321f57c1abe4df9ef90f950,
a56566d7a957c34811384d6300a53a97be94cd20,
36fbbd78471c319a3a6f6402b99447c6d4686c69,
074d7260463962b44a8b8a61dcdd6ef513022e88,
bf048d1921b6cdc50bfc5a1b21b6fdd2d22e1fe1]
stable/5.16: [56829c19c8171303faca18d6ab3511ecdf3e7e23,
9b629eeb33222615a367eee8f038db907a797d3f,
227649a0a673da2c87c02c26c476a8599989a4d8,
6710bd548ec701bfedc175d145323cbf6930decb,
1984feb9872b905420af97d471d60051b6dd5851,
23cc87c04704f7ed978c85a4ec5901719fd26580,
19b78a9a32286216ec4aa64924d39ba5748b506d,
db3eaccf6e16c2d15d3fc8dc7c430d7df7c7bcc4]
stable/5.4: [41b50510e593541e2ee1537614652e91e71f6bf5,
96b3d45aeae03092637bd278ec4daadb48441906,
327a4da9b0ef89628a1d2aa825ce709049a402f1,
1e47ab3df908bbe1b6114374003c7a070ef35f01,
b1bacf22a847d21a12900bd6a1eacaecb5bca253,
865da3868b56a39b98003dcaa44cfbcdef0995fe,
7c7702569422ed49d66917e163df81dba763e983,
6c1599fd1bf8782f2b368e9eacc55571a7c3dd54]

CVE-2022-0002: Sharing of branch predictor selectors in same context
on Intel CPUs

Stable 4.14, 4.19, 4.9, 5.10, 5.15, 5.16, and 5.4 kernels were updated.

Fixed status

mainline: [d45476d9832409371537013ebdd8dc1a7781f97a,
1e19da8522c81bf46b335f84137165741e0d82b7,
5ad3eb1132453b9795ce5fd4572b1c18b292cca9,
44a3918c8245ab10c6c9719dd12e7a8d291980d8,
244d00b5dd4755f8df892c86cab35fb2cfd4f14b,
e9b6013a7ce31535b04b02ba99babefe8a8599fa,
eafd987d4a82c7bb5aa12f0e3b4f8f3dea93e678,
0de05d056afdb00eca8c7bbb0c79a3438daf700c]
stable/4.14: [35c13d13becb5b951ea0fc708dda03fe900cf879,
716c06c7196f2ff22777b5bb3c713094ec677a93,
d2109c347ec237f6a4cf4d44336abdeeab82ec8f,
383973dc1a9dfc7baf12652b9e75498bef16aed9,
85938688be23ecd36a06757096896b2779b80d97,
416ec8f017b368ab953f624b075a7b0ffd296b9e,
2b871b5fedb85c1962ccab26c64bef9bf6f377d4,
38c557efd4cd5e59dee1d021009278b491523fee]
stable/4.19: [25440a8c77dd2fde6a8e9cfc0c616916febf408e,
3f66bedb96ff4c064a819e68499f79b38297ba26,
7af95ef3ec6248696300fce5c68f6c8c4f50e4a4,
995629e1d8e6751936c6e2b738f70b392b0461de,
d3cb3a6927222268a10b2f12dfb8c9444f7cc39e,
c034d344e733a3ac574dd09e39e911a50025c607,
8bfdba77595aee5c3e83ed1c9994c35d6d409605,
9711b12a3f4c0fc73dd257c1e467e6e42155a5f1]
stable/4.9: [a771511caa8e31cb5cac4fa39165ebbca3e62795,
d0ba50275860b456ff570edf3dcc2db5d2eb9eb8,
f9238d33710d74ac3dd668abaa53b2274f8e6fe6,
6481835a9a5b74e349e5c20ae8a9cb10a2e907fa,
b6a1aec08a84ccb331ce526c051df074150cf3c5,
0db1c4307aded2c5e618654f9341a249e0c1051f,
8edabefdc13294a9b15671937d165b948cf34d69,
0753760184745250e39018bb25ba77557390fe91]
stable/5.10: [f38774bb6e231d647d40ceeb8ddf9082eabde667,
a6a119d647ad1f73067d3cffb43104df3f920bcc,
071e8b69d7808d96f388d7c5ed606e75fd3d518d,
afc2d635b5e18e2b33116d8e121ee149882e33eb,
2fdf67a1d215574c31b1a716f80fa0fdccd401d7,
e335384560d1e106b609e8febd7e0427075a8938,
cc9e3e55bde71b2fac1494f503d5ffc560c7fb8d,
d04937ae94903087279e4a016b7741cdee59d521]
stable/5.15: [f150b6fccf7fa0e7e7275f0785798547db832c7b,
d7771f380c90e53a7b22f8e8a20b09c09e3583c7,
eb459641775636c3b4382ecc43ba3d6aa16892d5,
316e4a16524a2d2ce321f57c1abe4df9ef90f950,
a56566d7a957c34811384d6300a53a97be94cd20,
36fbbd78471c319a3a6f6402b99447c6d4686c69,
074d7260463962b44a8b8a61dcdd6ef513022e88,
bf048d1921b6cdc50bfc5a1b21b6fdd2d22e1fe1]
stable/5.16: [56829c19c8171303faca18d6ab3511ecdf3e7e23,
9b629eeb33222615a367eee8f038db907a797d3f,
227649a0a673da2c87c02c26c476a8599989a4d8,
6710bd548ec701bfedc175d145323cbf6930decb,
1984feb9872b905420af97d471d60051b6dd5851,
23cc87c04704f7ed978c85a4ec5901719fd26580,
19b78a9a32286216ec4aa64924d39ba5748b506d,
db3eaccf6e16c2d15d3fc8dc7c430d7df7c7bcc4]
stable/5.4: [41b50510e593541e2ee1537614652e91e71f6bf5,
96b3d45aeae03092637bd278ec4daadb48441906,
327a4da9b0ef89628a1d2aa825ce709049a402f1,
1e47ab3df908bbe1b6114374003c7a070ef35f01,
b1bacf22a847d21a12900bd6a1eacaecb5bca253,
865da3868b56a39b98003dcaa44cfbcdef0995fe,
7c7702569422ed49d66917e163df81dba763e983,
6c1599fd1bf8782f2b368e9eacc55571a7c3dd54]

CVE-2022-23960: Arm cpus BHI problem

Stable 4.19, 4.9, 5.10, 5.15, and 5.16 kernels were updated.

Fixed status

mainline: [9dd78194a3722fa6712192cdd4f7032d45112a9a,
04e91b7324760a377a725e218b5ee783826d30f5,
8d9d651ff2270a632e9dc497b142db31e8911315,
b9baf5c8c5c356757f4f9d8180b5e9d234065bc3,
25875aa71dfefd1959f07e626c4d285b88b27ac2,
4330e2c5c04c27bebf89d34e0bc14e6943413067,
1b33d4860deaecf1d8eec3061b7e7ed7ab0bae8d,
5bdf3437603d4af87f9c7f424b0c8aeed2420745,
d739da1694a0eaef0358a42b76904b611539b77b,
03aff3a77a58b5b52a77e00537a42090ad57b80b,
c091fb6ae059cda563b2a4d93fdbc548ef34e1d6,
6c5bf79b69f911560fbf82214c0971af6e58e682,
ed50da7764535f1e24432ded289974f2bf2b0c5a,
13d7a08352a83ef2252aeb464a5e08dfc06b5dfd,
c47e4d04ba0f1ea17353d85d45f611277507e07a,
a9c406e6462ff14956d690de7bbe5131a5677dc9,
aff65393fa1401e034656e349abd655cfe272de0,
ba2689234be92024e5635d30fe744f4853ad97db,
b28a8eebe81c186fdb1a0078263b30576c8e1f42,
bd09128d16fac3c34b80bd6a29088ac632e8ce09,
dee435be76f4117410bbd90573a881fd33488f37,
558c303c9734af5a813739cd284879227f7297d2,
a5905d6af492ee6a4a2205f0d550b3f931b03d03,
228a26b912287934789023b4132ba76065d9491c,
58c9a5060cb7cd529d49c93954cdafe81c1d642a]
stable/4.19: [dc64af755099d1e51fd64e99fe3a59b75595814a,
45c25917ceb7a5377883ef4c3a675276fba8a268,
67e1f18a972be16363c6e88d7b29cde880774164,
99e14db3b711c27f93079ba9d7f2fff169916d5f,
29db7e4b67fccf5e1fe28ec89f2add90ce74d77b]
stable/4.9: [b24d4041cfb6dab83f9edf40573375bd1365e619,
dfea9912129157ba3c5a9d060e58df17fb688e72,
964aafb29a07cb7cdea71ef41a75394e879f529c,
da3dfb69bbc3fdfeb3e5930fe28bcd689751a594,
48b1aa98e19d189703d518166ddb2520164b3164]
stable/5.10: [b7f1e73c4ddf2044530091e69114a5fc1a1229d0,
46deb224680bb33c8e87440a7b909d16e5a7d7c5,
29d9b56df1e18a8ff2e669b79e511163972a8b65,
3f9c958e3572b19b1cfb9d28eeb15be0a5d80193,
302754d023a06171113e8fb20c7b2a18ebf9088f,
dc5b630c0d532140e194997d350f587dbcc78bfb,
7048a21086fb16ec67287a25b62e88b0cd17c8c3,
192023e6baf7cce7fb76ff3a5c24c55968c774ff,
5242d6971e106be115d9dace9c1441f4a2e1cb25,
d93b25a6654812e0511b71a6d4a207f6b1ce5dfe,
bda89602814c69e6f027878209b0b9453133ada2,
5275fb5ea5f573ce1ecd2bf0bcd928abb916b43d,
e55025063276fcf7b07e9340c38d70b04aa8a7b9,
8c691e5308c531deede16bef4f2d933d5f859ce7,
73ee716a1f6356ca86d16d4ffc97fcfc7961d3ef,
26211252c1c104732a0fea6c37645f1b670587f5,
49379552969acee3237387cc258848437e127d98,
3f21b7e355237aa2f8196ad44c2b7456a739518d,
56cf5326bdf9c20de9a45e4a7a4c0ae16833e561,
1f63326a5211208e2c5868650e47f13a9072afde,
13a807a0a080383ceab6c40e53c0228108423e51,
e192c8baa69ac8a5585d61ac535aa1e5eb795e80,
38c26bdb3cc53f219d6ab75ac1a95436f393c60f,
551717cf3b58f11311d10f70eb027d4b275135de,
b65b87e718c33caa46d5246d8fbeda895aa9cf5b,
f3c12fc53e0a1fffbe102a9501c7bb6efdabbe99,
fc8070a9c5ad3e0ac343532df7d4d2d709b173a8,
86171569312b5870aaedc74b4b28d444c0f72105,
b19eaa004f2eeae94a4fcf5f0cadac35cc579a72,
7ae8127e412361025e7b4a0e6347ca9e8f3ed109,
dbcfa98539531bff0d7e4d6087741702dfa50f06,
162aa002ec1a78e91cf2f0b8e7450e2770b2941f,
97d8bdf33182494b7cb327ed555313d17d80c639]
stable/5.15: [f02cab2bed1a3493a230e54d83ff117bc59f480e,
878ad97f745ebc6b135d87b6901dbe93d07745d3,
2dca61693e6cb6d163e5ba2cf18f2c3270d7ec30,
576548846f1ee53a4d04fa5f91e6a088adbfe3f8,
842f2d498ee1e75fc9bf78555ee5b59c894c071b,
b7beeab84f02091124b176ba34c71a601762d1de,
44adac5908ff712e0fee34e3472f884c17af8025,
368a1fd8c4a600ed8ae605afa27904f359a57161,
479c9bb741bf6e1ac300d2f3c2797c7fbce117c0,
4a691bbf56a186f9df432b0bfd666dc2e82e4334,
e25a9dced2bdbace585d613444f2cf317b84cda5,
2e09754a03a7e54eae6017d94fb9c265217288f1,
be9c5526aad63ab0b13d72978206aec12ede9d76,
a40472d463f9ab6f971850989aa5a21f704b5cfd,
6895584a92eeaa0702afc47c9758b7fca6345fec,
517f988ee0500688ac23e011bc3bbbf502e76a23,
ffb8a34c0fd81fdcf677bc8e9af251ea526e8c49,
50e700a117669e072fb9e47ff3ea49e4a8cacf04,
cfd0c38125aa27a15617473d053897eb7967ab1c,
d7066114dcd6a295122c5942791025e16a33f89f,
8e55b9b0e76575e3755919820848b9ca53d82381,
4bbfd0c280254b273c564767021bb9b0f945148e,
fb2bb2ec137c3a8afbd91c949d9384d9e8a913c9,
8979720ac64c70af1395ce78e5c6ffb546b43e0d,
3317d21b84e91be72df14744040513a280b88946]
stable/5.16: [f5eb0f1dcde4b7c2b5ee920ae53bcecaaba03947,
0f0fd6ef76dee10aae861c69635c42b1c427e577,
21ceffd3628edfc775d33851cf56ea1d85c528fc,
9fd1d31810ccf6b4e4df8ccf2e68bbdcf528d186,
680e356c1be19a7663d8077be12e0ab048430ebd,
d1e3d6d26d9eab22548c3b7373ec12bbfecc765f,
346793c01582f62f4a5536c325a3dfc627ca543a,
46af6fc4f7a22ada597982ff01db34fb4bdba6a3,
7b63df956358d183c25178e970f6ed304cd0f659,
57e9a5fbd1f8b8ac5b7f849715fcdf5a32dda040,
62cfcf8d06ca7786e781e1b60f57b67f43448868,
5da0c4bbae492434b534ffd39aac5d5610190491,
dfb25997bdefca7a3cd69c1dea872ba52133d31f,
e0077b0a66f14998c0d18508bf945a40a0d3ebab,
984e7e3ebac334d7af0069a4d3636cf2338525df,
483fa5319f16b627e7873c1079e35ebbfb04cf45,
448a95af1b7ae205eb762c2c1fb35b290cc3032e,
d535ca624f6d439424aeeb0a3cc4a426cfd9a993,
b9c29587c533faaa0aefeaaf7a4a4ff834975ba4,
d4293ed32d390ce363d964a9216ce9ab0ff9d74c,
f0567fc3fb835499eda68f20e30ce16f9b83d774,
0b2bf1b37b5ebd90e69e30d8c2d6e1cd0c1f37b4,
e1e87704621efcf0310bd1543a8e6352156a43bd,
2df4d0aba0e673d37be14901e853d1d540b19bbd,
80d1978b8062cbad01cbea2aec2a5aac8f61c366]

CVE-2020-26555: BR/EDR pin code pairing broken

The commit 6d19628f ("Bluetooth: SMP: Fail if remote and local public
keys are identical") was merged in 5.13-rc1.
All stable kernels are fixed.

Fixed status

mainline: [6d19628f539fccf899298ff02ee4c73e4bf6df3f]
stable/4.14: [4555cee33f7d75c1ee69902c872c9d1e9568ebd5]
stable/4.19: [30126d4ba73119565f1748b116b9869ac6bbda6b]
stable/4.4: [75523bbfb0eaead670c97fbcf096ca2ab556f0c0]
stable/4.9: [6555a006b21ab49090b9a7b36e92d0421db19328]
stable/5.10: [d8d261c7cfb3a5dd921b4aeeb944718afc3f3961]
stable/5.4: [f97257cde764ad6979a7dbeb460b9fb69276342e]

CVE-2021-4149: description: Improper lock operation in btrfs

4.14, 4.19, and 4.9 kernels were fixed.

For 4.4
This patch can be applied to 4.4.

Fixed status

mainline: [19ea40dddf1833db868533958ca066f368862211]
stable/4.14: [e0956dd95ddd6b02b7eb084d127b926a509ae8e7]
stable/4.19: [73d55fa1b9310573f623195a4f7ab3170bbaf248]
stable/4.9: [43bfa08ba62a1ca7a22365c7092e491e04327efb]
stable/5.10: [206868a5b6c14adc4098dd3210a2f7510d97a670]
stable/5.4: [005a07c9acd6cf8a40555884f0650dfd4ec23fbe]
ubuntu/focal: [d1866774f0ef5d586ed62017838dd89869fe5dbb]

Currently tracking CVEs

CVE-2021-31615: Unencrypted Bluetooth Low Energy baseband links in
Bluetooth Core Specifications 4.0 through 5.2

There is no fix information.



CVE-2020-26556: kernel: malleable commitment Bluetooth Mesh Provisioning

No fix information.

CVE-2020-26557: kernel: predictable Authvalue in Bluetooth Mesh
Provisioning Leads to MITM

No fix information.

CVE-2020-26559: kernel: Authvalue leak in Bluetooth Mesh Provisioning

No fix information.

CVE-2020-26560: kernel: impersonation attack in Bluetooth Mesh Provisioning

No fix information.

Regards,
--
Masami Ichikawa
Cybertrust Japan Co., Ltd.

Email :masami.ichikawa@...
:masami.ichikawa@...


cip-gitlab/ci/iwamatsu/linux-5.10.y-cip-rc ltp-timers: 5 runs, 4 regressions (v5.10.104-cip3-132-g46c091c34fabb) #kernelci

kernelci.org bot <bot@...>
 

cip-gitlab/ci/iwamatsu/linux-5.10.y-cip-rc ltp-timers: 5 runs, 4 regressions (v5.10.104-cip3-132-g46c091c34fabb)

Regressions Summary
-------------------

platform | arch | lab | compiler | defconfig | regressions
-------------------------+--------+---------------+----------+------------------------------+------------
hp-11A-G6-EE-grunt | x86_64 | lab-collabora | gcc-10 | x86_64_defcon...6-chromebook | 2
r8a774a1-hihope-rzg2m-ex | arm64 | lab-cip | gcc-10 | defconfig | 2

Details: https://kernelci.org/test/job/cip-gitlab/branch/ci%2Fiwamatsu%2Flinux-5.10.y-cip-rc/kernel/v5.10.104-cip3-132-g46c091c34fabb/plan/ltp-timers/

Test: ltp-timers
Tree: cip-gitlab
Branch: ci/iwamatsu/linux-5.10.y-cip-rc
Describe: v5.10.104-cip3-132-g46c091c34fabb
URL: https://gitlab.com/cip-project/cip-kernel/linux-cip.git
SHA: 46c091c34fabba36aab030f3c3c0d43214e7806e

Test suite revisions:
ltp-tests
URL: https://github.com/linux-test-project/ltp.git
SHA: 67eccca54eb68a1bc91cf1f140fc43fa8085d8ed


Test Regressions
----------------


platform | arch | lab | compiler | defconfig | regressions
-------------------------+--------+---------------+----------+------------------------------+------------
hp-11A-G6-EE-grunt | x86_64 | lab-collabora | gcc-10 | x86_64_defcon...6-chromebook | 2

Details: https://kernelci.org/test/plan/id/62325a0fd072f3cf9cc62976

Results: 32 PASS, 4 FAIL, 0 SKIP
Full config: x86_64_defconfig+x86-chromebook
Compiler: gcc-10 (gcc (Debian 10.2.1-6) 10.2.1 20210110)
Plain log: https://storage.kernelci.org//cip-gitlab/ci-iwamatsu-linux-5.10.y-cip-rc/v5.10.104-cip3-132-g46c091c34fabb/x86_64/x86_64_defconfig+x86-chromebook/gcc-10/lab-collabora/ltp-timers-hp-11A-G6-EE-grunt.txt
HTML log: https://storage.kernelci.org//cip-gitlab/ci-iwamatsu-linux-5.10.y-cip-rc/v5.10.104-cip3-132-g46c091c34fabb/x86_64/x86_64_defconfig+x86-chromebook/gcc-10/lab-collabora/ltp-timers-hp-11A-G6-EE-grunt.html
Rootfs: http://storage.kernelci.org/images/rootfs/debian/bullseye-ltp/20220228.1/amd64/initrd.cpio.gz


* ltp-timers.clock_settime: https://kernelci.org/test/case/id/62325a0fd072f3cf9cc6297b
failing since 7 days (last pass: v5.10.100-cip2-319-gcbff87047566, first fail: v5.10.100-cip2-425-g0a0d92194f39)

* ltp-timers.clock_settime: https://kernelci.org/test/case/id/62325a0fd072f3cf9cc6297b
failing since 7 days (last pass: v5.10.100-cip2-319-gcbff87047566, first fail: v5.10.100-cip2-425-g0a0d92194f39)



platform | arch | lab | compiler | defconfig | regressions
-------------------------+--------+---------------+----------+------------------------------+------------
r8a774a1-hihope-rzg2m-ex | arm64 | lab-cip | gcc-10 | defconfig | 2

Details: https://kernelci.org/test/plan/id/62325c442a00821bf6c6296f

Results: 32 PASS, 4 FAIL, 0 SKIP
Full config: defconfig
Compiler: gcc-10 (aarch64-linux-gnu-gcc (Debian 10.2.1-6) 10.2.1 20210110)
Plain log: https://storage.kernelci.org//cip-gitlab/ci-iwamatsu-linux-5.10.y-cip-rc/v5.10.104-cip3-132-g46c091c34fabb/arm64/defconfig/gcc-10/lab-cip/ltp-timers-r8a774a1-hihope-rzg2m-ex.txt
HTML log: https://storage.kernelci.org//cip-gitlab/ci-iwamatsu-linux-5.10.y-cip-rc/v5.10.104-cip3-132-g46c091c34fabb/arm64/defconfig/gcc-10/lab-cip/ltp-timers-r8a774a1-hihope-rzg2m-ex.html
Rootfs: http://storage.kernelci.org/images/rootfs/debian/bullseye-ltp/20220228.1/arm64/initrd.cpio.gz


* ltp-timers.clock_settime: https://kernelci.org/test/case/id/62325c442a00821bf6c6297a
failing since 2 days (last pass: v5.10.100-cip2-425-g0a0d92194f39, first fail: v5.10.100-cip2-484-gede5006fb276)

* ltp-timers.clock_settime: https://kernelci.org/test/case/id/62325c442a00821bf6c6297a
failing since 2 days (last pass: v5.10.100-cip2-425-g0a0d92194f39, first fail: v5.10.100-cip2-484-gede5006fb276)


cip-gitlab/ci/iwamatsu/linux-5.10.y-cip-rc kselftest-seccomp: 5 runs, 3 regressions (v5.10.104-cip3-132-g46c091c34fabb) #kernelci

kernelci.org bot <bot@...>
 

cip-gitlab/ci/iwamatsu/linux-5.10.y-cip-rc kselftest-seccomp: 5 runs, 3 regressions (v5.10.104-cip3-132-g46c091c34fabb)

Regressions Summary
-------------------

platform | arch | lab | compiler | defconfig | regressions
--------------------------+--------+---------------+----------+------------------------------+------------
asus-C433TA-AJ0005-rammus | x86_64 | lab-collabora | gcc-10 | x86_64_defcon...ok+kselftest | 1
asus-C523NA-A20057-coral | x86_64 | lab-collabora | gcc-10 | x86_64_defcon...ok+kselftest | 1
hp-11A-G6-EE-grunt | x86_64 | lab-collabora | gcc-10 | x86_64_defcon...ok+kselftest | 1

Details: https://kernelci.org/test/job/cip-gitlab/branch/ci%2Fiwamatsu%2Flinux-5.10.y-cip-rc/kernel/v5.10.104-cip3-132-g46c091c34fabb/plan/kselftest-seccomp/

Test: kselftest-seccomp
Tree: cip-gitlab
Branch: ci/iwamatsu/linux-5.10.y-cip-rc
Describe: v5.10.104-cip3-132-g46c091c34fabb
URL: https://gitlab.com/cip-project/cip-kernel/linux-cip.git
SHA: 46c091c34fabba36aab030f3c3c0d43214e7806e


Test Regressions
----------------


platform | arch | lab | compiler | defconfig | regressions
--------------------------+--------+---------------+----------+------------------------------+------------
asus-C433TA-AJ0005-rammus | x86_64 | lab-collabora | gcc-10 | x86_64_defcon...ok+kselftest | 1

Details: https://kernelci.org/test/plan/id/623257f3cd20900652c629e3

Results: 83 PASS, 4 FAIL, 7 SKIP
Full config: x86_64_defconfig+x86-chromebook+kselftest
Compiler: gcc-10 (gcc (Debian 10.2.1-6) 10.2.1 20210110)
Plain log: https://storage.kernelci.org//cip-gitlab/ci-iwamatsu-linux-5.10.y-cip-rc/v5.10.104-cip3-132-g46c091c34fabb/x86_64/x86_64_defconfig+x86-chromebook+kselftest/gcc-10/lab-collabora/kselftest-seccomp-asus-C433TA-AJ0005-rammus.txt
HTML log: https://storage.kernelci.org//cip-gitlab/ci-iwamatsu-linux-5.10.y-cip-rc/v5.10.104-cip3-132-g46c091c34fabb/x86_64/x86_64_defconfig+x86-chromebook+kselftest/gcc-10/lab-collabora/kselftest-seccomp-asus-C433TA-AJ0005-rammus.html
Rootfs: http://storage.kernelci.org/images/rootfs/debian/bullseye-kselftest/20220228.1/amd64/initrd.cpio.gz


* kselftest-seccomp.seccomp_seccomp_bpf_TSYNC_siblings_fail_prctl: https://kernelci.org/test/case/id/623257f3cd20900652c629ea
failing since 12 days (last pass: v5.10.83-cip1-1540-g9fb82e7fedf9, first fail: v5.10.100-cip2-319-gcbff87047566)



platform | arch | lab | compiler | defconfig | regressions
--------------------------+--------+---------------+----------+------------------------------+------------
asus-C523NA-A20057-coral | x86_64 | lab-collabora | gcc-10 | x86_64_defcon...ok+kselftest | 1

Details: https://kernelci.org/test/plan/id/623258315b0254d86cc62980

Results: 83 PASS, 4 FAIL, 7 SKIP
Full config: x86_64_defconfig+x86-chromebook+kselftest
Compiler: gcc-10 (gcc (Debian 10.2.1-6) 10.2.1 20210110)
Plain log: https://storage.kernelci.org//cip-gitlab/ci-iwamatsu-linux-5.10.y-cip-rc/v5.10.104-cip3-132-g46c091c34fabb/x86_64/x86_64_defconfig+x86-chromebook+kselftest/gcc-10/lab-collabora/kselftest-seccomp-asus-C523NA-A20057-coral.txt
HTML log: https://storage.kernelci.org//cip-gitlab/ci-iwamatsu-linux-5.10.y-cip-rc/v5.10.104-cip3-132-g46c091c34fabb/x86_64/x86_64_defconfig+x86-chromebook+kselftest/gcc-10/lab-collabora/kselftest-seccomp-asus-C523NA-A20057-coral.html
Rootfs: http://storage.kernelci.org/images/rootfs/debian/bullseye-kselftest/20220228.1/amd64/initrd.cpio.gz


* kselftest-seccomp.seccomp_seccomp_bpf_TSYNC_siblings_fail_prctl: https://kernelci.org/test/case/id/623258315b0254d86cc62987
failing since 12 days (last pass: v5.10.83-cip1-1540-g9fb82e7fedf9, first fail: v5.10.100-cip2-319-gcbff87047566)



platform | arch | lab | compiler | defconfig | regressions
--------------------------+--------+---------------+----------+------------------------------+------------
hp-11A-G6-EE-grunt | x86_64 | lab-collabora | gcc-10 | x86_64_defcon...ok+kselftest | 1

Details: https://kernelci.org/test/plan/id/6232580eda81e1e25fc6299d

Results: 83 PASS, 4 FAIL, 7 SKIP
Full config: x86_64_defconfig+x86-chromebook+kselftest
Compiler: gcc-10 (gcc (Debian 10.2.1-6) 10.2.1 20210110)
Plain log: https://storage.kernelci.org//cip-gitlab/ci-iwamatsu-linux-5.10.y-cip-rc/v5.10.104-cip3-132-g46c091c34fabb/x86_64/x86_64_defconfig+x86-chromebook+kselftest/gcc-10/lab-collabora/kselftest-seccomp-hp-11A-G6-EE-grunt.txt
HTML log: https://storage.kernelci.org//cip-gitlab/ci-iwamatsu-linux-5.10.y-cip-rc/v5.10.104-cip3-132-g46c091c34fabb/x86_64/x86_64_defconfig+x86-chromebook+kselftest/gcc-10/lab-collabora/kselftest-seccomp-hp-11A-G6-EE-grunt.html
Rootfs: http://storage.kernelci.org/images/rootfs/debian/bullseye-kselftest/20220228.1/amd64/initrd.cpio.gz


* kselftest-seccomp.seccomp_seccomp_bpf_TSYNC_siblings_fail_prctl: https://kernelci.org/test/case/id/6232580eda81e1e25fc629a4
failing since 12 days (last pass: v5.10.83-cip1-1540-g9fb82e7fedf9, first fail: v5.10.100-cip2-319-gcbff87047566)

2381 - 2400 of 10158