Date   

Re: Failures in 5.10, 4.4 testing

Nobuhiro Iwamatsu
 

Hi Pavel,

2022年7月24日(日) 6:05 Pavel Machek <pavel@...>:

Hi!

I see a lot of failures this week. 5.10.133-rc1:
https://gitlab.com/cip-project/cip-testing/linux-stable-rc-ci/-/pipelines/595045922

4.4:
https://gitlab.com/cip-project/cip-kernel/linux-cip/-/pipelines/595036439
(renesas failure is expected).

Is bbb expected to work in 4.4? What is going on with 5.10 testing?
Lava slave (Lava lab) seems to have NFS problems.

Best regards,
Nobuhiro

--
Nobuhiro Iwamatsu
iwamatsu at {nigauri.org / debian.org}
GPG ID: 40AD1FA6


Failures in 5.10, 4.4 testing

Pavel Machek
 

Hi!

I see a lot of failures this week. 5.10.133-rc1:
https://gitlab.com/cip-project/cip-testing/linux-stable-rc-ci/-/pipelines/595045922

4.4:
https://gitlab.com/cip-project/cip-kernel/linux-cip/-/pipelines/595036439
(renesas failure is expected).

Is bbb expected to work in 4.4? What is going on with 5.10 testing?

Best regards,
Pavel

--
DENX Software Engineering GmbH, Managing Director: Wolfgang Denk
HRB 165235 Munich, Office: Kirchenstr.5, D-82194 Groebenzell, Germany


Re: [isar-cip-core] security-customizations: Fix pam_tally2 deprecation

Jan Kiszka
 

On 21.07.22 08:59, venkata.pyla@... wrote:
From: venkata pyla <venkata.pyla@...>

pam_tally2 is deprecated from PAM version 1.4.0 that is from
Debian Bullseye, and introduced pam_faillock as replacement [1].

Modified the security customizations to check first pam_tally2 existence
for backward compatibility and if not found use the pam_faillock to
achieve the same functionality.

Fixes #33

[1] https://github.com/linux-pam/linux-pam/releases/tag/v1.4.0

Signed-off-by: venkata pyla <venkata.pyla@...>
---
.../security-customizations/files/postinst | 19 +++++++++++++++----
1 file changed, 15 insertions(+), 4 deletions(-)

diff --git a/recipes-core/security-customizations/files/postinst b/recipes-core/security-customizations/files/postinst
index 9ba8540..ae06ab7 100644
--- a/recipes-core/security-customizations/files/postinst
+++ b/recipes-core/security-customizations/files/postinst
@@ -22,11 +22,22 @@ sed -i "0,/^password.*/s/^password.*/${pam_cracklib_config}\n&/" "${PAM_PWD_FILE
# CR1.11: Unsuccessful login attempts
# Lock user account after unsuccessful login attempts
PAM_AUTH_FILE="/etc/pam.d/common-auth"
-pam_tally="auth required pam_tally2.so deny=3 even_deny_root unlock_time=60 root_unlock_time=60"
-if grep -c "pam_tally2.so" "${PAM_AUTH_FILE}";then
- sed -i '/pam_tally2/ s/^#*/#/' "${PAM_AUTH_FILE}"
+# pam_tally2 is deprecated from pam version 1.4.0-7
+if [ -f /lib/*-linux-gnu*/security/pam_tally2.so ]; then
+ PAM_MODULE="pam_tally2.so"
+ PAM_CONFIG="auth required pam_tally2.so deny=3 even_deny_root unlock_time=60 root_unlock_time=60"
+elif [ -f /lib/*-linux-gnu*/security/pam_faillock.so ]; then
+ PAM_MODULE="pam_faillock.so"
+ PAM_CONFIG="auth required pam_faillock.so preauth silent deny=3 even_deny_root unlock_time=60 root_unlock_time=60 \
+ \nauth required pam_faillock.so .so authfail deny=3 even_deny_root unlock_time=60 root_unlock_time=60"
+else
+ echo "No suitable pam module found to lock failed login attempts"
Shouldn't we rather fail (exit 1) in this case?

fi
-sed -i "0,/^auth.*/s/^auth.*/${pam_tally}\n&/" "${PAM_AUTH_FILE}"
+
+if grep -c "${PAM_MODULE}" "${PAM_AUTH_FILE}";then
+ sed -i '/${PAM_MODULE}/ s/^#*/#/' "${PAM_AUTH_FILE}"
+fi
+sed -i "0,/^auth.*/s/^auth.*/${PAM_CONFIG}\n&/" "${PAM_AUTH_FILE}"

# CR2.6: Remote session termination
# Terminate remote session after inactive time period
Jan

--
Siemens AG, Technology
Competence Center Embedded Linux


cip-gitlab/ci/iwamatsu/linux-4.19.y-cip-rc smc: 11 runs, 2 regressions (v4.19.251-cip77-82-g10c370b53152) #kernelci

kernelci.org bot <bot@...>
 

cip-gitlab/ci/iwamatsu/linux-4.19.y-cip-rc smc: 11 runs, 2 regressions (v4.19.251-cip77-82-g10c370b53152)

Regressions Summary
-------------------

platform | arch | lab | compiler | defconfig | regressions
----------------------+-------+-------------+----------+----------------------------+------------
qemu_arm64-virt-gicv3 | arm64 | lab-broonie | gcc-10 | defconfig | 1
qemu_arm64-virt-gicv3 | arm64 | lab-broonie | gcc-10 | defconfig+arm64-chromebook | 1

Details: https://kernelci.org/test/job/cip-gitlab/branch/ci%2Fiwamatsu%2Flinux-4.19.y-cip-rc/kernel/v4.19.251-cip77-82-g10c370b53152/plan/smc/

Test: smc
Tree: cip-gitlab
Branch: ci/iwamatsu/linux-4.19.y-cip-rc
Describe: v4.19.251-cip77-82-g10c370b53152
URL: https://gitlab.com/cip-project/cip-kernel/linux-cip.git
SHA: 10c370b53152e01c8282be083dc0943e33d50ead


Test Regressions
----------------


platform | arch | lab | compiler | defconfig | regressions
----------------------+-------+-------------+----------+----------------------------+------------
qemu_arm64-virt-gicv3 | arm64 | lab-broonie | gcc-10 | defconfig | 1

Details: https://kernelci.org/test/plan/id/62da59c84b0ef31303daf06f

Results: 0 PASS, 1 FAIL, 0 SKIP
Full config: defconfig
Compiler: gcc-10 (aarch64-linux-gnu-gcc (Debian 10.2.1-6) 10.2.1 20210110)
Plain log: https://storage.kernelci.org//cip-gitlab/ci-iwamatsu-linux-4.19.y-cip-rc/v4.19.251-cip77-82-g10c370b53152/arm64/defconfig/gcc-10/lab-broonie/smc-qemu_arm64-virt-gicv3.txt
HTML log: https://storage.kernelci.org//cip-gitlab/ci-iwamatsu-linux-4.19.y-cip-rc/v4.19.251-cip77-82-g10c370b53152/arm64/defconfig/gcc-10/lab-broonie/smc-qemu_arm64-virt-gicv3.html
Rootfs: http://storage.kernelci.org/images/rootfs/buildroot/buildroot-baseline/20220716.0/arm64/rootfs.cpio.gz


* smc.login: https://kernelci.org/test/case/id/62da59c84b0ef31303daf070
failing since 45 days (last pass: v4.19.239-cip72-68-g407458469172, first fail: v4.19.245-cip74-32-g2d021d7a9e637)



platform | arch | lab | compiler | defconfig | regressions
----------------------+-------+-------------+----------+----------------------------+------------
qemu_arm64-virt-gicv3 | arm64 | lab-broonie | gcc-10 | defconfig+arm64-chromebook | 1

Details: https://kernelci.org/test/plan/id/62da5b1c9fffdc60bbdaf068

Results: 0 PASS, 1 FAIL, 0 SKIP
Full config: defconfig+arm64-chromebook
Compiler: gcc-10 (aarch64-linux-gnu-gcc (Debian 10.2.1-6) 10.2.1 20210110)
Plain log: https://storage.kernelci.org//cip-gitlab/ci-iwamatsu-linux-4.19.y-cip-rc/v4.19.251-cip77-82-g10c370b53152/arm64/defconfig+arm64-chromebook/gcc-10/lab-broonie/smc-qemu_arm64-virt-gicv3.txt
HTML log: https://storage.kernelci.org//cip-gitlab/ci-iwamatsu-linux-4.19.y-cip-rc/v4.19.251-cip77-82-g10c370b53152/arm64/defconfig+arm64-chromebook/gcc-10/lab-broonie/smc-qemu_arm64-virt-gicv3.html
Rootfs: http://storage.kernelci.org/images/rootfs/buildroot/buildroot-baseline/20220716.0/arm64/rootfs.cpio.gz


* smc.login: https://kernelci.org/test/case/id/62da5b1c9fffdc60bbdaf069
failing since 45 days (last pass: v4.19.239-cip72-68-g407458469172, first fail: v4.19.245-cip74-32-g2d021d7a9e637)


cip-gitlab/ci/iwamatsu/linux-4.19.y-cip-rc ltp-timers: 11 runs, 2 regressions (v4.19.251-cip77-82-g10c370b53152) #kernelci

kernelci.org bot <bot@...>
 

cip-gitlab/ci/iwamatsu/linux-4.19.y-cip-rc ltp-timers: 11 runs, 2 regressions (v4.19.251-cip77-82-g10c370b53152)

Regressions Summary
-------------------

platform | arch | lab | compiler | defconfig | regressions
-------------------------+-------+---------+----------+----------------------------+------------
r8a774a1-hihope-rzg2m-ex | arm64 | lab-cip | gcc-10 | defconfig | 1
r8a774a1-hihope-rzg2m-ex | arm64 | lab-cip | gcc-10 | defconfig+arm64-chromebook | 1

Details: https://kernelci.org/test/job/cip-gitlab/branch/ci%2Fiwamatsu%2Flinux-4.19.y-cip-rc/kernel/v4.19.251-cip77-82-g10c370b53152/plan/ltp-timers/

Test: ltp-timers
Tree: cip-gitlab
Branch: ci/iwamatsu/linux-4.19.y-cip-rc
Describe: v4.19.251-cip77-82-g10c370b53152
URL: https://gitlab.com/cip-project/cip-kernel/linux-cip.git
SHA: 10c370b53152e01c8282be083dc0943e33d50ead

Test suite revisions:
ltp-tests
URL: https://github.com/linux-test-project/ltp.git
SHA: bda92ad659a52d38ac810099f69adff626b064c6


Test Regressions
----------------


platform | arch | lab | compiler | defconfig | regressions
-------------------------+-------+---------+----------+----------------------------+------------
r8a774a1-hihope-rzg2m-ex | arm64 | lab-cip | gcc-10 | defconfig | 1

Details: https://kernelci.org/test/plan/id/62da583a1454fa8b22daf05e

Results: 0 PASS, 1 FAIL, 0 SKIP
Full config: defconfig
Compiler: gcc-10 (aarch64-linux-gnu-gcc (Debian 10.2.1-6) 10.2.1 20210110)
Plain log: https://storage.kernelci.org//cip-gitlab/ci-iwamatsu-linux-4.19.y-cip-rc/v4.19.251-cip77-82-g10c370b53152/arm64/defconfig/gcc-10/lab-cip/ltp-timers-r8a774a1-hihope-rzg2m-ex.txt
HTML log: https://storage.kernelci.org//cip-gitlab/ci-iwamatsu-linux-4.19.y-cip-rc/v4.19.251-cip77-82-g10c370b53152/arm64/defconfig/gcc-10/lab-cip/ltp-timers-r8a774a1-hihope-rzg2m-ex.html
Rootfs: http://storage.kernelci.org/images/rootfs/debian/bullseye-ltp/20220716.0/arm64/initrd.cpio.gz


* ltp-timers.login: https://kernelci.org/test/case/id/62da583a1454fa8b22daf05f
new failure (last pass: v4.19.249-cip76-57-gef3cc1b9e556)



platform | arch | lab | compiler | defconfig | regressions
-------------------------+-------+---------+----------+----------------------------+------------
r8a774a1-hihope-rzg2m-ex | arm64 | lab-cip | gcc-10 | defconfig+arm64-chromebook | 1

Details: https://kernelci.org/test/plan/id/62da65e5ee6dcc6b29daf056

Results: 0 PASS, 1 FAIL, 0 SKIP
Full config: defconfig+arm64-chromebook
Compiler: gcc-10 (aarch64-linux-gnu-gcc (Debian 10.2.1-6) 10.2.1 20210110)
Plain log: https://storage.kernelci.org//cip-gitlab/ci-iwamatsu-linux-4.19.y-cip-rc/v4.19.251-cip77-82-g10c370b53152/arm64/defconfig+arm64-chromebook/gcc-10/lab-cip/ltp-timers-r8a774a1-hihope-rzg2m-ex.txt
HTML log: https://storage.kernelci.org//cip-gitlab/ci-iwamatsu-linux-4.19.y-cip-rc/v4.19.251-cip77-82-g10c370b53152/arm64/defconfig+arm64-chromebook/gcc-10/lab-cip/ltp-timers-r8a774a1-hihope-rzg2m-ex.html
Rootfs: http://storage.kernelci.org/images/rootfs/debian/bullseye-ltp/20220716.0/arm64/initrd.cpio.gz


* ltp-timers.login: https://kernelci.org/test/case/id/62da65e5ee6dcc6b29daf057
new failure (last pass: v4.19.249-cip76-57-gef3cc1b9e556)


cip-gitlab/ci/iwamatsu/linux-4.19.y-cip-rc ltp-pty: 7 runs, 2 regressions (v4.19.251-cip77-82-g10c370b53152) #kernelci

kernelci.org bot <bot@...>
 

cip-gitlab/ci/iwamatsu/linux-4.19.y-cip-rc ltp-pty: 7 runs, 2 regressions (v4.19.251-cip77-82-g10c370b53152)

Regressions Summary
-------------------

platform | arch | lab | compiler | defconfig | regressions
-------------------------+-------+---------+----------+----------------------------+------------
r8a774a1-hihope-rzg2m-ex | arm64 | lab-cip | gcc-10 | defconfig | 1
r8a774a1-hihope-rzg2m-ex | arm64 | lab-cip | gcc-10 | defconfig+arm64-chromebook | 1

Details: https://kernelci.org/test/job/cip-gitlab/branch/ci%2Fiwamatsu%2Flinux-4.19.y-cip-rc/kernel/v4.19.251-cip77-82-g10c370b53152/plan/ltp-pty/

Test: ltp-pty
Tree: cip-gitlab
Branch: ci/iwamatsu/linux-4.19.y-cip-rc
Describe: v4.19.251-cip77-82-g10c370b53152
URL: https://gitlab.com/cip-project/cip-kernel/linux-cip.git
SHA: 10c370b53152e01c8282be083dc0943e33d50ead

Test suite revisions:
ltp-tests
URL: https://github.com/linux-test-project/ltp.git
SHA: bda92ad659a52d38ac810099f69adff626b064c6


Test Regressions
----------------


platform | arch | lab | compiler | defconfig | regressions
-------------------------+-------+---------+----------+----------------------------+------------
r8a774a1-hihope-rzg2m-ex | arm64 | lab-cip | gcc-10 | defconfig | 1

Details: https://kernelci.org/test/plan/id/62da596430ae360decdaf056

Results: 0 PASS, 1 FAIL, 0 SKIP
Full config: defconfig
Compiler: gcc-10 (aarch64-linux-gnu-gcc (Debian 10.2.1-6) 10.2.1 20210110)
Plain log: https://storage.kernelci.org//cip-gitlab/ci-iwamatsu-linux-4.19.y-cip-rc/v4.19.251-cip77-82-g10c370b53152/arm64/defconfig/gcc-10/lab-cip/ltp-pty-r8a774a1-hihope-rzg2m-ex.txt
HTML log: https://storage.kernelci.org//cip-gitlab/ci-iwamatsu-linux-4.19.y-cip-rc/v4.19.251-cip77-82-g10c370b53152/arm64/defconfig/gcc-10/lab-cip/ltp-pty-r8a774a1-hihope-rzg2m-ex.html
Rootfs: http://storage.kernelci.org/images/rootfs/debian/bullseye-ltp/20220716.0/arm64/initrd.cpio.gz


* ltp-pty.login: https://kernelci.org/test/case/id/62da596430ae360decdaf057
new failure (last pass: v4.19.249-cip76-57-gef3cc1b9e556)



platform | arch | lab | compiler | defconfig | regressions
-------------------------+-------+---------+----------+----------------------------+------------
r8a774a1-hihope-rzg2m-ex | arm64 | lab-cip | gcc-10 | defconfig+arm64-chromebook | 1

Details: https://kernelci.org/test/plan/id/62da61494fab8f1964daf06d

Results: 0 PASS, 1 FAIL, 0 SKIP
Full config: defconfig+arm64-chromebook
Compiler: gcc-10 (aarch64-linux-gnu-gcc (Debian 10.2.1-6) 10.2.1 20210110)
Plain log: https://storage.kernelci.org//cip-gitlab/ci-iwamatsu-linux-4.19.y-cip-rc/v4.19.251-cip77-82-g10c370b53152/arm64/defconfig+arm64-chromebook/gcc-10/lab-cip/ltp-pty-r8a774a1-hihope-rzg2m-ex.txt
HTML log: https://storage.kernelci.org//cip-gitlab/ci-iwamatsu-linux-4.19.y-cip-rc/v4.19.251-cip77-82-g10c370b53152/arm64/defconfig+arm64-chromebook/gcc-10/lab-cip/ltp-pty-r8a774a1-hihope-rzg2m-ex.html
Rootfs: http://storage.kernelci.org/images/rootfs/debian/bullseye-ltp/20220716.0/arm64/initrd.cpio.gz


* ltp-pty.login: https://kernelci.org/test/case/id/62da61494fab8f1964daf06e
new failure (last pass: v4.19.249-cip76-57-gef3cc1b9e556)


cip-gitlab/ci/iwamatsu/linux-4.19.y-cip-rc ltp-ipc: 12 runs, 3 regressions (v4.19.251-cip77-82-g10c370b53152) #kernelci

kernelci.org bot <bot@...>
 

cip-gitlab/ci/iwamatsu/linux-4.19.y-cip-rc ltp-ipc: 12 runs, 3 regressions (v4.19.251-cip77-82-g10c370b53152)

Regressions Summary
-------------------

platform | arch | lab | compiler | defconfig | regressions
-------------------------+-------+---------+----------+----------------------------+------------
beaglebone-black | arm | lab-cip | gcc-10 | omap2plus_defconfig | 1
r8a774a1-hihope-rzg2m-ex | arm64 | lab-cip | gcc-10 | defconfig | 1
r8a774a1-hihope-rzg2m-ex | arm64 | lab-cip | gcc-10 | defconfig+arm64-chromebook | 1

Details: https://kernelci.org/test/job/cip-gitlab/branch/ci%2Fiwamatsu%2Flinux-4.19.y-cip-rc/kernel/v4.19.251-cip77-82-g10c370b53152/plan/ltp-ipc/

Test: ltp-ipc
Tree: cip-gitlab
Branch: ci/iwamatsu/linux-4.19.y-cip-rc
Describe: v4.19.251-cip77-82-g10c370b53152
URL: https://gitlab.com/cip-project/cip-kernel/linux-cip.git
SHA: 10c370b53152e01c8282be083dc0943e33d50ead

Test suite revisions:
ltp-tests
URL: https://github.com/linux-test-project/ltp.git
SHA: bda92ad659a52d38ac810099f69adff626b064c6


Test Regressions
----------------


platform | arch | lab | compiler | defconfig | regressions
-------------------------+-------+---------+----------+----------------------------+------------
beaglebone-black | arm | lab-cip | gcc-10 | omap2plus_defconfig | 1

Details: https://kernelci.org/test/plan/id/62da56bcef38e573b0daf0b3

Results: 0 PASS, 1 FAIL, 0 SKIP
Full config: omap2plus_defconfig
Compiler: gcc-10 (arm-linux-gnueabihf-gcc (Debian 10.2.1-6) 10.2.1 20210110)
Plain log: https://storage.kernelci.org//cip-gitlab/ci-iwamatsu-linux-4.19.y-cip-rc/v4.19.251-cip77-82-g10c370b53152/arm/omap2plus_defconfig/gcc-10/lab-cip/ltp-ipc-beaglebone-black.txt
HTML log: https://storage.kernelci.org//cip-gitlab/ci-iwamatsu-linux-4.19.y-cip-rc/v4.19.251-cip77-82-g10c370b53152/arm/omap2plus_defconfig/gcc-10/lab-cip/ltp-ipc-beaglebone-black.html
Rootfs: http://storage.kernelci.org/images/rootfs/debian/bullseye-ltp/20220716.0/armhf/initrd.cpio.gz


* ltp-ipc.login: https://kernelci.org/test/case/id/62da56bcef38e573b0daf0b4
new failure (last pass: v4.19.249-cip76-57-gef3cc1b9e556)



platform | arch | lab | compiler | defconfig | regressions
-------------------------+-------+---------+----------+----------------------------+------------
r8a774a1-hihope-rzg2m-ex | arm64 | lab-cip | gcc-10 | defconfig | 1

Details: https://kernelci.org/test/plan/id/62da5af49fffdc60bbdaf064

Results: 0 PASS, 1 FAIL, 0 SKIP
Full config: defconfig
Compiler: gcc-10 (aarch64-linux-gnu-gcc (Debian 10.2.1-6) 10.2.1 20210110)
Plain log: https://storage.kernelci.org//cip-gitlab/ci-iwamatsu-linux-4.19.y-cip-rc/v4.19.251-cip77-82-g10c370b53152/arm64/defconfig/gcc-10/lab-cip/ltp-ipc-r8a774a1-hihope-rzg2m-ex.txt
HTML log: https://storage.kernelci.org//cip-gitlab/ci-iwamatsu-linux-4.19.y-cip-rc/v4.19.251-cip77-82-g10c370b53152/arm64/defconfig/gcc-10/lab-cip/ltp-ipc-r8a774a1-hihope-rzg2m-ex.html
Rootfs: http://storage.kernelci.org/images/rootfs/debian/bullseye-ltp/20220716.0/arm64/initrd.cpio.gz


* ltp-ipc.login: https://kernelci.org/test/case/id/62da5af49fffdc60bbdaf065
new failure (last pass: v4.19.249-cip76-57-gef3cc1b9e556)



platform | arch | lab | compiler | defconfig | regressions
-------------------------+-------+---------+----------+----------------------------+------------
r8a774a1-hihope-rzg2m-ex | arm64 | lab-cip | gcc-10 | defconfig+arm64-chromebook | 1

Details: https://kernelci.org/test/plan/id/62da647de49d10699adaf058

Results: 0 PASS, 1 FAIL, 0 SKIP
Full config: defconfig+arm64-chromebook
Compiler: gcc-10 (aarch64-linux-gnu-gcc (Debian 10.2.1-6) 10.2.1 20210110)
Plain log: https://storage.kernelci.org//cip-gitlab/ci-iwamatsu-linux-4.19.y-cip-rc/v4.19.251-cip77-82-g10c370b53152/arm64/defconfig+arm64-chromebook/gcc-10/lab-cip/ltp-ipc-r8a774a1-hihope-rzg2m-ex.txt
HTML log: https://storage.kernelci.org//cip-gitlab/ci-iwamatsu-linux-4.19.y-cip-rc/v4.19.251-cip77-82-g10c370b53152/arm64/defconfig+arm64-chromebook/gcc-10/lab-cip/ltp-ipc-r8a774a1-hihope-rzg2m-ex.html
Rootfs: http://storage.kernelci.org/images/rootfs/debian/bullseye-ltp/20220716.0/arm64/initrd.cpio.gz


* ltp-ipc.login: https://kernelci.org/test/case/id/62da647de49d10699adaf059
new failure (last pass: v4.19.249-cip76-57-gef3cc1b9e556)


cip-gitlab/ci/iwamatsu/linux-4.19.y-cip-rc ltp-fcntl-locktests: 7 runs, 2 regressions (v4.19.251-cip77-82-g10c370b53152) #kernelci

kernelci.org bot <bot@...>
 

cip-gitlab/ci/iwamatsu/linux-4.19.y-cip-rc ltp-fcntl-locktests: 7 runs, 2 regressions (v4.19.251-cip77-82-g10c370b53152)

Regressions Summary
-------------------

platform | arch | lab | compiler | defconfig | regressions
-------------------------+-------+---------+----------+----------------------------+------------
r8a774a1-hihope-rzg2m-ex | arm64 | lab-cip | gcc-10 | defconfig | 1
r8a774a1-hihope-rzg2m-ex | arm64 | lab-cip | gcc-10 | defconfig+arm64-chromebook | 1

Details: https://kernelci.org/test/job/cip-gitlab/branch/ci%2Fiwamatsu%2Flinux-4.19.y-cip-rc/kernel/v4.19.251-cip77-82-g10c370b53152/plan/ltp-fcntl-locktests/

Test: ltp-fcntl-locktests
Tree: cip-gitlab
Branch: ci/iwamatsu/linux-4.19.y-cip-rc
Describe: v4.19.251-cip77-82-g10c370b53152
URL: https://gitlab.com/cip-project/cip-kernel/linux-cip.git
SHA: 10c370b53152e01c8282be083dc0943e33d50ead

Test suite revisions:
ltp-tests
URL: https://github.com/linux-test-project/ltp.git
SHA: bda92ad659a52d38ac810099f69adff626b064c6


Test Regressions
----------------


platform | arch | lab | compiler | defconfig | regressions
-------------------------+-------+---------+----------+----------------------------+------------
r8a774a1-hihope-rzg2m-ex | arm64 | lab-cip | gcc-10 | defconfig | 1

Details: https://kernelci.org/test/plan/id/62da57d58a94f379e5daf064

Results: 0 PASS, 1 FAIL, 0 SKIP
Full config: defconfig
Compiler: gcc-10 (aarch64-linux-gnu-gcc (Debian 10.2.1-6) 10.2.1 20210110)
Plain log: https://storage.kernelci.org//cip-gitlab/ci-iwamatsu-linux-4.19.y-cip-rc/v4.19.251-cip77-82-g10c370b53152/arm64/defconfig/gcc-10/lab-cip/ltp-fcntl-locktests-r8a774a1-hihope-rzg2m-ex.txt
HTML log: https://storage.kernelci.org//cip-gitlab/ci-iwamatsu-linux-4.19.y-cip-rc/v4.19.251-cip77-82-g10c370b53152/arm64/defconfig/gcc-10/lab-cip/ltp-fcntl-locktests-r8a774a1-hihope-rzg2m-ex.html
Rootfs: http://storage.kernelci.org/images/rootfs/debian/bullseye-ltp/20220716.0/arm64/initrd.cpio.gz


* ltp-fcntl-locktests.login: https://kernelci.org/test/case/id/62da57d58a94f379e5daf065
new failure (last pass: v4.19.249-cip76-57-gef3cc1b9e556)



platform | arch | lab | compiler | defconfig | regressions
-------------------------+-------+---------+----------+----------------------------+------------
r8a774a1-hihope-rzg2m-ex | arm64 | lab-cip | gcc-10 | defconfig+arm64-chromebook | 1

Details: https://kernelci.org/test/plan/id/62da62ed7c648f6f1edaf056

Results: 0 PASS, 1 FAIL, 0 SKIP
Full config: defconfig+arm64-chromebook
Compiler: gcc-10 (aarch64-linux-gnu-gcc (Debian 10.2.1-6) 10.2.1 20210110)
Plain log: https://storage.kernelci.org//cip-gitlab/ci-iwamatsu-linux-4.19.y-cip-rc/v4.19.251-cip77-82-g10c370b53152/arm64/defconfig+arm64-chromebook/gcc-10/lab-cip/ltp-fcntl-locktests-r8a774a1-hihope-rzg2m-ex.txt
HTML log: https://storage.kernelci.org//cip-gitlab/ci-iwamatsu-linux-4.19.y-cip-rc/v4.19.251-cip77-82-g10c370b53152/arm64/defconfig+arm64-chromebook/gcc-10/lab-cip/ltp-fcntl-locktests-r8a774a1-hihope-rzg2m-ex.html
Rootfs: http://storage.kernelci.org/images/rootfs/debian/bullseye-ltp/20220716.0/arm64/initrd.cpio.gz


* ltp-fcntl-locktests.login: https://kernelci.org/test/case/id/62da62ed7c648f6f1edaf057
new failure (last pass: v4.19.249-cip76-57-gef3cc1b9e556)


cip-gitlab/ci/iwamatsu/linux-4.19.y-cip-rc kselftest-futex: 12 runs, 4 regressions (v4.19.251-cip77-82-g10c370b53152) #kernelci

kernelci.org bot <bot@...>
 

cip-gitlab/ci/iwamatsu/linux-4.19.y-cip-rc kselftest-futex: 12 runs, 4 regressions (v4.19.251-cip77-82-g10c370b53152)

Regressions Summary
-------------------

platform | arch | lab | compiler | defconfig | regressions
-----------------------------+-------+--------------+----------+----------------------------+------------
meson-gxl-s905x-libretech-cc | arm64 | lab-baylibre | gcc-10 | defconfig | 1
meson-gxl-s905x-libretech-cc | arm64 | lab-broonie | gcc-10 | defconfig | 1
r8a774a1-hihope-rzg2m-ex | arm64 | lab-cip | gcc-10 | defconfig | 1
r8a774a1-hihope-rzg2m-ex | arm64 | lab-cip | gcc-10 | defconfig+arm64-chromebook | 1

Details: https://kernelci.org/test/job/cip-gitlab/branch/ci%2Fiwamatsu%2Flinux-4.19.y-cip-rc/kernel/v4.19.251-cip77-82-g10c370b53152/plan/kselftest-futex/

Test: kselftest-futex
Tree: cip-gitlab
Branch: ci/iwamatsu/linux-4.19.y-cip-rc
Describe: v4.19.251-cip77-82-g10c370b53152
URL: https://gitlab.com/cip-project/cip-kernel/linux-cip.git
SHA: 10c370b53152e01c8282be083dc0943e33d50ead


Test Regressions
----------------


platform | arch | lab | compiler | defconfig | regressions
-----------------------------+-------+--------------+----------+----------------------------+------------
meson-gxl-s905x-libretech-cc | arm64 | lab-baylibre | gcc-10 | defconfig | 1

Details: https://kernelci.org/test/plan/id/62da554b5feb18b749daf056

Results: 0 PASS, 1 FAIL, 0 SKIP
Full config: defconfig
Compiler: gcc-10 (aarch64-linux-gnu-gcc (Debian 10.2.1-6) 10.2.1 20210110)
Plain log: https://storage.kernelci.org//cip-gitlab/ci-iwamatsu-linux-4.19.y-cip-rc/v4.19.251-cip77-82-g10c370b53152/arm64/defconfig/gcc-10/lab-baylibre/kselftest-futex-meson-gxl-s905x-libretech-cc.txt
HTML log: https://storage.kernelci.org//cip-gitlab/ci-iwamatsu-linux-4.19.y-cip-rc/v4.19.251-cip77-82-g10c370b53152/arm64/defconfig/gcc-10/lab-baylibre/kselftest-futex-meson-gxl-s905x-libretech-cc.html
Rootfs: http://storage.kernelci.org/images/rootfs/debian/bullseye-kselftest/20220716.0/arm64/initrd.cpio.gz


* kselftest-futex.login: https://kernelci.org/test/case/id/62da554b5feb18b749daf057
new failure (last pass: v4.19.249-cip76-57-gef3cc1b9e556)



platform | arch | lab | compiler | defconfig | regressions
-----------------------------+-------+--------------+----------+----------------------------+------------
meson-gxl-s905x-libretech-cc | arm64 | lab-broonie | gcc-10 | defconfig | 1

Details: https://kernelci.org/test/plan/id/62da58a1db106e0b34daf057

Results: 0 PASS, 1 FAIL, 0 SKIP
Full config: defconfig
Compiler: gcc-10 (aarch64-linux-gnu-gcc (Debian 10.2.1-6) 10.2.1 20210110)
Plain log: https://storage.kernelci.org//cip-gitlab/ci-iwamatsu-linux-4.19.y-cip-rc/v4.19.251-cip77-82-g10c370b53152/arm64/defconfig/gcc-10/lab-broonie/kselftest-futex-meson-gxl-s905x-libretech-cc.txt
HTML log: https://storage.kernelci.org//cip-gitlab/ci-iwamatsu-linux-4.19.y-cip-rc/v4.19.251-cip77-82-g10c370b53152/arm64/defconfig/gcc-10/lab-broonie/kselftest-futex-meson-gxl-s905x-libretech-cc.html
Rootfs: http://storage.kernelci.org/images/rootfs/debian/bullseye-kselftest/20220716.0/arm64/initrd.cpio.gz


* kselftest-futex.login: https://kernelci.org/test/case/id/62da58a1db106e0b34daf058
new failure (last pass: v4.19.249-cip76-57-gef3cc1b9e556)



platform | arch | lab | compiler | defconfig | regressions
-----------------------------+-------+--------------+----------+----------------------------+------------
r8a774a1-hihope-rzg2m-ex | arm64 | lab-cip | gcc-10 | defconfig | 1

Details: https://kernelci.org/test/plan/id/62da5eddf6b604558bdaf056

Results: 0 PASS, 1 FAIL, 0 SKIP
Full config: defconfig
Compiler: gcc-10 (aarch64-linux-gnu-gcc (Debian 10.2.1-6) 10.2.1 20210110)
Plain log: https://storage.kernelci.org//cip-gitlab/ci-iwamatsu-linux-4.19.y-cip-rc/v4.19.251-cip77-82-g10c370b53152/arm64/defconfig/gcc-10/lab-cip/kselftest-futex-r8a774a1-hihope-rzg2m-ex.txt
HTML log: https://storage.kernelci.org//cip-gitlab/ci-iwamatsu-linux-4.19.y-cip-rc/v4.19.251-cip77-82-g10c370b53152/arm64/defconfig/gcc-10/lab-cip/kselftest-futex-r8a774a1-hihope-rzg2m-ex.html
Rootfs: http://storage.kernelci.org/images/rootfs/debian/bullseye-kselftest/20220716.0/arm64/initrd.cpio.gz


* kselftest-futex.login: https://kernelci.org/test/case/id/62da5eddf6b604558bdaf057
new failure (last pass: v4.19.249-cip76-57-gef3cc1b9e556)



platform | arch | lab | compiler | defconfig | regressions
-----------------------------+-------+--------------+----------+----------------------------+------------
r8a774a1-hihope-rzg2m-ex | arm64 | lab-cip | gcc-10 | defconfig+arm64-chromebook | 1

Details: https://kernelci.org/test/plan/id/62da6635f82ce1c373daf056

Results: 0 PASS, 1 FAIL, 0 SKIP
Full config: defconfig+arm64-chromebook
Compiler: gcc-10 (aarch64-linux-gnu-gcc (Debian 10.2.1-6) 10.2.1 20210110)
Plain log: https://storage.kernelci.org//cip-gitlab/ci-iwamatsu-linux-4.19.y-cip-rc/v4.19.251-cip77-82-g10c370b53152/arm64/defconfig+arm64-chromebook/gcc-10/lab-cip/kselftest-futex-r8a774a1-hihope-rzg2m-ex.txt
HTML log: https://storage.kernelci.org//cip-gitlab/ci-iwamatsu-linux-4.19.y-cip-rc/v4.19.251-cip77-82-g10c370b53152/arm64/defconfig+arm64-chromebook/gcc-10/lab-cip/kselftest-futex-r8a774a1-hihope-rzg2m-ex.html
Rootfs: http://storage.kernelci.org/images/rootfs/debian/bullseye-kselftest/20220716.0/arm64/initrd.cpio.gz


* kselftest-futex.login: https://kernelci.org/test/case/id/62da6635f82ce1c373daf057
new failure (last pass: v4.19.249-cip76-57-gef3cc1b9e556)


cip-gitlab/ci/iwamatsu/linux-4.19.y-cip-rc kselftest-filesystems: 9 runs, 2 regressions (v4.19.251-cip77-82-g10c370b53152) #kernelci

kernelci.org bot <bot@...>
 

cip-gitlab/ci/iwamatsu/linux-4.19.y-cip-rc kselftest-filesystems: 9 runs, 2 regressions (v4.19.251-cip77-82-g10c370b53152)

Regressions Summary
-------------------

platform | arch | lab | compiler | defconfig | regressions
-------------------------+-------+---------+----------+----------------------------+------------
r8a774a1-hihope-rzg2m-ex | arm64 | lab-cip | gcc-10 | defconfig | 1
r8a774a1-hihope-rzg2m-ex | arm64 | lab-cip | gcc-10 | defconfig+arm64-chromebook | 1

Details: https://kernelci.org/test/job/cip-gitlab/branch/ci%2Fiwamatsu%2Flinux-4.19.y-cip-rc/kernel/v4.19.251-cip77-82-g10c370b53152/plan/kselftest-filesystems/

Test: kselftest-filesystems
Tree: cip-gitlab
Branch: ci/iwamatsu/linux-4.19.y-cip-rc
Describe: v4.19.251-cip77-82-g10c370b53152
URL: https://gitlab.com/cip-project/cip-kernel/linux-cip.git
SHA: 10c370b53152e01c8282be083dc0943e33d50ead


Test Regressions
----------------


platform | arch | lab | compiler | defconfig | regressions
-------------------------+-------+---------+----------+----------------------------+------------
r8a774a1-hihope-rzg2m-ex | arm64 | lab-cip | gcc-10 | defconfig | 1

Details: https://kernelci.org/test/plan/id/62da5c0dee4f1c5f59daf05d

Results: 0 PASS, 1 FAIL, 0 SKIP
Full config: defconfig
Compiler: gcc-10 (aarch64-linux-gnu-gcc (Debian 10.2.1-6) 10.2.1 20210110)
Plain log: https://storage.kernelci.org//cip-gitlab/ci-iwamatsu-linux-4.19.y-cip-rc/v4.19.251-cip77-82-g10c370b53152/arm64/defconfig/gcc-10/lab-cip/kselftest-filesystems-r8a774a1-hihope-rzg2m-ex.txt
HTML log: https://storage.kernelci.org//cip-gitlab/ci-iwamatsu-linux-4.19.y-cip-rc/v4.19.251-cip77-82-g10c370b53152/arm64/defconfig/gcc-10/lab-cip/kselftest-filesystems-r8a774a1-hihope-rzg2m-ex.html
Rootfs: http://storage.kernelci.org/images/rootfs/debian/bullseye-kselftest/20220716.0/arm64/initrd.cpio.gz


* kselftest-filesystems.login: https://kernelci.org/test/case/id/62da5c0dee4f1c5f59daf05e
new failure (last pass: v4.19.249-cip76-57-gef3cc1b9e556)



platform | arch | lab | compiler | defconfig | regressions
-------------------------+-------+---------+----------+----------------------------+------------
r8a774a1-hihope-rzg2m-ex | arm64 | lab-cip | gcc-10 | defconfig+arm64-chromebook | 1

Details: https://kernelci.org/test/plan/id/62da62b17c1cb31d00daf05d

Results: 0 PASS, 1 FAIL, 0 SKIP
Full config: defconfig+arm64-chromebook
Compiler: gcc-10 (aarch64-linux-gnu-gcc (Debian 10.2.1-6) 10.2.1 20210110)
Plain log: https://storage.kernelci.org//cip-gitlab/ci-iwamatsu-linux-4.19.y-cip-rc/v4.19.251-cip77-82-g10c370b53152/arm64/defconfig+arm64-chromebook/gcc-10/lab-cip/kselftest-filesystems-r8a774a1-hihope-rzg2m-ex.txt
HTML log: https://storage.kernelci.org//cip-gitlab/ci-iwamatsu-linux-4.19.y-cip-rc/v4.19.251-cip77-82-g10c370b53152/arm64/defconfig+arm64-chromebook/gcc-10/lab-cip/kselftest-filesystems-r8a774a1-hihope-rzg2m-ex.html
Rootfs: http://storage.kernelci.org/images/rootfs/debian/bullseye-kselftest/20220716.0/arm64/initrd.cpio.gz


* kselftest-filesystems.login: https://kernelci.org/test/case/id/62da62b17c1cb31d00daf05e
new failure (last pass: v4.19.249-cip76-57-gef3cc1b9e556)


cip-gitlab/ci/iwamatsu/linux-4.19.y-cip-rc baseline: 135 runs, 17 regressions (v4.19.251-cip77-82-g10c370b53152) #kernelci

kernelci.org bot <bot@...>
 

cip-gitlab/ci/iwamatsu/linux-4.19.y-cip-rc baseline: 135 runs, 17 regressions (v4.19.251-cip77-82-g10c370b53152)

Regressions Summary
-------------------

platform | arch | lab | compiler | defconfig | regressions
---------------------------+-------+---------------+----------+----------------------------+------------
qemu_arm64-virt-gicv2 | arm64 | lab-baylibre | gcc-10 | defconfig | 1
qemu_arm64-virt-gicv2 | arm64 | lab-baylibre | gcc-10 | defconfig+arm64-chromebook | 1
qemu_arm64-virt-gicv2 | arm64 | lab-broonie | gcc-10 | defconfig | 1
qemu_arm64-virt-gicv2 | arm64 | lab-broonie | gcc-10 | defconfig+arm64-chromebook | 1
qemu_arm64-virt-gicv2-uefi | arm64 | lab-baylibre | gcc-10 | defconfig | 1
qemu_arm64-virt-gicv2-uefi | arm64 | lab-baylibre | gcc-10 | defconfig+arm64-chromebook | 1
qemu_arm64-virt-gicv2-uefi | arm64 | lab-broonie | gcc-10 | defconfig | 1
qemu_arm64-virt-gicv2-uefi | arm64 | lab-broonie | gcc-10 | defconfig+arm64-chromebook | 1
qemu_arm64-virt-gicv3 | arm64 | lab-baylibre | gcc-10 | defconfig | 1
qemu_arm64-virt-gicv3 | arm64 | lab-baylibre | gcc-10 | defconfig+arm64-chromebook | 1
qemu_arm64-virt-gicv3 | arm64 | lab-broonie | gcc-10 | defconfig | 1
qemu_arm64-virt-gicv3 | arm64 | lab-broonie | gcc-10 | defconfig+arm64-chromebook | 1
qemu_arm64-virt-gicv3-uefi | arm64 | lab-baylibre | gcc-10 | defconfig | 1
qemu_arm64-virt-gicv3-uefi | arm64 | lab-baylibre | gcc-10 | defconfig+arm64-chromebook | 1
qemu_arm64-virt-gicv3-uefi | arm64 | lab-broonie | gcc-10 | defconfig | 1
qemu_arm64-virt-gicv3-uefi | arm64 | lab-broonie | gcc-10 | defconfig+arm64-chromebook | 1
rk3399-gru-kevin | arm64 | lab-collabora | gcc-10 | defconfig+arm64-chromebook | 1

Details: https://kernelci.org/test/job/cip-gitlab/branch/ci%2Fiwamatsu%2Flinux-4.19.y-cip-rc/kernel/v4.19.251-cip77-82-g10c370b53152/plan/baseline/

Test: baseline
Tree: cip-gitlab
Branch: ci/iwamatsu/linux-4.19.y-cip-rc
Describe: v4.19.251-cip77-82-g10c370b53152
URL: https://gitlab.com/cip-project/cip-kernel/linux-cip.git
SHA: 10c370b53152e01c8282be083dc0943e33d50ead


Test Regressions
----------------


platform | arch | lab | compiler | defconfig | regressions
---------------------------+-------+---------------+----------+----------------------------+------------
qemu_arm64-virt-gicv2 | arm64 | lab-baylibre | gcc-10 | defconfig | 1

Details: https://kernelci.org/test/plan/id/62da53e4fa5c3ee252daf088

Results: 0 PASS, 1 FAIL, 0 SKIP
Full config: defconfig
Compiler: gcc-10 (aarch64-linux-gnu-gcc (Debian 10.2.1-6) 10.2.1 20210110)
Plain log: https://storage.kernelci.org//cip-gitlab/ci-iwamatsu-linux-4.19.y-cip-rc/v4.19.251-cip77-82-g10c370b53152/arm64/defconfig/gcc-10/lab-baylibre/baseline-qemu_arm64-virt-gicv2.txt
HTML log: https://storage.kernelci.org//cip-gitlab/ci-iwamatsu-linux-4.19.y-cip-rc/v4.19.251-cip77-82-g10c370b53152/arm64/defconfig/gcc-10/lab-baylibre/baseline-qemu_arm64-virt-gicv2.html
Rootfs: http://storage.kernelci.org/images/rootfs/buildroot/buildroot-baseline/20220716.0/arm64/rootfs.cpio.gz


* baseline.login: https://kernelci.org/test/case/id/62da53e4fa5c3ee252daf089
failing since 64 days (last pass: v4.19.239-cip72-68-g407458469172, first fail: v4.19.242-cip73-50-gd57bc44cb340)



platform | arch | lab | compiler | defconfig | regressions
---------------------------+-------+---------------+----------+----------------------------+------------
qemu_arm64-virt-gicv2 | arm64 | lab-baylibre | gcc-10 | defconfig+arm64-chromebook | 1

Details: https://kernelci.org/test/plan/id/62da57a4041ca8b8d8daf058

Results: 0 PASS, 1 FAIL, 0 SKIP
Full config: defconfig+arm64-chromebook
Compiler: gcc-10 (aarch64-linux-gnu-gcc (Debian 10.2.1-6) 10.2.1 20210110)
Plain log: https://storage.kernelci.org//cip-gitlab/ci-iwamatsu-linux-4.19.y-cip-rc/v4.19.251-cip77-82-g10c370b53152/arm64/defconfig+arm64-chromebook/gcc-10/lab-baylibre/baseline-qemu_arm64-virt-gicv2.txt
HTML log: https://storage.kernelci.org//cip-gitlab/ci-iwamatsu-linux-4.19.y-cip-rc/v4.19.251-cip77-82-g10c370b53152/arm64/defconfig+arm64-chromebook/gcc-10/lab-baylibre/baseline-qemu_arm64-virt-gicv2.html
Rootfs: http://storage.kernelci.org/images/rootfs/buildroot/buildroot-baseline/20220716.0/arm64/rootfs.cpio.gz


* baseline.login: https://kernelci.org/test/case/id/62da57a4041ca8b8d8daf059
failing since 64 days (last pass: v4.19.239-cip72-68-g407458469172, first fail: v4.19.242-cip73-50-gd57bc44cb340)



platform | arch | lab | compiler | defconfig | regressions
---------------------------+-------+---------------+----------+----------------------------+------------
qemu_arm64-virt-gicv2 | arm64 | lab-broonie | gcc-10 | defconfig | 1

Details: https://kernelci.org/test/plan/id/62da53c4e883615b87daf07a

Results: 0 PASS, 1 FAIL, 0 SKIP
Full config: defconfig
Compiler: gcc-10 (aarch64-linux-gnu-gcc (Debian 10.2.1-6) 10.2.1 20210110)
Plain log: https://storage.kernelci.org//cip-gitlab/ci-iwamatsu-linux-4.19.y-cip-rc/v4.19.251-cip77-82-g10c370b53152/arm64/defconfig/gcc-10/lab-broonie/baseline-qemu_arm64-virt-gicv2.txt
HTML log: https://storage.kernelci.org//cip-gitlab/ci-iwamatsu-linux-4.19.y-cip-rc/v4.19.251-cip77-82-g10c370b53152/arm64/defconfig/gcc-10/lab-broonie/baseline-qemu_arm64-virt-gicv2.html
Rootfs: http://storage.kernelci.org/images/rootfs/buildroot/buildroot-baseline/20220716.0/arm64/rootfs.cpio.gz


* baseline.login: https://kernelci.org/test/case/id/62da53c4e883615b87daf07b
failing since 64 days (last pass: v4.19.239-cip72-68-g407458469172, first fail: v4.19.242-cip73-50-gd57bc44cb340)



platform | arch | lab | compiler | defconfig | regressions
---------------------------+-------+---------------+----------+----------------------------+------------
qemu_arm64-virt-gicv2 | arm64 | lab-broonie | gcc-10 | defconfig+arm64-chromebook | 1

Details: https://kernelci.org/test/plan/id/62da58381454fa8b22daf05a

Results: 0 PASS, 1 FAIL, 0 SKIP
Full config: defconfig+arm64-chromebook
Compiler: gcc-10 (aarch64-linux-gnu-gcc (Debian 10.2.1-6) 10.2.1 20210110)
Plain log: https://storage.kernelci.org//cip-gitlab/ci-iwamatsu-linux-4.19.y-cip-rc/v4.19.251-cip77-82-g10c370b53152/arm64/defconfig+arm64-chromebook/gcc-10/lab-broonie/baseline-qemu_arm64-virt-gicv2.txt
HTML log: https://storage.kernelci.org//cip-gitlab/ci-iwamatsu-linux-4.19.y-cip-rc/v4.19.251-cip77-82-g10c370b53152/arm64/defconfig+arm64-chromebook/gcc-10/lab-broonie/baseline-qemu_arm64-virt-gicv2.html
Rootfs: http://storage.kernelci.org/images/rootfs/buildroot/buildroot-baseline/20220716.0/arm64/rootfs.cpio.gz


* baseline.login: https://kernelci.org/test/case/id/62da58381454fa8b22daf05b
failing since 64 days (last pass: v4.19.239-cip72-68-g407458469172, first fail: v4.19.242-cip73-50-gd57bc44cb340)



platform | arch | lab | compiler | defconfig | regressions
---------------------------+-------+---------------+----------+----------------------------+------------
qemu_arm64-virt-gicv2-uefi | arm64 | lab-baylibre | gcc-10 | defconfig | 1

Details: https://kernelci.org/test/plan/id/62da53e5e5351501c0daf056

Results: 0 PASS, 1 FAIL, 0 SKIP
Full config: defconfig
Compiler: gcc-10 (aarch64-linux-gnu-gcc (Debian 10.2.1-6) 10.2.1 20210110)
Plain log: https://storage.kernelci.org//cip-gitlab/ci-iwamatsu-linux-4.19.y-cip-rc/v4.19.251-cip77-82-g10c370b53152/arm64/defconfig/gcc-10/lab-baylibre/baseline-qemu_arm64-virt-gicv2-uefi.txt
HTML log: https://storage.kernelci.org//cip-gitlab/ci-iwamatsu-linux-4.19.y-cip-rc/v4.19.251-cip77-82-g10c370b53152/arm64/defconfig/gcc-10/lab-baylibre/baseline-qemu_arm64-virt-gicv2-uefi.html
Rootfs: http://storage.kernelci.org/images/rootfs/buildroot/buildroot-baseline/20220716.0/arm64/rootfs.cpio.gz


* baseline.login: https://kernelci.org/test/case/id/62da53e5e5351501c0daf057
failing since 64 days (last pass: v4.19.239-cip72-68-g407458469172, first fail: v4.19.242-cip73-50-gd57bc44cb340)



platform | arch | lab | compiler | defconfig | regressions
---------------------------+-------+---------------+----------+----------------------------+------------
qemu_arm64-virt-gicv2-uefi | arm64 | lab-baylibre | gcc-10 | defconfig+arm64-chromebook | 1

Details: https://kernelci.org/test/plan/id/62da57a628cd97700cdaf059

Results: 0 PASS, 1 FAIL, 0 SKIP
Full config: defconfig+arm64-chromebook
Compiler: gcc-10 (aarch64-linux-gnu-gcc (Debian 10.2.1-6) 10.2.1 20210110)
Plain log: https://storage.kernelci.org//cip-gitlab/ci-iwamatsu-linux-4.19.y-cip-rc/v4.19.251-cip77-82-g10c370b53152/arm64/defconfig+arm64-chromebook/gcc-10/lab-baylibre/baseline-qemu_arm64-virt-gicv2-uefi.txt
HTML log: https://storage.kernelci.org//cip-gitlab/ci-iwamatsu-linux-4.19.y-cip-rc/v4.19.251-cip77-82-g10c370b53152/arm64/defconfig+arm64-chromebook/gcc-10/lab-baylibre/baseline-qemu_arm64-virt-gicv2-uefi.html
Rootfs: http://storage.kernelci.org/images/rootfs/buildroot/buildroot-baseline/20220716.0/arm64/rootfs.cpio.gz


* baseline.login: https://kernelci.org/test/case/id/62da57a628cd97700cdaf05a
failing since 64 days (last pass: v4.19.239-cip72-68-g407458469172, first fail: v4.19.242-cip73-50-gd57bc44cb340)



platform | arch | lab | compiler | defconfig | regressions
---------------------------+-------+---------------+----------+----------------------------+------------
qemu_arm64-virt-gicv2-uefi | arm64 | lab-broonie | gcc-10 | defconfig | 1

Details: https://kernelci.org/test/plan/id/62da53c6a2207a96b9daf05e

Results: 0 PASS, 1 FAIL, 0 SKIP
Full config: defconfig
Compiler: gcc-10 (aarch64-linux-gnu-gcc (Debian 10.2.1-6) 10.2.1 20210110)
Plain log: https://storage.kernelci.org//cip-gitlab/ci-iwamatsu-linux-4.19.y-cip-rc/v4.19.251-cip77-82-g10c370b53152/arm64/defconfig/gcc-10/lab-broonie/baseline-qemu_arm64-virt-gicv2-uefi.txt
HTML log: https://storage.kernelci.org//cip-gitlab/ci-iwamatsu-linux-4.19.y-cip-rc/v4.19.251-cip77-82-g10c370b53152/arm64/defconfig/gcc-10/lab-broonie/baseline-qemu_arm64-virt-gicv2-uefi.html
Rootfs: http://storage.kernelci.org/images/rootfs/buildroot/buildroot-baseline/20220716.0/arm64/rootfs.cpio.gz


* baseline.login: https://kernelci.org/test/case/id/62da53c6a2207a96b9daf05f
failing since 64 days (last pass: v4.19.239-cip72-68-g407458469172, first fail: v4.19.242-cip73-50-gd57bc44cb340)



platform | arch | lab | compiler | defconfig | regressions
---------------------------+-------+---------------+----------+----------------------------+------------
qemu_arm64-virt-gicv2-uefi | arm64 | lab-broonie | gcc-10 | defconfig+arm64-chromebook | 1

Details: https://kernelci.org/test/plan/id/62da58744d629aa455daf056

Results: 0 PASS, 1 FAIL, 0 SKIP
Full config: defconfig+arm64-chromebook
Compiler: gcc-10 (aarch64-linux-gnu-gcc (Debian 10.2.1-6) 10.2.1 20210110)
Plain log: https://storage.kernelci.org//cip-gitlab/ci-iwamatsu-linux-4.19.y-cip-rc/v4.19.251-cip77-82-g10c370b53152/arm64/defconfig+arm64-chromebook/gcc-10/lab-broonie/baseline-qemu_arm64-virt-gicv2-uefi.txt
HTML log: https://storage.kernelci.org//cip-gitlab/ci-iwamatsu-linux-4.19.y-cip-rc/v4.19.251-cip77-82-g10c370b53152/arm64/defconfig+arm64-chromebook/gcc-10/lab-broonie/baseline-qemu_arm64-virt-gicv2-uefi.html
Rootfs: http://storage.kernelci.org/images/rootfs/buildroot/buildroot-baseline/20220716.0/arm64/rootfs.cpio.gz


* baseline.login: https://kernelci.org/test/case/id/62da58744d629aa455daf057
failing since 64 days (last pass: v4.19.239-cip72-68-g407458469172, first fail: v4.19.242-cip73-50-gd57bc44cb340)



platform | arch | lab | compiler | defconfig | regressions
---------------------------+-------+---------------+----------+----------------------------+------------
qemu_arm64-virt-gicv3 | arm64 | lab-baylibre | gcc-10 | defconfig | 1

Details: https://kernelci.org/test/plan/id/62da53e7e5351501c0daf05c

Results: 0 PASS, 1 FAIL, 0 SKIP
Full config: defconfig
Compiler: gcc-10 (aarch64-linux-gnu-gcc (Debian 10.2.1-6) 10.2.1 20210110)
Plain log: https://storage.kernelci.org//cip-gitlab/ci-iwamatsu-linux-4.19.y-cip-rc/v4.19.251-cip77-82-g10c370b53152/arm64/defconfig/gcc-10/lab-baylibre/baseline-qemu_arm64-virt-gicv3.txt
HTML log: https://storage.kernelci.org//cip-gitlab/ci-iwamatsu-linux-4.19.y-cip-rc/v4.19.251-cip77-82-g10c370b53152/arm64/defconfig/gcc-10/lab-baylibre/baseline-qemu_arm64-virt-gicv3.html
Rootfs: http://storage.kernelci.org/images/rootfs/buildroot/buildroot-baseline/20220716.0/arm64/rootfs.cpio.gz


* baseline.login: https://kernelci.org/test/case/id/62da53e7e5351501c0daf05d
failing since 64 days (last pass: v4.19.239-cip72-68-g407458469172, first fail: v4.19.242-cip73-50-gd57bc44cb340)



platform | arch | lab | compiler | defconfig | regressions
---------------------------+-------+---------------+----------+----------------------------+------------
qemu_arm64-virt-gicv3 | arm64 | lab-baylibre | gcc-10 | defconfig+arm64-chromebook | 1

Details: https://kernelci.org/test/plan/id/62da57a5041ca8b8d8daf05c

Results: 0 PASS, 1 FAIL, 0 SKIP
Full config: defconfig+arm64-chromebook
Compiler: gcc-10 (aarch64-linux-gnu-gcc (Debian 10.2.1-6) 10.2.1 20210110)
Plain log: https://storage.kernelci.org//cip-gitlab/ci-iwamatsu-linux-4.19.y-cip-rc/v4.19.251-cip77-82-g10c370b53152/arm64/defconfig+arm64-chromebook/gcc-10/lab-baylibre/baseline-qemu_arm64-virt-gicv3.txt
HTML log: https://storage.kernelci.org//cip-gitlab/ci-iwamatsu-linux-4.19.y-cip-rc/v4.19.251-cip77-82-g10c370b53152/arm64/defconfig+arm64-chromebook/gcc-10/lab-baylibre/baseline-qemu_arm64-virt-gicv3.html
Rootfs: http://storage.kernelci.org/images/rootfs/buildroot/buildroot-baseline/20220716.0/arm64/rootfs.cpio.gz


* baseline.login: https://kernelci.org/test/case/id/62da57a5041ca8b8d8daf05d
failing since 64 days (last pass: v4.19.239-cip72-68-g407458469172, first fail: v4.19.242-cip73-50-gd57bc44cb340)



platform | arch | lab | compiler | defconfig | regressions
---------------------------+-------+---------------+----------+----------------------------+------------
qemu_arm64-virt-gicv3 | arm64 | lab-broonie | gcc-10 | defconfig | 1

Details: https://kernelci.org/test/plan/id/62da553f2ac6c19226daf05f

Results: 0 PASS, 1 FAIL, 0 SKIP
Full config: defconfig
Compiler: gcc-10 (aarch64-linux-gnu-gcc (Debian 10.2.1-6) 10.2.1 20210110)
Plain log: https://storage.kernelci.org//cip-gitlab/ci-iwamatsu-linux-4.19.y-cip-rc/v4.19.251-cip77-82-g10c370b53152/arm64/defconfig/gcc-10/lab-broonie/baseline-qemu_arm64-virt-gicv3.txt
HTML log: https://storage.kernelci.org//cip-gitlab/ci-iwamatsu-linux-4.19.y-cip-rc/v4.19.251-cip77-82-g10c370b53152/arm64/defconfig/gcc-10/lab-broonie/baseline-qemu_arm64-virt-gicv3.html
Rootfs: http://storage.kernelci.org/images/rootfs/buildroot/buildroot-baseline/20220716.0/arm64/rootfs.cpio.gz


* baseline.login: https://kernelci.org/test/case/id/62da553f2ac6c19226daf060
failing since 64 days (last pass: v4.19.239-cip72-68-g407458469172, first fail: v4.19.242-cip73-50-gd57bc44cb340)



platform | arch | lab | compiler | defconfig | regressions
---------------------------+-------+---------------+----------+----------------------------+------------
qemu_arm64-virt-gicv3 | arm64 | lab-broonie | gcc-10 | defconfig+arm64-chromebook | 1

Details: https://kernelci.org/test/plan/id/62da584ca1d2796fb3daf056

Results: 0 PASS, 1 FAIL, 0 SKIP
Full config: defconfig+arm64-chromebook
Compiler: gcc-10 (aarch64-linux-gnu-gcc (Debian 10.2.1-6) 10.2.1 20210110)
Plain log: https://storage.kernelci.org//cip-gitlab/ci-iwamatsu-linux-4.19.y-cip-rc/v4.19.251-cip77-82-g10c370b53152/arm64/defconfig+arm64-chromebook/gcc-10/lab-broonie/baseline-qemu_arm64-virt-gicv3.txt
HTML log: https://storage.kernelci.org//cip-gitlab/ci-iwamatsu-linux-4.19.y-cip-rc/v4.19.251-cip77-82-g10c370b53152/arm64/defconfig+arm64-chromebook/gcc-10/lab-broonie/baseline-qemu_arm64-virt-gicv3.html
Rootfs: http://storage.kernelci.org/images/rootfs/buildroot/buildroot-baseline/20220716.0/arm64/rootfs.cpio.gz


* baseline.login: https://kernelci.org/test/case/id/62da584ca1d2796fb3daf057
failing since 64 days (last pass: v4.19.239-cip72-68-g407458469172, first fail: v4.19.242-cip73-50-gd57bc44cb340)



platform | arch | lab | compiler | defconfig | regressions
---------------------------+-------+---------------+----------+----------------------------+------------
qemu_arm64-virt-gicv3-uefi | arm64 | lab-baylibre | gcc-10 | defconfig | 1

Details: https://kernelci.org/test/plan/id/62da53e2fa5c3ee252daf083

Results: 0 PASS, 1 FAIL, 0 SKIP
Full config: defconfig
Compiler: gcc-10 (aarch64-linux-gnu-gcc (Debian 10.2.1-6) 10.2.1 20210110)
Plain log: https://storage.kernelci.org//cip-gitlab/ci-iwamatsu-linux-4.19.y-cip-rc/v4.19.251-cip77-82-g10c370b53152/arm64/defconfig/gcc-10/lab-baylibre/baseline-qemu_arm64-virt-gicv3-uefi.txt
HTML log: https://storage.kernelci.org//cip-gitlab/ci-iwamatsu-linux-4.19.y-cip-rc/v4.19.251-cip77-82-g10c370b53152/arm64/defconfig/gcc-10/lab-baylibre/baseline-qemu_arm64-virt-gicv3-uefi.html
Rootfs: http://storage.kernelci.org/images/rootfs/buildroot/buildroot-baseline/20220716.0/arm64/rootfs.cpio.gz


* baseline.login: https://kernelci.org/test/case/id/62da53e2fa5c3ee252daf084
failing since 64 days (last pass: v4.19.239-cip72-68-g407458469172, first fail: v4.19.242-cip73-50-gd57bc44cb340)



platform | arch | lab | compiler | defconfig | regressions
---------------------------+-------+---------------+----------+----------------------------+------------
qemu_arm64-virt-gicv3-uefi | arm64 | lab-baylibre | gcc-10 | defconfig+arm64-chromebook | 1

Details: https://kernelci.org/test/plan/id/62da57a7041ca8b8d8daf062

Results: 0 PASS, 1 FAIL, 0 SKIP
Full config: defconfig+arm64-chromebook
Compiler: gcc-10 (aarch64-linux-gnu-gcc (Debian 10.2.1-6) 10.2.1 20210110)
Plain log: https://storage.kernelci.org//cip-gitlab/ci-iwamatsu-linux-4.19.y-cip-rc/v4.19.251-cip77-82-g10c370b53152/arm64/defconfig+arm64-chromebook/gcc-10/lab-baylibre/baseline-qemu_arm64-virt-gicv3-uefi.txt
HTML log: https://storage.kernelci.org//cip-gitlab/ci-iwamatsu-linux-4.19.y-cip-rc/v4.19.251-cip77-82-g10c370b53152/arm64/defconfig+arm64-chromebook/gcc-10/lab-baylibre/baseline-qemu_arm64-virt-gicv3-uefi.html
Rootfs: http://storage.kernelci.org/images/rootfs/buildroot/buildroot-baseline/20220716.0/arm64/rootfs.cpio.gz


* baseline.login: https://kernelci.org/test/case/id/62da57a7041ca8b8d8daf063
failing since 64 days (last pass: v4.19.239-cip72-68-g407458469172, first fail: v4.19.242-cip73-50-gd57bc44cb340)



platform | arch | lab | compiler | defconfig | regressions
---------------------------+-------+---------------+----------+----------------------------+------------
qemu_arm64-virt-gicv3-uefi | arm64 | lab-broonie | gcc-10 | defconfig | 1

Details: https://kernelci.org/test/plan/id/62da53c3e883615b87daf077

Results: 0 PASS, 1 FAIL, 0 SKIP
Full config: defconfig
Compiler: gcc-10 (aarch64-linux-gnu-gcc (Debian 10.2.1-6) 10.2.1 20210110)
Plain log: https://storage.kernelci.org//cip-gitlab/ci-iwamatsu-linux-4.19.y-cip-rc/v4.19.251-cip77-82-g10c370b53152/arm64/defconfig/gcc-10/lab-broonie/baseline-qemu_arm64-virt-gicv3-uefi.txt
HTML log: https://storage.kernelci.org//cip-gitlab/ci-iwamatsu-linux-4.19.y-cip-rc/v4.19.251-cip77-82-g10c370b53152/arm64/defconfig/gcc-10/lab-broonie/baseline-qemu_arm64-virt-gicv3-uefi.html
Rootfs: http://storage.kernelci.org/images/rootfs/buildroot/buildroot-baseline/20220716.0/arm64/rootfs.cpio.gz


* baseline.login: https://kernelci.org/test/case/id/62da53c3e883615b87daf078
failing since 64 days (last pass: v4.19.239-cip72-68-g407458469172, first fail: v4.19.242-cip73-50-gd57bc44cb340)



platform | arch | lab | compiler | defconfig | regressions
---------------------------+-------+---------------+----------+----------------------------+------------
qemu_arm64-virt-gicv3-uefi | arm64 | lab-broonie | gcc-10 | defconfig+arm64-chromebook | 1

Details: https://kernelci.org/test/plan/id/62da59a0a5d20ed8e9daf056

Results: 0 PASS, 1 FAIL, 0 SKIP
Full config: defconfig+arm64-chromebook
Compiler: gcc-10 (aarch64-linux-gnu-gcc (Debian 10.2.1-6) 10.2.1 20210110)
Plain log: https://storage.kernelci.org//cip-gitlab/ci-iwamatsu-linux-4.19.y-cip-rc/v4.19.251-cip77-82-g10c370b53152/arm64/defconfig+arm64-chromebook/gcc-10/lab-broonie/baseline-qemu_arm64-virt-gicv3-uefi.txt
HTML log: https://storage.kernelci.org//cip-gitlab/ci-iwamatsu-linux-4.19.y-cip-rc/v4.19.251-cip77-82-g10c370b53152/arm64/defconfig+arm64-chromebook/gcc-10/lab-broonie/baseline-qemu_arm64-virt-gicv3-uefi.html
Rootfs: http://storage.kernelci.org/images/rootfs/buildroot/buildroot-baseline/20220716.0/arm64/rootfs.cpio.gz


* baseline.login: https://kernelci.org/test/case/id/62da59a0a5d20ed8e9daf057
failing since 64 days (last pass: v4.19.239-cip72-68-g407458469172, first fail: v4.19.242-cip73-50-gd57bc44cb340)



platform | arch | lab | compiler | defconfig | regressions
---------------------------+-------+---------------+----------+----------------------------+------------
rk3399-gru-kevin | arm64 | lab-collabora | gcc-10 | defconfig+arm64-chromebook | 1

Details: https://kernelci.org/test/plan/id/62da5851a1d2796fb3daf05c

Results: 83 PASS, 7 FAIL, 0 SKIP
Full config: defconfig+arm64-chromebook
Compiler: gcc-10 (aarch64-linux-gnu-gcc (Debian 10.2.1-6) 10.2.1 20210110)
Plain log: https://storage.kernelci.org//cip-gitlab/ci-iwamatsu-linux-4.19.y-cip-rc/v4.19.251-cip77-82-g10c370b53152/arm64/defconfig+arm64-chromebook/gcc-10/lab-collabora/baseline-rk3399-gru-kevin.txt
HTML log: https://storage.kernelci.org//cip-gitlab/ci-iwamatsu-linux-4.19.y-cip-rc/v4.19.251-cip77-82-g10c370b53152/arm64/defconfig+arm64-chromebook/gcc-10/lab-collabora/baseline-rk3399-gru-kevin.html
Rootfs: http://storage.kernelci.org/images/rootfs/buildroot/buildroot-baseline/20220716.0/arm64/rootfs.cpio.gz


* baseline.bootrr.rockchip-i2s1-probed: https://kernelci.org/test/case/id/62da5851a1d2796fb3daf07e
failing since 130 days (last pass: v4.19.229-cip67-111-g5c3c0b39cf3b, first fail: v4.19.231-cip68-123-g92e3e7f3d4df)

2022-07-22T07:56:55.110926 /lava-6869183/1/../bin/lava-test-case
2022-07-22T07:56:55.118633 <8>[ 36.858815] <LAVA_SIGNAL_TESTCASE TEST_CASE_ID=rockchip-i2s1-probed RESULT=fail>


cip-gitlab/ci/iwamatsu/linux-4.19.y-cip-rc baseline-nfs: 49 runs, 5 regressions (v4.19.251-cip77-82-g10c370b53152) #kernelci

kernelci.org bot <bot@...>
 

cip-gitlab/ci/iwamatsu/linux-4.19.y-cip-rc baseline-nfs: 49 runs, 5 regressions (v4.19.251-cip77-82-g10c370b53152)

Regressions Summary
-------------------

platform | arch | lab | compiler | defconfig | regressions
-----------------------------+-------+---------------+----------+----------------------------+------------
meson-gxl-s905x-libretech-cc | arm64 | lab-baylibre | gcc-10 | defconfig | 1
meson-gxl-s905x-libretech-cc | arm64 | lab-broonie | gcc-10 | defconfig | 1
r8a774a1-hihope-rzg2m-ex | arm64 | lab-cip | gcc-10 | defconfig | 1
r8a774a1-hihope-rzg2m-ex | arm64 | lab-cip | gcc-10 | defconfig+arm64-chromebook | 1
rk3399-gru-kevin | arm64 | lab-collabora | gcc-10 | defconfig+arm64-chromebook | 1

Details: https://kernelci.org/test/job/cip-gitlab/branch/ci%2Fiwamatsu%2Flinux-4.19.y-cip-rc/kernel/v4.19.251-cip77-82-g10c370b53152/plan/baseline-nfs/

Test: baseline-nfs
Tree: cip-gitlab
Branch: ci/iwamatsu/linux-4.19.y-cip-rc
Describe: v4.19.251-cip77-82-g10c370b53152
URL: https://gitlab.com/cip-project/cip-kernel/linux-cip.git
SHA: 10c370b53152e01c8282be083dc0943e33d50ead


Test Regressions
----------------


platform | arch | lab | compiler | defconfig | regressions
-----------------------------+-------+---------------+----------+----------------------------+------------
meson-gxl-s905x-libretech-cc | arm64 | lab-baylibre | gcc-10 | defconfig | 1

Details: https://kernelci.org/test/plan/id/62da53bae883615b87daf071

Results: 0 PASS, 1 FAIL, 0 SKIP
Full config: defconfig
Compiler: gcc-10 (aarch64-linux-gnu-gcc (Debian 10.2.1-6) 10.2.1 20210110)
Plain log: https://storage.kernelci.org//cip-gitlab/ci-iwamatsu-linux-4.19.y-cip-rc/v4.19.251-cip77-82-g10c370b53152/arm64/defconfig/gcc-10/lab-baylibre/baseline-nfs-meson-gxl-s905x-libretech-cc.txt
HTML log: https://storage.kernelci.org//cip-gitlab/ci-iwamatsu-linux-4.19.y-cip-rc/v4.19.251-cip77-82-g10c370b53152/arm64/defconfig/gcc-10/lab-baylibre/baseline-nfs-meson-gxl-s905x-libretech-cc.html
Rootfs: http://storage.kernelci.org/images/rootfs/debian/bullseye/20220716.0/arm64/initrd.cpio.gz


* baseline-nfs.login: https://kernelci.org/test/case/id/62da53bbe883615b87daf072
new failure (last pass: v4.19.249-cip76-57-gef3cc1b9e556)



platform | arch | lab | compiler | defconfig | regressions
-----------------------------+-------+---------------+----------+----------------------------+------------
meson-gxl-s905x-libretech-cc | arm64 | lab-broonie | gcc-10 | defconfig | 1

Details: https://kernelci.org/test/plan/id/62da551e78377bbc20daf064

Results: 0 PASS, 1 FAIL, 0 SKIP
Full config: defconfig
Compiler: gcc-10 (aarch64-linux-gnu-gcc (Debian 10.2.1-6) 10.2.1 20210110)
Plain log: https://storage.kernelci.org//cip-gitlab/ci-iwamatsu-linux-4.19.y-cip-rc/v4.19.251-cip77-82-g10c370b53152/arm64/defconfig/gcc-10/lab-broonie/baseline-nfs-meson-gxl-s905x-libretech-cc.txt
HTML log: https://storage.kernelci.org//cip-gitlab/ci-iwamatsu-linux-4.19.y-cip-rc/v4.19.251-cip77-82-g10c370b53152/arm64/defconfig/gcc-10/lab-broonie/baseline-nfs-meson-gxl-s905x-libretech-cc.html
Rootfs: http://storage.kernelci.org/images/rootfs/debian/bullseye/20220716.0/arm64/initrd.cpio.gz


* baseline-nfs.login: https://kernelci.org/test/case/id/62da551e78377bbc20daf065
new failure (last pass: v4.19.249-cip76-57-gef3cc1b9e556)



platform | arch | lab | compiler | defconfig | regressions
-----------------------------+-------+---------------+----------+----------------------------+------------
r8a774a1-hihope-rzg2m-ex | arm64 | lab-cip | gcc-10 | defconfig | 1

Details: https://kernelci.org/test/plan/id/62da5a55df4c368c03daf05e

Results: 0 PASS, 1 FAIL, 0 SKIP
Full config: defconfig
Compiler: gcc-10 (aarch64-linux-gnu-gcc (Debian 10.2.1-6) 10.2.1 20210110)
Plain log: https://storage.kernelci.org//cip-gitlab/ci-iwamatsu-linux-4.19.y-cip-rc/v4.19.251-cip77-82-g10c370b53152/arm64/defconfig/gcc-10/lab-cip/baseline-nfs-r8a774a1-hihope-rzg2m-ex.txt
HTML log: https://storage.kernelci.org//cip-gitlab/ci-iwamatsu-linux-4.19.y-cip-rc/v4.19.251-cip77-82-g10c370b53152/arm64/defconfig/gcc-10/lab-cip/baseline-nfs-r8a774a1-hihope-rzg2m-ex.html
Rootfs: http://storage.kernelci.org/images/rootfs/debian/bullseye/20220716.0/arm64/initrd.cpio.gz


* baseline-nfs.login: https://kernelci.org/test/case/id/62da5a55df4c368c03daf05f
new failure (last pass: v4.19.249-cip76-57-gef3cc1b9e556)



platform | arch | lab | compiler | defconfig | regressions
-----------------------------+-------+---------------+----------+----------------------------+------------
r8a774a1-hihope-rzg2m-ex | arm64 | lab-cip | gcc-10 | defconfig+arm64-chromebook | 1

Details: https://kernelci.org/test/plan/id/62da64419c1ee7853ddaf057

Results: 0 PASS, 1 FAIL, 0 SKIP
Full config: defconfig+arm64-chromebook
Compiler: gcc-10 (aarch64-linux-gnu-gcc (Debian 10.2.1-6) 10.2.1 20210110)
Plain log: https://storage.kernelci.org//cip-gitlab/ci-iwamatsu-linux-4.19.y-cip-rc/v4.19.251-cip77-82-g10c370b53152/arm64/defconfig+arm64-chromebook/gcc-10/lab-cip/baseline-nfs-r8a774a1-hihope-rzg2m-ex.txt
HTML log: https://storage.kernelci.org//cip-gitlab/ci-iwamatsu-linux-4.19.y-cip-rc/v4.19.251-cip77-82-g10c370b53152/arm64/defconfig+arm64-chromebook/gcc-10/lab-cip/baseline-nfs-r8a774a1-hihope-rzg2m-ex.html
Rootfs: http://storage.kernelci.org/images/rootfs/debian/bullseye/20220716.0/arm64/initrd.cpio.gz


* baseline-nfs.login: https://kernelci.org/test/case/id/62da64419c1ee7853ddaf058
new failure (last pass: v4.19.249-cip76-57-gef3cc1b9e556)



platform | arch | lab | compiler | defconfig | regressions
-----------------------------+-------+---------------+----------+----------------------------+------------
rk3399-gru-kevin | arm64 | lab-collabora | gcc-10 | defconfig+arm64-chromebook | 1

Details: https://kernelci.org/test/plan/id/62da5b0da160089858daf059

Results: 0 PASS, 1 FAIL, 0 SKIP
Full config: defconfig+arm64-chromebook
Compiler: gcc-10 (aarch64-linux-gnu-gcc (Debian 10.2.1-6) 10.2.1 20210110)
Plain log: https://storage.kernelci.org//cip-gitlab/ci-iwamatsu-linux-4.19.y-cip-rc/v4.19.251-cip77-82-g10c370b53152/arm64/defconfig+arm64-chromebook/gcc-10/lab-collabora/baseline-nfs-rk3399-gru-kevin.txt
HTML log: https://storage.kernelci.org//cip-gitlab/ci-iwamatsu-linux-4.19.y-cip-rc/v4.19.251-cip77-82-g10c370b53152/arm64/defconfig+arm64-chromebook/gcc-10/lab-collabora/baseline-nfs-rk3399-gru-kevin.html
Rootfs: http://storage.kernelci.org/images/rootfs/debian/bullseye/20220716.0/arm64/initrd.cpio.gz


* baseline-nfs.login: https://kernelci.org/test/case/id/62da5b0da160089858daf05a
new failure (last pass: v4.19.249-cip76-57-gef3cc1b9e556)


cip-gitlab/ci/iwamatsu/linux-4.19.y-cip-rc baseline-cip-nfs: 8 runs, 3 regressions (v4.19.251-cip77-82-g10c370b53152) #kernelci

kernelci.org bot <bot@...>
 

cip-gitlab/ci/iwamatsu/linux-4.19.y-cip-rc baseline-cip-nfs: 8 runs, 3 regressions (v4.19.251-cip77-82-g10c370b53152)

Regressions Summary
-------------------

platform | arch | lab | compiler | defconfig | regressions
-------------------------+-------+---------+----------+----------------------------+------------
beaglebone-black | arm | lab-cip | gcc-10 | omap2plus_defconfig | 1
r8a774a1-hihope-rzg2m-ex | arm64 | lab-cip | gcc-10 | defconfig | 1
r8a774a1-hihope-rzg2m-ex | arm64 | lab-cip | gcc-10 | defconfig+arm64-chromebook | 1

Details: https://kernelci.org/test/job/cip-gitlab/branch/ci%2Fiwamatsu%2Flinux-4.19.y-cip-rc/kernel/v4.19.251-cip77-82-g10c370b53152/plan/baseline-cip-nfs/

Test: baseline-cip-nfs
Tree: cip-gitlab
Branch: ci/iwamatsu/linux-4.19.y-cip-rc
Describe: v4.19.251-cip77-82-g10c370b53152
URL: https://gitlab.com/cip-project/cip-kernel/linux-cip.git
SHA: 10c370b53152e01c8282be083dc0943e33d50ead


Test Regressions
----------------


platform | arch | lab | compiler | defconfig | regressions
-------------------------+-------+---------+----------+----------------------------+------------
beaglebone-black | arm | lab-cip | gcc-10 | omap2plus_defconfig | 1

Details: https://kernelci.org/test/plan/id/62da5645f0d302c253daf064

Results: 0 PASS, 1 FAIL, 0 SKIP
Full config: omap2plus_defconfig
Compiler: gcc-10 (arm-linux-gnueabihf-gcc (Debian 10.2.1-6) 10.2.1 20210110)
Plain log: https://storage.kernelci.org//cip-gitlab/ci-iwamatsu-linux-4.19.y-cip-rc/v4.19.251-cip77-82-g10c370b53152/arm/omap2plus_defconfig/gcc-10/lab-cip/baseline-cip-nfs-beaglebone-black.txt
HTML log: https://storage.kernelci.org//cip-gitlab/ci-iwamatsu-linux-4.19.y-cip-rc/v4.19.251-cip77-82-g10c370b53152/arm/omap2plus_defconfig/gcc-10/lab-cip/baseline-cip-nfs-beaglebone-black.html
Rootfs: https://storage.kernelci.org/images/rootfs/cip/20211105/qemu-arm/cip-core-image-kernelci-cip-core-buster-qemu-arm-initrd.img.gz


* baseline-cip-nfs.login: https://kernelci.org/test/case/id/62da5645f0d302c253daf065
new failure (last pass: v4.19.249-cip76-57-gef3cc1b9e556)



platform | arch | lab | compiler | defconfig | regressions
-------------------------+-------+---------+----------+----------------------------+------------
r8a774a1-hihope-rzg2m-ex | arm64 | lab-cip | gcc-10 | defconfig | 1

Details: https://kernelci.org/test/plan/id/62da5d25f8a2059ba0daf05a

Results: 0 PASS, 1 FAIL, 0 SKIP
Full config: defconfig
Compiler: gcc-10 (aarch64-linux-gnu-gcc (Debian 10.2.1-6) 10.2.1 20210110)
Plain log: https://storage.kernelci.org//cip-gitlab/ci-iwamatsu-linux-4.19.y-cip-rc/v4.19.251-cip77-82-g10c370b53152/arm64/defconfig/gcc-10/lab-cip/baseline-cip-nfs-r8a774a1-hihope-rzg2m-ex.txt
HTML log: https://storage.kernelci.org//cip-gitlab/ci-iwamatsu-linux-4.19.y-cip-rc/v4.19.251-cip77-82-g10c370b53152/arm64/defconfig/gcc-10/lab-cip/baseline-cip-nfs-r8a774a1-hihope-rzg2m-ex.html
Rootfs: https://storage.kernelci.org/images/rootfs/cip/20211105/qemu-arm64/cip-core-image-kernelci-cip-core-buster-qemu-arm64-initrd.img.gz


* baseline-cip-nfs.login: https://kernelci.org/test/case/id/62da5d25f8a2059ba0daf05b
new failure (last pass: v4.19.249-cip76-57-gef3cc1b9e556)



platform | arch | lab | compiler | defconfig | regressions
-------------------------+-------+---------+----------+----------------------------+------------
r8a774a1-hihope-rzg2m-ex | arm64 | lab-cip | gcc-10 | defconfig+arm64-chromebook | 1

Details: https://kernelci.org/test/plan/id/62da5f199d5fd98a59daf05f

Results: 0 PASS, 1 FAIL, 0 SKIP
Full config: defconfig+arm64-chromebook
Compiler: gcc-10 (aarch64-linux-gnu-gcc (Debian 10.2.1-6) 10.2.1 20210110)
Plain log: https://storage.kernelci.org//cip-gitlab/ci-iwamatsu-linux-4.19.y-cip-rc/v4.19.251-cip77-82-g10c370b53152/arm64/defconfig+arm64-chromebook/gcc-10/lab-cip/baseline-cip-nfs-r8a774a1-hihope-rzg2m-ex.txt
HTML log: https://storage.kernelci.org//cip-gitlab/ci-iwamatsu-linux-4.19.y-cip-rc/v4.19.251-cip77-82-g10c370b53152/arm64/defconfig+arm64-chromebook/gcc-10/lab-cip/baseline-cip-nfs-r8a774a1-hihope-rzg2m-ex.html
Rootfs: https://storage.kernelci.org/images/rootfs/cip/20211105/qemu-arm64/cip-core-image-kernelci-cip-core-buster-qemu-arm64-initrd.img.gz


* baseline-cip-nfs.login: https://kernelci.org/test/case/id/62da5f199d5fd98a59daf060
new failure (last pass: v4.19.249-cip76-57-gef3cc1b9e556)


cip-gitlab/ci/iwamatsu/linux-4.19.y-cip-rc build: 198 builds: 6 failed, 192 passed, 2 errors, 32 warnings (v4.19.251-cip77-82-g10c370b53152) #kernelci

kernelci.org bot <bot@...>
 

cip-gitlab/ci/iwamatsu/linux-4.19.y-cip-rc build: 198 builds: 6 failed, 192 passed, 2 errors, 32 warnings (v4.19.251-cip77-82-g10c370b53152)

Full Build Summary: https://kernelci.org/build/cip-gitlab/branch/ci%2Fiwamatsu%2Flinux-4.19.y-cip-rc/kernel/v4.19.251-cip77-82-g10c370b53152/

Tree: cip-gitlab
Branch: ci/iwamatsu/linux-4.19.y-cip-rc
Git Describe: v4.19.251-cip77-82-g10c370b53152
Git Commit: 10c370b53152e01c8282be083dc0943e33d50ead
Git URL: https://gitlab.com/cip-project/cip-kernel/linux-cip.git
Built: 7 unique architectures

Build Failures Detected:

arm:
rpc_defconfig: (gcc-10) FAIL

mips:
ip27_defconfig: (gcc-10) FAIL
ip28_defconfig: (gcc-10) FAIL

riscv:
allnoconfig: (gcc-10) FAIL
defconfig: (gcc-10) FAIL
tinyconfig: (gcc-10) FAIL

Errors and Warnings Detected:

arc:

arm64:
defconfig (gcc-10): 3 warnings
defconfig+arm64-chromebook (gcc-10): 3 warnings

arm:
omap1_defconfig (gcc-10): 1 warning
rpc_defconfig (gcc-10): 2 errors

i386:
allnoconfig (gcc-10): 2 warnings
i386_defconfig (gcc-10): 2 warnings
tinyconfig (gcc-10): 2 warnings

mips:
lemote2f_defconfig (gcc-10): 1 warning
loongson3_defconfig (gcc-10): 1 warning
malta_qemu_32r6_defconfig (gcc-10): 1 warning
mtx1_defconfig (gcc-10): 3 warnings
nlm_xlp_defconfig (gcc-10): 1 warning

riscv:

x86_64:
allnoconfig (gcc-10): 3 warnings
tinyconfig (gcc-10): 3 warnings
x86_64_defconfig (gcc-10): 3 warnings
x86_64_defconfig+x86-chromebook (gcc-10): 3 warnings

Errors summary:

1 arm-linux-gnueabihf-gcc: error: unrecognized -march target: armv3
1 arm-linux-gnueabihf-gcc: error: missing argument to ‘-march=’

Warnings summary:

7 ld: warning: creating DT_TEXTREL in a PIE
6 aarch64-linux-gnu-ld: warning: -z norelro ignored
4 ld: arch/x86/boot/compressed/head_64.o: warning: relocation in read-only section `.head.text'
4 arch/x86/entry/entry_64.S:1738: Warning: no instruction mnemonic suffix given and no register operands; using default for `sysret'
3 ld: arch/x86/boot/compressed/head_32.o: warning: relocation in read-only section `.head.text'
2 sound/pci/echoaudio/echoaudio_dsp.c:647:9: warning: iteration 1073741824 invokes undefined behavior [-Waggressive-loop-optimizations]
2 net/core/rtnetlink.c:3199:1: warning: the frame size of 1328 bytes is larger than 1024 bytes [-Wframe-larger-than=]
1 {standard input}:132: Warning: macro instruction expanded into multiple instructions
1 sound/pci/echoaudio/echoaudio_dsp.c:658:9: warning: iteration 1073741824 invokes undefined behavior [-Waggressive-loop-optimizations]
1 net/core/rtnetlink.c:3199:1: warning: the frame size of 1344 bytes is larger than 1024 bytes [-Wframe-larger-than=]
1 drivers/gpio/gpio-omap.c:1233:34: warning: array ‘omap_gpio_match’ assumed to have one element

Section mismatches summary:

13 WARNING: modpost: Found 1 section mismatch(es).

================================================================================

Detailed per-defconfig build reports:

--------------------------------------------------------------------------------
32r2el_defconfig (mips, gcc-10) — PASS, 0 errors, 0 warnings, 0 section mismatches

--------------------------------------------------------------------------------
acs5k_defconfig (arm, gcc-10) — PASS, 0 errors, 0 warnings, 0 section mismatches

--------------------------------------------------------------------------------
acs5k_tiny_defconfig (arm, gcc-10) — PASS, 0 errors, 0 warnings, 0 section mismatches

--------------------------------------------------------------------------------
allnoconfig (arc, gcc-10) — PASS, 0 errors, 0 warnings, 0 section mismatches

--------------------------------------------------------------------------------
allnoconfig (x86_64, gcc-10) — PASS, 0 errors, 3 warnings, 0 section mismatches

Warnings:
arch/x86/entry/entry_64.S:1738: Warning: no instruction mnemonic suffix given and no register operands; using default for `sysret'
ld: arch/x86/boot/compressed/head_64.o: warning: relocation in read-only section `.head.text'
ld: warning: creating DT_TEXTREL in a PIE

--------------------------------------------------------------------------------
allnoconfig (i386, gcc-10) — PASS, 0 errors, 2 warnings, 0 section mismatches

Warnings:
ld: arch/x86/boot/compressed/head_32.o: warning: relocation in read-only section `.head.text'
ld: warning: creating DT_TEXTREL in a PIE

--------------------------------------------------------------------------------
allnoconfig (riscv, gcc-10) — FAIL, 0 errors, 0 warnings, 0 section mismatches

--------------------------------------------------------------------------------
am200epdkit_defconfig (arm, gcc-10) — PASS, 0 errors, 0 warnings, 0 section mismatches

--------------------------------------------------------------------------------
ar7_defconfig (mips, gcc-10) — PASS, 0 errors, 0 warnings, 0 section mismatches

--------------------------------------------------------------------------------
aspeed_g4_defconfig (arm, gcc-10) — PASS, 0 errors, 0 warnings, 0 section mismatches

--------------------------------------------------------------------------------
aspeed_g5_defconfig (arm, gcc-10) — PASS, 0 errors, 0 warnings, 0 section mismatches

--------------------------------------------------------------------------------
assabet_defconfig (arm, gcc-10) — PASS, 0 errors, 0 warnings, 0 section mismatches

--------------------------------------------------------------------------------
at91_dt_defconfig (arm, gcc-10) — PASS, 0 errors, 0 warnings, 0 section mismatches

--------------------------------------------------------------------------------
ath25_defconfig (mips, gcc-10) — PASS, 0 errors, 0 warnings, 0 section mismatches

--------------------------------------------------------------------------------
ath79_defconfig (mips, gcc-10) — PASS, 0 errors, 0 warnings, 0 section mismatches

--------------------------------------------------------------------------------
axm55xx_defconfig (arm, gcc-10) — PASS, 0 errors, 0 warnings, 0 section mismatches

--------------------------------------------------------------------------------
axs103_defconfig (arc, gcc-10) — PASS, 0 errors, 0 warnings, 0 section mismatches

--------------------------------------------------------------------------------
axs103_smp_defconfig (arc, gcc-10) — PASS, 0 errors, 0 warnings, 0 section mismatches

--------------------------------------------------------------------------------
badge4_defconfig (arm, gcc-10) — PASS, 0 errors, 0 warnings, 0 section mismatches

--------------------------------------------------------------------------------
bcm2835_defconfig (arm, gcc-10) — PASS, 0 errors, 0 warnings, 0 section mismatches

--------------------------------------------------------------------------------
bcm47xx_defconfig (mips, gcc-10) — PASS, 0 errors, 0 warnings, 0 section mismatches

--------------------------------------------------------------------------------
bcm63xx_defconfig (mips, gcc-10) — PASS, 0 errors, 0 warnings, 0 section mismatches

--------------------------------------------------------------------------------
bigsur_defconfig (mips, gcc-10) — PASS, 0 errors, 0 warnings, 0 section mismatches

--------------------------------------------------------------------------------
bmips_be_defconfig (mips, gcc-10) — PASS, 0 errors, 0 warnings, 0 section mismatches

--------------------------------------------------------------------------------
bmips_stb_defconfig (mips, gcc-10) — PASS, 0 errors, 0 warnings, 0 section mismatches

--------------------------------------------------------------------------------
capcella_defconfig (mips, gcc-10) — PASS, 0 errors, 0 warnings, 0 section mismatches

--------------------------------------------------------------------------------
cavium_octeon_defconfig (mips, gcc-10) — PASS, 0 errors, 0 warnings, 0 section mismatches

--------------------------------------------------------------------------------
cerfcube_defconfig (arm, gcc-10) — PASS, 0 errors, 0 warnings, 0 section mismatches

--------------------------------------------------------------------------------
ci20_defconfig (mips, gcc-10) — PASS, 0 errors, 0 warnings, 0 section mismatches

--------------------------------------------------------------------------------
cm_x2xx_defconfig (arm, gcc-10) — PASS, 0 errors, 0 warnings, 0 section mismatches

--------------------------------------------------------------------------------
cm_x300_defconfig (arm, gcc-10) — PASS, 0 errors, 0 warnings, 0 section mismatches

--------------------------------------------------------------------------------
cobalt_defconfig (mips, gcc-10) — PASS, 0 errors, 0 warnings, 0 section mismatches

--------------------------------------------------------------------------------
colibri_pxa270_defconfig (arm, gcc-10) — PASS, 0 errors, 0 warnings, 0 section mismatches

--------------------------------------------------------------------------------
colibri_pxa300_defconfig (arm, gcc-10) — PASS, 0 errors, 0 warnings, 0 section mismatches

--------------------------------------------------------------------------------
collie_defconfig (arm, gcc-10) — PASS, 0 errors, 0 warnings, 0 section mismatches

--------------------------------------------------------------------------------
corgi_defconfig (arm, gcc-10) — PASS, 0 errors, 0 warnings, 0 section mismatches

--------------------------------------------------------------------------------
davinci_all_defconfig (arm, gcc-10) — PASS, 0 errors, 0 warnings, 0 section mismatches

--------------------------------------------------------------------------------
db1xxx_defconfig (mips, gcc-10) — PASS, 0 errors, 0 warnings, 0 section mismatches

--------------------------------------------------------------------------------
decstation_defconfig (mips, gcc-10) — PASS, 0 errors, 0 warnings, 0 section mismatches

--------------------------------------------------------------------------------
defconfig (arm64, gcc-10) — PASS, 0 errors, 3 warnings, 0 section mismatches

Warnings:
aarch64-linux-gnu-ld: warning: -z norelro ignored
aarch64-linux-gnu-ld: warning: -z norelro ignored
aarch64-linux-gnu-ld: warning: -z norelro ignored

Section mismatches:
WARNING: modpost: Found 1 section mismatch(es).

--------------------------------------------------------------------------------
defconfig (riscv, gcc-10) — FAIL, 0 errors, 0 warnings, 0 section mismatches

--------------------------------------------------------------------------------
defconfig+arm64-chromebook (arm64, gcc-10) — PASS, 0 errors, 3 warnings, 0 section mismatches

Warnings:
aarch64-linux-gnu-ld: warning: -z norelro ignored
aarch64-linux-gnu-ld: warning: -z norelro ignored
aarch64-linux-gnu-ld: warning: -z norelro ignored

Section mismatches:
WARNING: modpost: Found 1 section mismatch(es).

--------------------------------------------------------------------------------
dove_defconfig (arm, gcc-10) — PASS, 0 errors, 0 warnings, 0 section mismatches

--------------------------------------------------------------------------------
e55_defconfig (mips, gcc-10) — PASS, 0 errors, 0 warnings, 0 section mismatches

--------------------------------------------------------------------------------
ebsa110_defconfig (arm, gcc-10) — PASS, 0 errors, 0 warnings, 0 section mismatches

--------------------------------------------------------------------------------
efm32_defconfig (arm, gcc-10) — PASS, 0 errors, 0 warnings, 0 section mismatches

--------------------------------------------------------------------------------
em_x270_defconfig (arm, gcc-10) — PASS, 0 errors, 0 warnings, 0 section mismatches

--------------------------------------------------------------------------------
ep93xx_defconfig (arm, gcc-10) — PASS, 0 errors, 0 warnings, 0 section mismatches

Section mismatches:
WARNING: modpost: Found 1 section mismatch(es).

--------------------------------------------------------------------------------
eseries_pxa_defconfig (arm, gcc-10) — PASS, 0 errors, 0 warnings, 0 section mismatches

--------------------------------------------------------------------------------
exynos_defconfig (arm, gcc-10) — PASS, 0 errors, 0 warnings, 0 section mismatches

--------------------------------------------------------------------------------
ezx_defconfig (arm, gcc-10) — PASS, 0 errors, 0 warnings, 0 section mismatches

--------------------------------------------------------------------------------
footbridge_defconfig (arm, gcc-10) — PASS, 0 errors, 0 warnings, 0 section mismatches

--------------------------------------------------------------------------------
fuloong2e_defconfig (mips, gcc-10) — PASS, 0 errors, 0 warnings, 0 section mismatches

--------------------------------------------------------------------------------
gcw0_defconfig (mips, gcc-10) — PASS, 0 errors, 0 warnings, 0 section mismatches

--------------------------------------------------------------------------------
gemini_defconfig (arm, gcc-10) — PASS, 0 errors, 0 warnings, 0 section mismatches

--------------------------------------------------------------------------------
gpr_defconfig (mips, gcc-10) — PASS, 0 errors, 0 warnings, 0 section mismatches

--------------------------------------------------------------------------------
h3600_defconfig (arm, gcc-10) — PASS, 0 errors, 0 warnings, 0 section mismatches

--------------------------------------------------------------------------------
h5000_defconfig (arm, gcc-10) — PASS, 0 errors, 0 warnings, 0 section mismatches

--------------------------------------------------------------------------------
hackkit_defconfig (arm, gcc-10) — PASS, 0 errors, 0 warnings, 0 section mismatches

--------------------------------------------------------------------------------
haps_hs_defconfig (arc, gcc-10) — PASS, 0 errors, 0 warnings, 0 section mismatches

--------------------------------------------------------------------------------
haps_hs_smp_defconfig (arc, gcc-10) — PASS, 0 errors, 0 warnings, 0 section mismatches

--------------------------------------------------------------------------------
hisi_defconfig (arm, gcc-10) — PASS, 0 errors, 0 warnings, 0 section mismatches

--------------------------------------------------------------------------------
hsdk_defconfig (arc, gcc-10) — PASS, 0 errors, 0 warnings, 0 section mismatches

--------------------------------------------------------------------------------
i386_defconfig (i386, gcc-10) — PASS, 0 errors, 2 warnings, 0 section mismatches

Warnings:
ld: arch/x86/boot/compressed/head_32.o: warning: relocation in read-only section `.head.text'
ld: warning: creating DT_TEXTREL in a PIE

--------------------------------------------------------------------------------
imote2_defconfig (arm, gcc-10) — PASS, 0 errors, 0 warnings, 0 section mismatches

--------------------------------------------------------------------------------
imx_v4_v5_defconfig (arm, gcc-10) — PASS, 0 errors, 0 warnings, 0 section mismatches

--------------------------------------------------------------------------------
imx_v6_v7_defconfig (arm, gcc-10) — PASS, 0 errors, 0 warnings, 0 section mismatches

--------------------------------------------------------------------------------
integrator_defconfig (arm, gcc-10) — PASS, 0 errors, 0 warnings, 0 section mismatches

Section mismatches:
WARNING: modpost: Found 1 section mismatch(es).

--------------------------------------------------------------------------------
iop13xx_defconfig (arm, gcc-10) — PASS, 0 errors, 0 warnings, 0 section mismatches

--------------------------------------------------------------------------------
iop32x_defconfig (arm, gcc-10) — PASS, 0 errors, 0 warnings, 0 section mismatches

--------------------------------------------------------------------------------
iop33x_defconfig (arm, gcc-10) — PASS, 0 errors, 0 warnings, 0 section mismatches

--------------------------------------------------------------------------------
ip22_defconfig (mips, gcc-10) — PASS, 0 errors, 0 warnings, 0 section mismatches

--------------------------------------------------------------------------------
ip27_defconfig (mips, gcc-10) — FAIL, 0 errors, 0 warnings, 0 section mismatches

--------------------------------------------------------------------------------
ip28_defconfig (mips, gcc-10) — FAIL, 0 errors, 0 warnings, 0 section mismatches

--------------------------------------------------------------------------------
ip32_defconfig (mips, gcc-10) — PASS, 0 errors, 0 warnings, 0 section mismatches

--------------------------------------------------------------------------------
ixp4xx_defconfig (arm, gcc-10) — PASS, 0 errors, 0 warnings, 0 section mismatches

--------------------------------------------------------------------------------
jazz_defconfig (mips, gcc-10) — PASS, 0 errors, 0 warnings, 0 section mismatches

--------------------------------------------------------------------------------
jmr3927_defconfig (mips, gcc-10) — PASS, 0 errors, 0 warnings, 0 section mismatches

--------------------------------------------------------------------------------
jornada720_defconfig (arm, gcc-10) — PASS, 0 errors, 0 warnings, 0 section mismatches

--------------------------------------------------------------------------------
keystone_defconfig (arm, gcc-10) — PASS, 0 errors, 0 warnings, 0 section mismatches

--------------------------------------------------------------------------------
ks8695_defconfig (arm, gcc-10) — PASS, 0 errors, 0 warnings, 0 section mismatches

--------------------------------------------------------------------------------
lart_defconfig (arm, gcc-10) — PASS, 0 errors, 0 warnings, 0 section mismatches

--------------------------------------------------------------------------------
lasat_defconfig (mips, gcc-10) — PASS, 0 errors, 0 warnings, 0 section mismatches

--------------------------------------------------------------------------------
lemote2f_defconfig (mips, gcc-10) — PASS, 0 errors, 1 warning, 0 section mismatches

Warnings:
net/core/rtnetlink.c:3199:1: warning: the frame size of 1328 bytes is larger than 1024 bytes [-Wframe-larger-than=]

--------------------------------------------------------------------------------
loongson1b_defconfig (mips, gcc-10) — PASS, 0 errors, 0 warnings, 0 section mismatches

--------------------------------------------------------------------------------
loongson1c_defconfig (mips, gcc-10) — PASS, 0 errors, 0 warnings, 0 section mismatches

--------------------------------------------------------------------------------
loongson3_defconfig (mips, gcc-10) — PASS, 0 errors, 1 warning, 0 section mismatches

Warnings:
net/core/rtnetlink.c:3199:1: warning: the frame size of 1328 bytes is larger than 1024 bytes [-Wframe-larger-than=]

--------------------------------------------------------------------------------
lpc18xx_defconfig (arm, gcc-10) — PASS, 0 errors, 0 warnings, 0 section mismatches

--------------------------------------------------------------------------------
lpc32xx_defconfig (arm, gcc-10) — PASS, 0 errors, 0 warnings, 0 section mismatches

--------------------------------------------------------------------------------
lpd270_defconfig (arm, gcc-10) — PASS, 0 errors, 0 warnings, 0 section mismatches

--------------------------------------------------------------------------------
lubbock_defconfig (arm, gcc-10) — PASS, 0 errors, 0 warnings, 0 section mismatches

--------------------------------------------------------------------------------
magician_defconfig (arm, gcc-10) — PASS, 0 errors, 0 warnings, 0 section mismatches

--------------------------------------------------------------------------------
mainstone_defconfig (arm, gcc-10) — PASS, 0 errors, 0 warnings, 0 section mismatches

--------------------------------------------------------------------------------
malta_defconfig (mips, gcc-10) — PASS, 0 errors, 0 warnings, 0 section mismatches

--------------------------------------------------------------------------------
malta_kvm_defconfig (mips, gcc-10) — PASS, 0 errors, 0 warnings, 0 section mismatches

--------------------------------------------------------------------------------
malta_kvm_guest_defconfig (mips, gcc-10) — PASS, 0 errors, 0 warnings, 0 section mismatches

--------------------------------------------------------------------------------
malta_qemu_32r6_defconfig (mips, gcc-10) — PASS, 0 errors, 1 warning, 0 section mismatches

Warnings:
{standard input}:132: Warning: macro instruction expanded into multiple instructions

--------------------------------------------------------------------------------
maltaaprp_defconfig (mips, gcc-10) — PASS, 0 errors, 0 warnings, 0 section mismatches

--------------------------------------------------------------------------------
maltasmvp_defconfig (mips, gcc-10) — PASS, 0 errors, 0 warnings, 0 section mismatches

--------------------------------------------------------------------------------
maltasmvp_eva_defconfig (mips, gcc-10) — PASS, 0 errors, 0 warnings, 0 section mismatches

--------------------------------------------------------------------------------
maltaup_defconfig (mips, gcc-10) — PASS, 0 errors, 0 warnings, 0 section mismatches

--------------------------------------------------------------------------------
maltaup_xpa_defconfig (mips, gcc-10) — PASS, 0 errors, 0 warnings, 0 section mismatches

--------------------------------------------------------------------------------
markeins_defconfig (mips, gcc-10) — PASS, 0 errors, 0 warnings, 0 section mismatches

--------------------------------------------------------------------------------
mini2440_defconfig (arm, gcc-10) — PASS, 0 errors, 0 warnings, 0 section mismatches

--------------------------------------------------------------------------------
mips_paravirt_defconfig (mips, gcc-10) — PASS, 0 errors, 0 warnings, 0 section mismatches

--------------------------------------------------------------------------------
mmp2_defconfig (arm, gcc-10) — PASS, 0 errors, 0 warnings, 0 section mismatches

--------------------------------------------------------------------------------
moxart_defconfig (arm, gcc-10) — PASS, 0 errors, 0 warnings, 0 section mismatches

--------------------------------------------------------------------------------
mpc30x_defconfig (mips, gcc-10) — PASS, 0 errors, 0 warnings, 0 section mismatches

--------------------------------------------------------------------------------
mps2_defconfig (arm, gcc-10) — PASS, 0 errors, 0 warnings, 0 section mismatches

--------------------------------------------------------------------------------
msp71xx_defconfig (mips, gcc-10) — PASS, 0 errors, 0 warnings, 0 section mismatches

--------------------------------------------------------------------------------
mtx1_defconfig (mips, gcc-10) — PASS, 0 errors, 3 warnings, 0 section mismatches

Warnings:
sound/pci/echoaudio/echoaudio_dsp.c:647:9: warning: iteration 1073741824 invokes undefined behavior [-Waggressive-loop-optimizations]
sound/pci/echoaudio/echoaudio_dsp.c:658:9: warning: iteration 1073741824 invokes undefined behavior [-Waggressive-loop-optimizations]
sound/pci/echoaudio/echoaudio_dsp.c:647:9: warning: iteration 1073741824 invokes undefined behavior [-Waggressive-loop-optimizations]

--------------------------------------------------------------------------------
multi_v4t_defconfig (arm, gcc-10) — PASS, 0 errors, 0 warnings, 0 section mismatches

--------------------------------------------------------------------------------
multi_v5_defconfig (arm, gcc-10) — PASS, 0 errors, 0 warnings, 0 section mismatches

Section mismatches:
WARNING: modpost: Found 1 section mismatch(es).

--------------------------------------------------------------------------------
multi_v7_defconfig (arm, gcc-10) — PASS, 0 errors, 0 warnings, 0 section mismatches

--------------------------------------------------------------------------------
mvebu_v5_defconfig (arm, gcc-10) — PASS, 0 errors, 0 warnings, 0 section mismatches

--------------------------------------------------------------------------------
mvebu_v7_defconfig (arm, gcc-10) — PASS, 0 errors, 0 warnings, 0 section mismatches

--------------------------------------------------------------------------------
mxs_defconfig (arm, gcc-10) — PASS, 0 errors, 0 warnings, 0 section mismatches

--------------------------------------------------------------------------------
neponset_defconfig (arm, gcc-10) — PASS, 0 errors, 0 warnings, 0 section mismatches

--------------------------------------------------------------------------------
netwinder_defconfig (arm, gcc-10) — PASS, 0 errors, 0 warnings, 0 section mismatches

--------------------------------------------------------------------------------
netx_defconfig (arm, gcc-10) — PASS, 0 errors, 0 warnings, 0 section mismatches

Section mismatches:
WARNING: modpost: Found 1 section mismatch(es).

--------------------------------------------------------------------------------
nhk8815_defconfig (arm, gcc-10) — PASS, 0 errors, 0 warnings, 0 section mismatches

Section mismatches:
WARNING: modpost: Found 1 section mismatch(es).

--------------------------------------------------------------------------------
nlm_xlp_defconfig (mips, gcc-10) — PASS, 0 errors, 1 warning, 0 section mismatches

Warnings:
net/core/rtnetlink.c:3199:1: warning: the frame size of 1344 bytes is larger than 1024 bytes [-Wframe-larger-than=]

--------------------------------------------------------------------------------
nlm_xlr_defconfig (mips, gcc-10) — PASS, 0 errors, 0 warnings, 0 section mismatches

--------------------------------------------------------------------------------
nsim_hs_defconfig (arc, gcc-10) — PASS, 0 errors, 0 warnings, 0 section mismatches

--------------------------------------------------------------------------------
nsim_hs_smp_defconfig (arc, gcc-10) — PASS, 0 errors, 0 warnings, 0 section mismatches

--------------------------------------------------------------------------------
nsimosci_hs_defconfig (arc, gcc-10) — PASS, 0 errors, 0 warnings, 0 section mismatches

--------------------------------------------------------------------------------
nsimosci_hs_smp_defconfig (arc, gcc-10) — PASS, 0 errors, 0 warnings, 0 section mismatches

--------------------------------------------------------------------------------
nuc910_defconfig (arm, gcc-10) — PASS, 0 errors, 0 warnings, 0 section mismatches

--------------------------------------------------------------------------------
nuc950_defconfig (arm, gcc-10) — PASS, 0 errors, 0 warnings, 0 section mismatches

--------------------------------------------------------------------------------
nuc960_defconfig (arm, gcc-10) — PASS, 0 errors, 0 warnings, 0 section mismatches

--------------------------------------------------------------------------------
omap1_defconfig (arm, gcc-10) — PASS, 0 errors, 1 warning, 0 section mismatches

Warnings:
drivers/gpio/gpio-omap.c:1233:34: warning: array ‘omap_gpio_match’ assumed to have one element

--------------------------------------------------------------------------------
omap2plus_defconfig (arm, gcc-10) — PASS, 0 errors, 0 warnings, 0 section mismatches

--------------------------------------------------------------------------------
omega2p_defconfig (mips, gcc-10) — PASS, 0 errors, 0 warnings, 0 section mismatches

--------------------------------------------------------------------------------
orion5x_defconfig (arm, gcc-10) — PASS, 0 errors, 0 warnings, 0 section mismatches

--------------------------------------------------------------------------------
oxnas_v6_defconfig (arm, gcc-10) — PASS, 0 errors, 0 warnings, 0 section mismatches

--------------------------------------------------------------------------------
palmz72_defconfig (arm, gcc-10) — PASS, 0 errors, 0 warnings, 0 section mismatches

--------------------------------------------------------------------------------
pcm027_defconfig (arm, gcc-10) — PASS, 0 errors, 0 warnings, 0 section mismatches

--------------------------------------------------------------------------------
pic32mzda_defconfig (mips, gcc-10) — PASS, 0 errors, 0 warnings, 0 section mismatches

--------------------------------------------------------------------------------
pistachio_defconfig (mips, gcc-10) — PASS, 0 errors, 0 warnings, 0 section mismatches

--------------------------------------------------------------------------------
pleb_defconfig (arm, gcc-10) — PASS, 0 errors, 0 warnings, 0 section mismatches

--------------------------------------------------------------------------------
pnx8335_stb225_defconfig (mips, gcc-10) — PASS, 0 errors, 0 warnings, 0 section mismatches

--------------------------------------------------------------------------------
prima2_defconfig (arm, gcc-10) — PASS, 0 errors, 0 warnings, 0 section mismatches

--------------------------------------------------------------------------------
pxa168_defconfig (arm, gcc-10) — PASS, 0 errors, 0 warnings, 0 section mismatches

--------------------------------------------------------------------------------
pxa255-idp_defconfig (arm, gcc-10) — PASS, 0 errors, 0 warnings, 0 section mismatches

--------------------------------------------------------------------------------
pxa3xx_defconfig (arm, gcc-10) — PASS, 0 errors, 0 warnings, 0 section mismatches

--------------------------------------------------------------------------------
pxa910_defconfig (arm, gcc-10) — PASS, 0 errors, 0 warnings, 0 section mismatches

--------------------------------------------------------------------------------
pxa_defconfig (arm, gcc-10) — PASS, 0 errors, 0 warnings, 0 section mismatches

--------------------------------------------------------------------------------
qcom_defconfig (arm, gcc-10) — PASS, 0 errors, 0 warnings, 0 section mismatches

--------------------------------------------------------------------------------
qi_lb60_defconfig (mips, gcc-10) — PASS, 0 errors, 0 warnings, 0 section mismatches

--------------------------------------------------------------------------------
raumfeld_defconfig (arm, gcc-10) — PASS, 0 errors, 0 warnings, 0 section mismatches

--------------------------------------------------------------------------------
rb532_defconfig (mips, gcc-10) — PASS, 0 errors, 0 warnings, 0 section mismatches

--------------------------------------------------------------------------------
rbtx49xx_defconfig (mips, gcc-10) — PASS, 0 errors, 0 warnings, 0 section mismatches

--------------------------------------------------------------------------------
realview_defconfig (arm, gcc-10) — PASS, 0 errors, 0 warnings, 0 section mismatches

--------------------------------------------------------------------------------
rm200_defconfig (mips, gcc-10) — PASS, 0 errors, 0 warnings, 0 section mismatches

--------------------------------------------------------------------------------
rpc_defconfig (arm, gcc-10) — FAIL, 2 errors, 0 warnings, 0 section mismatches

Errors:
arm-linux-gnueabihf-gcc: error: unrecognized -march target: armv3
arm-linux-gnueabihf-gcc: error: missing argument to ‘-march=’

--------------------------------------------------------------------------------
rt305x_defconfig (mips, gcc-10) — PASS, 0 errors, 0 warnings, 0 section mismatches

--------------------------------------------------------------------------------
s3c2410_defconfig (arm, gcc-10) — PASS, 0 errors, 0 warnings, 0 section mismatches

--------------------------------------------------------------------------------
s3c6400_defconfig (arm, gcc-10) — PASS, 0 errors, 0 warnings, 0 section mismatches

Section mismatches:
WARNING: modpost: Found 1 section mismatch(es).

--------------------------------------------------------------------------------
s5pv210_defconfig (arm, gcc-10) — PASS, 0 errors, 0 warnings, 0 section mismatches

Section mismatches:
WARNING: modpost: Found 1 section mismatch(es).

--------------------------------------------------------------------------------
sama5_defconfig (arm, gcc-10) — PASS, 0 errors, 0 warnings, 0 section mismatches

--------------------------------------------------------------------------------
sb1250_swarm_defconfig (mips, gcc-10) — PASS, 0 errors, 0 warnings, 0 section mismatches

--------------------------------------------------------------------------------
shannon_defconfig (arm, gcc-10) — PASS, 0 errors, 0 warnings, 0 section mismatches

--------------------------------------------------------------------------------
shmobile_defconfig (arm, gcc-10) — PASS, 0 errors, 0 warnings, 0 section mismatches

--------------------------------------------------------------------------------
simpad_defconfig (arm, gcc-10) — PASS, 0 errors, 0 warnings, 0 section mismatches

--------------------------------------------------------------------------------
socfpga_defconfig (arm, gcc-10) — PASS, 0 errors, 0 warnings, 0 section mismatches

--------------------------------------------------------------------------------
spear13xx_defconfig (arm, gcc-10) — PASS, 0 errors, 0 warnings, 0 section mismatches

--------------------------------------------------------------------------------
spear3xx_defconfig (arm, gcc-10) — PASS, 0 errors, 0 warnings, 0 section mismatches

Section mismatches:
WARNING: modpost: Found 1 section mismatch(es).

--------------------------------------------------------------------------------
spear6xx_defconfig (arm, gcc-10) — PASS, 0 errors, 0 warnings, 0 section mismatches

Section mismatches:
WARNING: modpost: Found 1 section mismatch(es).

--------------------------------------------------------------------------------
spitz_defconfig (arm, gcc-10) — PASS, 0 errors, 0 warnings, 0 section mismatches

--------------------------------------------------------------------------------
stm32_defconfig (arm, gcc-10) — PASS, 0 errors, 0 warnings, 0 section mismatches

--------------------------------------------------------------------------------
sunxi_defconfig (arm, gcc-10) — PASS, 0 errors, 0 warnings, 0 section mismatches

--------------------------------------------------------------------------------
tango4_defconfig (arm, gcc-10) — PASS, 0 errors, 0 warnings, 0 section mismatches

--------------------------------------------------------------------------------
tb0219_defconfig (mips, gcc-10) — PASS, 0 errors, 0 warnings, 0 section mismatches

--------------------------------------------------------------------------------
tb0226_defconfig (mips, gcc-10) — PASS, 0 errors, 0 warnings, 0 section mismatches

--------------------------------------------------------------------------------
tb0287_defconfig (mips, gcc-10) — PASS, 0 errors, 0 warnings, 0 section mismatches

--------------------------------------------------------------------------------
tct_hammer_defconfig (arm, gcc-10) — PASS, 0 errors, 0 warnings, 0 section mismatches

--------------------------------------------------------------------------------
tegra_defconfig (arm, gcc-10) — PASS, 0 errors, 0 warnings, 0 section mismatches

--------------------------------------------------------------------------------
tinyconfig (i386, gcc-10) — PASS, 0 errors, 2 warnings, 0 section mismatches

Warnings:
ld: arch/x86/boot/compressed/head_32.o: warning: relocation in read-only section `.head.text'
ld: warning: creating DT_TEXTREL in a PIE

--------------------------------------------------------------------------------
tinyconfig (riscv, gcc-10) — FAIL, 0 errors, 0 warnings, 0 section mismatches

--------------------------------------------------------------------------------
tinyconfig (arc, gcc-10) — PASS, 0 errors, 0 warnings, 0 section mismatches

--------------------------------------------------------------------------------
tinyconfig (x86_64, gcc-10) — PASS, 0 errors, 3 warnings, 0 section mismatches

Warnings:
arch/x86/entry/entry_64.S:1738: Warning: no instruction mnemonic suffix given and no register operands; using default for `sysret'
ld: arch/x86/boot/compressed/head_64.o: warning: relocation in read-only section `.head.text'
ld: warning: creating DT_TEXTREL in a PIE

--------------------------------------------------------------------------------
trizeps4_defconfig (arm, gcc-10) — PASS, 0 errors, 0 warnings, 0 section mismatches

--------------------------------------------------------------------------------
u300_defconfig (arm, gcc-10) — PASS, 0 errors, 0 warnings, 0 section mismatches

Section mismatches:
WARNING: modpost: Found 1 section mismatch(es).

--------------------------------------------------------------------------------
u8500_defconfig (arm, gcc-10) — PASS, 0 errors, 0 warnings, 0 section mismatches

--------------------------------------------------------------------------------
vdk_hs38_defconfig (arc, gcc-10) — PASS, 0 errors, 0 warnings, 0 section mismatches

--------------------------------------------------------------------------------
vdk_hs38_smp_defconfig (arc, gcc-10) — PASS, 0 errors, 0 warnings, 0 section mismatches

--------------------------------------------------------------------------------
versatile_defconfig (arm, gcc-10) — PASS, 0 errors, 0 warnings, 0 section mismatches

Section mismatches:
WARNING: modpost: Found 1 section mismatch(es).

--------------------------------------------------------------------------------
vexpress_defconfig (arm, gcc-10) — PASS, 0 errors, 0 warnings, 0 section mismatches

--------------------------------------------------------------------------------
vf610m4_defconfig (arm, gcc-10) — PASS, 0 errors, 0 warnings, 0 section mismatches

--------------------------------------------------------------------------------
viper_defconfig (arm, gcc-10) — PASS, 0 errors, 0 warnings, 0 section mismatches

--------------------------------------------------------------------------------
vocore2_defconfig (mips, gcc-10) — PASS, 0 errors, 0 warnings, 0 section mismatches

--------------------------------------------------------------------------------
vt8500_v6_v7_defconfig (arm, gcc-10) — PASS, 0 errors, 0 warnings, 0 section mismatches

--------------------------------------------------------------------------------
workpad_defconfig (mips, gcc-10) — PASS, 0 errors, 0 warnings, 0 section mismatches

--------------------------------------------------------------------------------
x86_64_defconfig (x86_64, gcc-10) — PASS, 0 errors, 3 warnings, 0 section mismatches

Warnings:
arch/x86/entry/entry_64.S:1738: Warning: no instruction mnemonic suffix given and no register operands; using default for `sysret'
ld: arch/x86/boot/compressed/head_64.o: warning: relocation in read-only section `.head.text'
ld: warning: creating DT_TEXTREL in a PIE

--------------------------------------------------------------------------------
x86_64_defconfig+x86-chromebook (x86_64, gcc-10) — PASS, 0 errors, 3 warnings, 0 section mismatches

Warnings:
arch/x86/entry/entry_64.S:1738: Warning: no instruction mnemonic suffix given and no register operands; using default for `sysret'
ld: arch/x86/boot/compressed/head_64.o: warning: relocation in read-only section `.head.text'
ld: warning: creating DT_TEXTREL in a PIE

--------------------------------------------------------------------------------
xcep_defconfig (arm, gcc-10) — PASS, 0 errors, 0 warnings, 0 section mismatches

--------------------------------------------------------------------------------
zeus_defconfig (arm, gcc-10) — PASS, 0 errors, 0 warnings, 0 section mismatches

--------------------------------------------------------------------------------
zx_defconfig (arm, gcc-10) — PASS, 0 errors, 0 warnings, 0 section mismatches

---
For more info write to <info@...>


cip-gitlab/ci/iwamatsu/linux-5.10.y-cip-rc smc: 9 runs, 3 regressions (v5.10.129-cip12-12-ge4e007863cc76) #kernelci

kernelci.org bot <bot@...>
 

cip-gitlab/ci/iwamatsu/linux-5.10.y-cip-rc smc: 9 runs, 3 regressions (v5.10.129-cip12-12-ge4e007863cc76)

Regressions Summary
-------------------

platform | arch | lab | compiler | defconfig | regressions
-----------------------------+--------+---------------+----------+------------------------------+------------
hp-x360-12b-c...4020-octopus | x86_64 | lab-collabora | gcc-10 | x86_64_defcon...6-chromebook | 2
qemu_arm64-virt-gicv3 | arm64 | lab-broonie | gcc-10 | defconfig+arm64-chromebook | 1

Details: https://kernelci.org/test/job/cip-gitlab/branch/ci%2Fiwamatsu%2Flinux-5.10.y-cip-rc/kernel/v5.10.129-cip12-12-ge4e007863cc76/plan/smc/

Test: smc
Tree: cip-gitlab
Branch: ci/iwamatsu/linux-5.10.y-cip-rc
Describe: v5.10.129-cip12-12-ge4e007863cc76
URL: https://gitlab.com/cip-project/cip-kernel/linux-cip.git
SHA: e4e007863cc767efd75ca69c0b98e5daab0c20ff


Test Regressions
----------------


platform | arch | lab | compiler | defconfig | regressions
-----------------------------+--------+---------------+----------+------------------------------+------------
hp-x360-12b-c...4020-octopus | x86_64 | lab-collabora | gcc-10 | x86_64_defcon...6-chromebook | 2

Details: https://kernelci.org/test/plan/id/62d9187b7c643e1719daf0cd

Results: 14 PASS, 2 FAIL, 0 SKIP
Full config: x86_64_defconfig+x86-chromebook
Compiler: gcc-10 (gcc (Debian 10.2.1-6) 10.2.1 20210110)
Plain log: https://storage.kernelci.org//cip-gitlab/ci-iwamatsu-linux-5.10.y-cip-rc/v5.10.129-cip12-12-ge4e007863cc76/x86_64/x86_64_defconfig+x86-chromebook/gcc-10/lab-collabora/smc-hp-x360-12b-ca0010nr-n4020-octopus.txt
HTML log: https://storage.kernelci.org//cip-gitlab/ci-iwamatsu-linux-5.10.y-cip-rc/v5.10.129-cip12-12-ge4e007863cc76/x86_64/x86_64_defconfig+x86-chromebook/gcc-10/lab-collabora/smc-hp-x360-12b-ca0010nr-n4020-octopus.html
Rootfs: http://storage.kernelci.org/images/rootfs/buildroot/buildroot-baseline/20220716.0/x86/rootfs.cpio.gz


* smc.CVE-2018-3639: https://kernelci.org/test/case/id/62d9187b7c643e1719daf0d9
failing since 16 days (last pass: v5.10.121-cip9-287-ge9094c8446fc, first fail: v5.10.125-cip10-119-g603acbe1aceb)

2022-07-21T09:12:04.967665 <8>[ 13.052097] <LAVA_SIGNAL_TESTCASE TEST_CASE_ID=CVE-2018-3639 RESULT=fail>

* smc.CVE-2018-3640: https://kernelci.org/test/case/id/62d9187b7c643e1719daf0da
failing since 16 days (last pass: v5.10.121-cip9-287-ge9094c8446fc, first fail: v5.10.125-cip10-119-g603acbe1aceb)

2022-07-21T09:12:04.949819 <8>[ 13.034129] <LAVA_SIGNAL_TESTCASE TEST_CASE_ID=CVE-2018-3640 RESULT=fail>



platform | arch | lab | compiler | defconfig | regressions
-----------------------------+--------+---------------+----------+------------------------------+------------
qemu_arm64-virt-gicv3 | arm64 | lab-broonie | gcc-10 | defconfig+arm64-chromebook | 1

Details: https://kernelci.org/test/plan/id/62d91e47a75c989310daf057

Results: 0 PASS, 1 FAIL, 0 SKIP
Full config: defconfig+arm64-chromebook
Compiler: gcc-10 (aarch64-linux-gnu-gcc (Debian 10.2.1-6) 10.2.1 20210110)
Plain log: https://storage.kernelci.org//cip-gitlab/ci-iwamatsu-linux-5.10.y-cip-rc/v5.10.129-cip12-12-ge4e007863cc76/arm64/defconfig+arm64-chromebook/gcc-10/lab-broonie/smc-qemu_arm64-virt-gicv3.txt
HTML log: https://storage.kernelci.org//cip-gitlab/ci-iwamatsu-linux-5.10.y-cip-rc/v5.10.129-cip12-12-ge4e007863cc76/arm64/defconfig+arm64-chromebook/gcc-10/lab-broonie/smc-qemu_arm64-virt-gicv3.html
Rootfs: http://storage.kernelci.org/images/rootfs/buildroot/buildroot-baseline/20220716.0/arm64/rootfs.cpio.gz


* smc.login: https://kernelci.org/test/case/id/62d91e47a75c989310daf058
failing since 69 days (last pass: v5.10.112-cip6-88-gf3397cadb2dd6, first fail: v5.10.112-cip6-289-g2969e096d186)


cip-gitlab/ci/iwamatsu/linux-5.10.y-cip-rc ltp-timers: 10 runs, 1 regressions (v5.10.129-cip12-12-ge4e007863cc76) #kernelci

kernelci.org bot <bot@...>
 

cip-gitlab/ci/iwamatsu/linux-5.10.y-cip-rc ltp-timers: 10 runs, 1 regressions (v5.10.129-cip12-12-ge4e007863cc76)

Regressions Summary
-------------------

platform | arch | lab | compiler | defconfig | regressions
-------------------------+-------+---------+----------+----------------------------+------------
r8a774a1-hihope-rzg2m-ex | arm64 | lab-cip | gcc-10 | defconfig+arm64-chromebook | 1

Details: https://kernelci.org/test/job/cip-gitlab/branch/ci%2Fiwamatsu%2Flinux-5.10.y-cip-rc/kernel/v5.10.129-cip12-12-ge4e007863cc76/plan/ltp-timers/

Test: ltp-timers
Tree: cip-gitlab
Branch: ci/iwamatsu/linux-5.10.y-cip-rc
Describe: v5.10.129-cip12-12-ge4e007863cc76
URL: https://gitlab.com/cip-project/cip-kernel/linux-cip.git
SHA: e4e007863cc767efd75ca69c0b98e5daab0c20ff

Test suite revisions:
ltp-tests
URL: https://github.com/linux-test-project/ltp.git
SHA: bda92ad659a52d38ac810099f69adff626b064c6


Test Regressions
----------------


platform | arch | lab | compiler | defconfig | regressions
-------------------------+-------+---------+----------+----------------------------+------------
r8a774a1-hihope-rzg2m-ex | arm64 | lab-cip | gcc-10 | defconfig+arm64-chromebook | 1

Details: https://kernelci.org/test/plan/id/62d925e0891feac367daf066

Results: 0 PASS, 1 FAIL, 0 SKIP
Full config: defconfig+arm64-chromebook
Compiler: gcc-10 (aarch64-linux-gnu-gcc (Debian 10.2.1-6) 10.2.1 20210110)
Plain log: https://storage.kernelci.org//cip-gitlab/ci-iwamatsu-linux-5.10.y-cip-rc/v5.10.129-cip12-12-ge4e007863cc76/arm64/defconfig+arm64-chromebook/gcc-10/lab-cip/ltp-timers-r8a774a1-hihope-rzg2m-ex.txt
HTML log: https://storage.kernelci.org//cip-gitlab/ci-iwamatsu-linux-5.10.y-cip-rc/v5.10.129-cip12-12-ge4e007863cc76/arm64/defconfig+arm64-chromebook/gcc-10/lab-cip/ltp-timers-r8a774a1-hihope-rzg2m-ex.html
Rootfs: http://storage.kernelci.org/images/rootfs/debian/bullseye-ltp/20220716.0/arm64/initrd.cpio.gz


* ltp-timers.login: https://kernelci.org/test/case/id/62d925e0891feac367daf067
new failure (last pass: v5.10.126-cip11-116-gef362fbbff528)


cip-gitlab/ci/iwamatsu/linux-5.10.y-cip-rc ltp-pty: 6 runs, 1 regressions (v5.10.129-cip12-12-ge4e007863cc76) #kernelci

kernelci.org bot <bot@...>
 

cip-gitlab/ci/iwamatsu/linux-5.10.y-cip-rc ltp-pty: 6 runs, 1 regressions (v5.10.129-cip12-12-ge4e007863cc76)

Regressions Summary
-------------------

platform | arch | lab | compiler | defconfig | regressions
-------------------------+-------+---------+----------+----------------------------+------------
r8a774a1-hihope-rzg2m-ex | arm64 | lab-cip | gcc-10 | defconfig+arm64-chromebook | 1

Details: https://kernelci.org/test/job/cip-gitlab/branch/ci%2Fiwamatsu%2Flinux-5.10.y-cip-rc/kernel/v5.10.129-cip12-12-ge4e007863cc76/plan/ltp-pty/

Test: ltp-pty
Tree: cip-gitlab
Branch: ci/iwamatsu/linux-5.10.y-cip-rc
Describe: v5.10.129-cip12-12-ge4e007863cc76
URL: https://gitlab.com/cip-project/cip-kernel/linux-cip.git
SHA: e4e007863cc767efd75ca69c0b98e5daab0c20ff

Test suite revisions:
ltp-tests
URL: https://github.com/linux-test-project/ltp.git
SHA: bda92ad659a52d38ac810099f69adff626b064c6


Test Regressions
----------------


platform | arch | lab | compiler | defconfig | regressions
-------------------------+-------+---------+----------+----------------------------+------------
r8a774a1-hihope-rzg2m-ex | arm64 | lab-cip | gcc-10 | defconfig+arm64-chromebook | 1

Details: https://kernelci.org/test/plan/id/62d92428829327238cdaf08c

Results: 0 PASS, 1 FAIL, 0 SKIP
Full config: defconfig+arm64-chromebook
Compiler: gcc-10 (aarch64-linux-gnu-gcc (Debian 10.2.1-6) 10.2.1 20210110)
Plain log: https://storage.kernelci.org//cip-gitlab/ci-iwamatsu-linux-5.10.y-cip-rc/v5.10.129-cip12-12-ge4e007863cc76/arm64/defconfig+arm64-chromebook/gcc-10/lab-cip/ltp-pty-r8a774a1-hihope-rzg2m-ex.txt
HTML log: https://storage.kernelci.org//cip-gitlab/ci-iwamatsu-linux-5.10.y-cip-rc/v5.10.129-cip12-12-ge4e007863cc76/arm64/defconfig+arm64-chromebook/gcc-10/lab-cip/ltp-pty-r8a774a1-hihope-rzg2m-ex.html
Rootfs: http://storage.kernelci.org/images/rootfs/debian/bullseye-ltp/20220716.0/arm64/initrd.cpio.gz


* ltp-pty.login: https://kernelci.org/test/case/id/62d92428829327238cdaf08d
new failure (last pass: v5.10.126-cip11-116-gef362fbbff528)


cip-gitlab/ci/iwamatsu/linux-5.10.y-cip-rc ltp-ipc: 11 runs, 3 regressions (v5.10.129-cip12-12-ge4e007863cc76) #kernelci

kernelci.org bot <bot@...>
 

cip-gitlab/ci/iwamatsu/linux-5.10.y-cip-rc ltp-ipc: 11 runs, 3 regressions (v5.10.129-cip12-12-ge4e007863cc76)

Regressions Summary
-------------------

platform | arch | lab | compiler | defconfig | regressions
-------------------------+-------+---------+----------+----------------------------+------------
beaglebone-black | arm | lab-cip | gcc-10 | multi_v7_defconfig | 1
beaglebone-black | arm | lab-cip | gcc-10 | omap2plus_defconfig | 1
r8a774a1-hihope-rzg2m-ex | arm64 | lab-cip | gcc-10 | defconfig+arm64-chromebook | 1

Details: https://kernelci.org/test/job/cip-gitlab/branch/ci%2Fiwamatsu%2Flinux-5.10.y-cip-rc/kernel/v5.10.129-cip12-12-ge4e007863cc76/plan/ltp-ipc/

Test: ltp-ipc
Tree: cip-gitlab
Branch: ci/iwamatsu/linux-5.10.y-cip-rc
Describe: v5.10.129-cip12-12-ge4e007863cc76
URL: https://gitlab.com/cip-project/cip-kernel/linux-cip.git
SHA: e4e007863cc767efd75ca69c0b98e5daab0c20ff

Test suite revisions:
ltp-tests
URL: https://github.com/linux-test-project/ltp.git
SHA: bda92ad659a52d38ac810099f69adff626b064c6


Test Regressions
----------------


platform | arch | lab | compiler | defconfig | regressions
-------------------------+-------+---------+----------+----------------------------+------------
beaglebone-black | arm | lab-cip | gcc-10 | multi_v7_defconfig | 1

Details: https://kernelci.org/test/plan/id/62d926bb0c6be4fbcedaf0bc

Results: 0 PASS, 1 FAIL, 0 SKIP
Full config: multi_v7_defconfig
Compiler: gcc-10 (arm-linux-gnueabihf-gcc (Debian 10.2.1-6) 10.2.1 20210110)
Plain log: https://storage.kernelci.org//cip-gitlab/ci-iwamatsu-linux-5.10.y-cip-rc/v5.10.129-cip12-12-ge4e007863cc76/arm/multi_v7_defconfig/gcc-10/lab-cip/ltp-ipc-beaglebone-black.txt
HTML log: https://storage.kernelci.org//cip-gitlab/ci-iwamatsu-linux-5.10.y-cip-rc/v5.10.129-cip12-12-ge4e007863cc76/arm/multi_v7_defconfig/gcc-10/lab-cip/ltp-ipc-beaglebone-black.html
Rootfs: http://storage.kernelci.org/images/rootfs/debian/bullseye-ltp/20220716.0/armhf/initrd.cpio.gz


* ltp-ipc.login: https://kernelci.org/test/case/id/62d926bb0c6be4fbcedaf0bd
new failure (last pass: v5.10.129-cip12-59-ge5b19636ca9c4)



platform | arch | lab | compiler | defconfig | regressions
-------------------------+-------+---------+----------+----------------------------+------------
beaglebone-black | arm | lab-cip | gcc-10 | omap2plus_defconfig | 1

Details: https://kernelci.org/test/plan/id/62d91cf9e580dc2d10daf056

Results: 0 PASS, 1 FAIL, 0 SKIP
Full config: omap2plus_defconfig
Compiler: gcc-10 (arm-linux-gnueabihf-gcc (Debian 10.2.1-6) 10.2.1 20210110)
Plain log: https://storage.kernelci.org//cip-gitlab/ci-iwamatsu-linux-5.10.y-cip-rc/v5.10.129-cip12-12-ge4e007863cc76/arm/omap2plus_defconfig/gcc-10/lab-cip/ltp-ipc-beaglebone-black.txt
HTML log: https://storage.kernelci.org//cip-gitlab/ci-iwamatsu-linux-5.10.y-cip-rc/v5.10.129-cip12-12-ge4e007863cc76/arm/omap2plus_defconfig/gcc-10/lab-cip/ltp-ipc-beaglebone-black.html
Rootfs: http://storage.kernelci.org/images/rootfs/debian/bullseye-ltp/20220716.0/armhf/initrd.cpio.gz


* ltp-ipc.login: https://kernelci.org/test/case/id/62d91cf9e580dc2d10daf057
new failure (last pass: v5.10.126-cip11-116-gef362fbbff528)



platform | arch | lab | compiler | defconfig | regressions
-------------------------+-------+---------+----------+----------------------------+------------
r8a774a1-hihope-rzg2m-ex | arm64 | lab-cip | gcc-10 | defconfig+arm64-chromebook | 1

Details: https://kernelci.org/test/plan/id/62d91e4ca75c989310daf068

Results: 0 PASS, 1 FAIL, 0 SKIP
Full config: defconfig+arm64-chromebook
Compiler: gcc-10 (aarch64-linux-gnu-gcc (Debian 10.2.1-6) 10.2.1 20210110)
Plain log: https://storage.kernelci.org//cip-gitlab/ci-iwamatsu-linux-5.10.y-cip-rc/v5.10.129-cip12-12-ge4e007863cc76/arm64/defconfig+arm64-chromebook/gcc-10/lab-cip/ltp-ipc-r8a774a1-hihope-rzg2m-ex.txt
HTML log: https://storage.kernelci.org//cip-gitlab/ci-iwamatsu-linux-5.10.y-cip-rc/v5.10.129-cip12-12-ge4e007863cc76/arm64/defconfig+arm64-chromebook/gcc-10/lab-cip/ltp-ipc-r8a774a1-hihope-rzg2m-ex.html
Rootfs: http://storage.kernelci.org/images/rootfs/debian/bullseye-ltp/20220716.0/arm64/initrd.cpio.gz


* ltp-ipc.login: https://kernelci.org/test/case/id/62d91e4ca75c989310daf069
failing since 14 days (last pass: v5.10.126-cip11-1-gc5218dc69ff1, first fail: v5.10.126-cip11-116-gef362fbbff528)


cip-gitlab/ci/iwamatsu/linux-5.10.y-cip-rc kselftest-seccomp: 7 runs, 1 regressions (v5.10.129-cip12-12-ge4e007863cc76) #kernelci

kernelci.org bot <bot@...>
 

cip-gitlab/ci/iwamatsu/linux-5.10.y-cip-rc kselftest-seccomp: 7 runs, 1 regressions (v5.10.129-cip12-12-ge4e007863cc76)

Regressions Summary
-------------------

platform | arch | lab | compiler | defconfig | regressions
-----------------------------+-------+--------------+----------+---------------------+------------
meson-gxl-s905x-libretech-cc | arm64 | lab-baylibre | gcc-10 | defconfig+kselftest | 1

Details: https://kernelci.org/test/job/cip-gitlab/branch/ci%2Fiwamatsu%2Flinux-5.10.y-cip-rc/kernel/v5.10.129-cip12-12-ge4e007863cc76/plan/kselftest-seccomp/

Test: kselftest-seccomp
Tree: cip-gitlab
Branch: ci/iwamatsu/linux-5.10.y-cip-rc
Describe: v5.10.129-cip12-12-ge4e007863cc76
URL: https://gitlab.com/cip-project/cip-kernel/linux-cip.git
SHA: e4e007863cc767efd75ca69c0b98e5daab0c20ff


Test Regressions
----------------


platform | arch | lab | compiler | defconfig | regressions
-----------------------------+-------+--------------+----------+---------------------+------------
meson-gxl-s905x-libretech-cc | arm64 | lab-baylibre | gcc-10 | defconfig+kselftest | 1

Details: https://kernelci.org/test/plan/id/62d91ff6ed0f0419b3daf0dd

Results: 0 PASS, 1 FAIL, 0 SKIP
Full config: defconfig+kselftest
Compiler: gcc-10 (aarch64-linux-gnu-gcc (Debian 10.2.1-6) 10.2.1 20210110)
Plain log: https://storage.kernelci.org//cip-gitlab/ci-iwamatsu-linux-5.10.y-cip-rc/v5.10.129-cip12-12-ge4e007863cc76/arm64/defconfig+kselftest/gcc-10/lab-baylibre/kselftest-seccomp-meson-gxl-s905x-libretech-cc.txt
HTML log: https://storage.kernelci.org//cip-gitlab/ci-iwamatsu-linux-5.10.y-cip-rc/v5.10.129-cip12-12-ge4e007863cc76/arm64/defconfig+kselftest/gcc-10/lab-baylibre/kselftest-seccomp-meson-gxl-s905x-libretech-cc.html
Rootfs: http://storage.kernelci.org/images/rootfs/debian/bullseye-kselftest/20220716.0/arm64/initrd.cpio.gz


* kselftest-seccomp.login: https://kernelci.org/test/case/id/62d91ff6ed0f0419b3daf0de
new failure (last pass: v5.10.126-cip11-116-gef362fbbff528)


cip-gitlab/ci/iwamatsu/linux-5.10.y-cip-rc ltp-fcntl-locktests: 6 runs, 1 regressions (v5.10.129-cip12-12-ge4e007863cc76) #kernelci

kernelci.org bot <bot@...>
 

cip-gitlab/ci/iwamatsu/linux-5.10.y-cip-rc ltp-fcntl-locktests: 6 runs, 1 regressions (v5.10.129-cip12-12-ge4e007863cc76)

Regressions Summary
-------------------

platform | arch | lab | compiler | defconfig | regressions
-------------------------+-------+---------+----------+----------------------------+------------
r8a774a1-hihope-rzg2m-ex | arm64 | lab-cip | gcc-10 | defconfig+arm64-chromebook | 1

Details: https://kernelci.org/test/job/cip-gitlab/branch/ci%2Fiwamatsu%2Flinux-5.10.y-cip-rc/kernel/v5.10.129-cip12-12-ge4e007863cc76/plan/ltp-fcntl-locktests/

Test: ltp-fcntl-locktests
Tree: cip-gitlab
Branch: ci/iwamatsu/linux-5.10.y-cip-rc
Describe: v5.10.129-cip12-12-ge4e007863cc76
URL: https://gitlab.com/cip-project/cip-kernel/linux-cip.git
SHA: e4e007863cc767efd75ca69c0b98e5daab0c20ff

Test suite revisions:
ltp-tests
URL: https://github.com/linux-test-project/ltp.git
SHA: bda92ad659a52d38ac810099f69adff626b064c6


Test Regressions
----------------


platform | arch | lab | compiler | defconfig | regressions
-------------------------+-------+---------+----------+----------------------------+------------
r8a774a1-hihope-rzg2m-ex | arm64 | lab-cip | gcc-10 | defconfig+arm64-chromebook | 1

Details: https://kernelci.org/test/plan/id/62d9289c9392949554daf063

Results: 0 PASS, 1 FAIL, 0 SKIP
Full config: defconfig+arm64-chromebook
Compiler: gcc-10 (aarch64-linux-gnu-gcc (Debian 10.2.1-6) 10.2.1 20210110)
Plain log: https://storage.kernelci.org//cip-gitlab/ci-iwamatsu-linux-5.10.y-cip-rc/v5.10.129-cip12-12-ge4e007863cc76/arm64/defconfig+arm64-chromebook/gcc-10/lab-cip/ltp-fcntl-locktests-r8a774a1-hihope-rzg2m-ex.txt
HTML log: https://storage.kernelci.org//cip-gitlab/ci-iwamatsu-linux-5.10.y-cip-rc/v5.10.129-cip12-12-ge4e007863cc76/arm64/defconfig+arm64-chromebook/gcc-10/lab-cip/ltp-fcntl-locktests-r8a774a1-hihope-rzg2m-ex.html
Rootfs: http://storage.kernelci.org/images/rootfs/debian/bullseye-ltp/20220716.0/arm64/initrd.cpio.gz


* ltp-fcntl-locktests.login: https://kernelci.org/test/case/id/62d9289c9392949554daf064
new failure (last pass: v5.10.126-cip11-116-gef362fbbff528)

261 - 280 of 9152