Date   

cip-gitlab/ci/pavel/linux-test build: 185 builds: 3 failed, 182 passed, 4 errors, 10 warnings (v5.10.129-cip12-36-g21d9d56f4de5a) #kernelci

kernelci.org bot <bot@...>
 

cip-gitlab/ci/pavel/linux-test build: 185 builds: 3 failed, 182 passed, 4 errors, 10 warnings (v5.10.129-cip12-36-g21d9d56f4de5a)

Full Build Summary: https://kernelci.org/build/cip-gitlab/branch/ci%2Fpavel%2Flinux-test/kernel/v5.10.129-cip12-36-g21d9d56f4de5a/

Tree: cip-gitlab
Branch: ci/pavel/linux-test
Git Describe: v5.10.129-cip12-36-g21d9d56f4de5a
Git Commit: 21d9d56f4de5acd415b12aecf82f754e9e6065fb
Git URL: https://gitlab.com/cip-project/cip-kernel/linux-cip.git
Built: 7 unique architectures

Build Failures Detected:

arm:
rpc_defconfig: (gcc-10) FAIL

mips:
ip27_defconfig: (gcc-10) FAIL
ip28_defconfig: (gcc-10) FAIL

Errors and Warnings Detected:

arc:

arm64:

arm:
rpc_defconfig (gcc-10): 4 errors

i386:

mips:
32r2el_defconfig (gcc-10): 1 warning
decstation_64_defconfig (gcc-10): 1 warning
decstation_defconfig (gcc-10): 1 warning
decstation_r4k_defconfig (gcc-10): 1 warning
lemote2f_defconfig (gcc-10): 1 warning
rm200_defconfig (gcc-10): 1 warning

riscv:
rv32_defconfig (gcc-10): 4 warnings

x86_64:

Errors summary:

2 arm-linux-gnueabihf-gcc: error: unrecognized -march target: armv3m
2 arm-linux-gnueabihf-gcc: error: missing argument to ‘-march=’

Warnings summary:

3 kernel/rcu/tasks.h:710:13: warning: ‘show_rcu_tasks_rude_gp_kthread’ defined but not used [-Wunused-function]
2 <stdin>:830:2: warning: #warning syscall fstat64 not implemented [-Wcpp]
2 <stdin>:1127:2: warning: #warning syscall fstatat64 not implemented [-Wcpp]
1 net/mac80211/mlme.c:4349:1: warning: the frame size of 1040 bytes is larger than 1024 bytes [-Wframe-larger-than=]
1 drivers/block/paride/bpck.c:32: warning: "PC" redefined
1 WARNING: modpost: Symbol info of vmlinux is missing. Unresolved symbol check will be entirely skipped.

Section mismatches summary:

1 WARNING: modpost: vmlinux.o(___ksymtab_gpl+ixp4xx_irq_init+0x0): Section mismatch in reference from the variable __ksymtab_ixp4xx_irq_init to the function .init.text:ixp4xx_irq_init()
1 WARNING: modpost: vmlinux.o(___ksymtab+prom_init_numa_memory+0x0): Section mismatch in reference from the variable __ksymtab_prom_init_numa_memory to the function .init.text:prom_init_numa_memory()

================================================================================

Detailed per-defconfig build reports:

--------------------------------------------------------------------------------
32r2el_defconfig (mips, gcc-10) — PASS, 0 errors, 1 warning, 0 section mismatches

Warnings:
WARNING: modpost: Symbol info of vmlinux is missing. Unresolved symbol check will be entirely skipped.

--------------------------------------------------------------------------------
allnoconfig (arc, gcc-10) — PASS, 0 errors, 0 warnings, 0 section mismatches

--------------------------------------------------------------------------------
allnoconfig (x86_64, gcc-10) — PASS, 0 errors, 0 warnings, 0 section mismatches

--------------------------------------------------------------------------------
allnoconfig (i386, gcc-10) — PASS, 0 errors, 0 warnings, 0 section mismatches

--------------------------------------------------------------------------------
am200epdkit_defconfig (arm, gcc-10) — PASS, 0 errors, 0 warnings, 0 section mismatches

--------------------------------------------------------------------------------
ar7_defconfig (mips, gcc-10) — PASS, 0 errors, 0 warnings, 0 section mismatches

--------------------------------------------------------------------------------
aspeed_g4_defconfig (arm, gcc-10) — PASS, 0 errors, 0 warnings, 0 section mismatches

--------------------------------------------------------------------------------
aspeed_g5_defconfig (arm, gcc-10) — PASS, 0 errors, 0 warnings, 0 section mismatches

--------------------------------------------------------------------------------
assabet_defconfig (arm, gcc-10) — PASS, 0 errors, 0 warnings, 0 section mismatches

--------------------------------------------------------------------------------
at91_dt_defconfig (arm, gcc-10) — PASS, 0 errors, 0 warnings, 0 section mismatches

--------------------------------------------------------------------------------
ath25_defconfig (mips, gcc-10) — PASS, 0 errors, 0 warnings, 0 section mismatches

--------------------------------------------------------------------------------
ath79_defconfig (mips, gcc-10) — PASS, 0 errors, 0 warnings, 0 section mismatches

--------------------------------------------------------------------------------
axm55xx_defconfig (arm, gcc-10) — PASS, 0 errors, 0 warnings, 0 section mismatches

--------------------------------------------------------------------------------
axs103_defconfig (arc, gcc-10) — PASS, 0 errors, 0 warnings, 0 section mismatches

--------------------------------------------------------------------------------
axs103_smp_defconfig (arc, gcc-10) — PASS, 0 errors, 0 warnings, 0 section mismatches

--------------------------------------------------------------------------------
badge4_defconfig (arm, gcc-10) — PASS, 0 errors, 0 warnings, 0 section mismatches

--------------------------------------------------------------------------------
bcm2835_defconfig (arm, gcc-10) — PASS, 0 errors, 0 warnings, 0 section mismatches

--------------------------------------------------------------------------------
bcm47xx_defconfig (mips, gcc-10) — PASS, 0 errors, 0 warnings, 0 section mismatches

--------------------------------------------------------------------------------
bcm63xx_defconfig (mips, gcc-10) — PASS, 0 errors, 0 warnings, 0 section mismatches

--------------------------------------------------------------------------------
bigsur_defconfig (mips, gcc-10) — PASS, 0 errors, 0 warnings, 0 section mismatches

--------------------------------------------------------------------------------
bmips_be_defconfig (mips, gcc-10) — PASS, 0 errors, 0 warnings, 0 section mismatches

--------------------------------------------------------------------------------
bmips_stb_defconfig (mips, gcc-10) — PASS, 0 errors, 0 warnings, 0 section mismatches

--------------------------------------------------------------------------------
capcella_defconfig (mips, gcc-10) — PASS, 0 errors, 0 warnings, 0 section mismatches

--------------------------------------------------------------------------------
cavium_octeon_defconfig (mips, gcc-10) — PASS, 0 errors, 0 warnings, 0 section mismatches

--------------------------------------------------------------------------------
cerfcube_defconfig (arm, gcc-10) — PASS, 0 errors, 0 warnings, 0 section mismatches

--------------------------------------------------------------------------------
ci20_defconfig (mips, gcc-10) — PASS, 0 errors, 0 warnings, 0 section mismatches

--------------------------------------------------------------------------------
cm_x300_defconfig (arm, gcc-10) — PASS, 0 errors, 0 warnings, 0 section mismatches

--------------------------------------------------------------------------------
cobalt_defconfig (mips, gcc-10) — PASS, 0 errors, 0 warnings, 0 section mismatches

--------------------------------------------------------------------------------
colibri_pxa270_defconfig (arm, gcc-10) — PASS, 0 errors, 0 warnings, 0 section mismatches

--------------------------------------------------------------------------------
colibri_pxa300_defconfig (arm, gcc-10) — PASS, 0 errors, 0 warnings, 0 section mismatches

--------------------------------------------------------------------------------
collie_defconfig (arm, gcc-10) — PASS, 0 errors, 0 warnings, 0 section mismatches

--------------------------------------------------------------------------------
corgi_defconfig (arm, gcc-10) — PASS, 0 errors, 0 warnings, 0 section mismatches

--------------------------------------------------------------------------------
cu1000-neo_defconfig (mips, gcc-10) — PASS, 0 errors, 0 warnings, 0 section mismatches

--------------------------------------------------------------------------------
cu1830-neo_defconfig (mips, gcc-10) — PASS, 0 errors, 0 warnings, 0 section mismatches

--------------------------------------------------------------------------------
davinci_all_defconfig (arm, gcc-10) — PASS, 0 errors, 0 warnings, 0 section mismatches

--------------------------------------------------------------------------------
db1xxx_defconfig (mips, gcc-10) — PASS, 0 errors, 0 warnings, 0 section mismatches

--------------------------------------------------------------------------------
decstation_64_defconfig (mips, gcc-10) — PASS, 0 errors, 1 warning, 0 section mismatches

Warnings:
kernel/rcu/tasks.h:710:13: warning: ‘show_rcu_tasks_rude_gp_kthread’ defined but not used [-Wunused-function]

--------------------------------------------------------------------------------
decstation_defconfig (mips, gcc-10) — PASS, 0 errors, 1 warning, 0 section mismatches

Warnings:
kernel/rcu/tasks.h:710:13: warning: ‘show_rcu_tasks_rude_gp_kthread’ defined but not used [-Wunused-function]

--------------------------------------------------------------------------------
decstation_r4k_defconfig (mips, gcc-10) — PASS, 0 errors, 1 warning, 0 section mismatches

Warnings:
kernel/rcu/tasks.h:710:13: warning: ‘show_rcu_tasks_rude_gp_kthread’ defined but not used [-Wunused-function]

--------------------------------------------------------------------------------
defconfig (arm64, gcc-10) — PASS, 0 errors, 0 warnings, 0 section mismatches

--------------------------------------------------------------------------------
defconfig (riscv, gcc-10) — PASS, 0 errors, 0 warnings, 0 section mismatches

--------------------------------------------------------------------------------
defconfig+arm64-chromebook (arm64, gcc-10) — PASS, 0 errors, 0 warnings, 0 section mismatches

--------------------------------------------------------------------------------
dove_defconfig (arm, gcc-10) — PASS, 0 errors, 0 warnings, 0 section mismatches

--------------------------------------------------------------------------------
e55_defconfig (mips, gcc-10) — PASS, 0 errors, 0 warnings, 0 section mismatches

--------------------------------------------------------------------------------
ebsa110_defconfig (arm, gcc-10) — PASS, 0 errors, 0 warnings, 0 section mismatches

--------------------------------------------------------------------------------
efm32_defconfig (arm, gcc-10) — PASS, 0 errors, 0 warnings, 0 section mismatches

--------------------------------------------------------------------------------
ep93xx_defconfig (arm, gcc-10) — PASS, 0 errors, 0 warnings, 0 section mismatches

--------------------------------------------------------------------------------
eseries_pxa_defconfig (arm, gcc-10) — PASS, 0 errors, 0 warnings, 0 section mismatches

--------------------------------------------------------------------------------
exynos_defconfig (arm, gcc-10) — PASS, 0 errors, 0 warnings, 0 section mismatches

--------------------------------------------------------------------------------
ezx_defconfig (arm, gcc-10) — PASS, 0 errors, 0 warnings, 0 section mismatches

--------------------------------------------------------------------------------
footbridge_defconfig (arm, gcc-10) — PASS, 0 errors, 0 warnings, 0 section mismatches

--------------------------------------------------------------------------------
fuloong2e_defconfig (mips, gcc-10) — PASS, 0 errors, 0 warnings, 0 section mismatches

--------------------------------------------------------------------------------
gcw0_defconfig (mips, gcc-10) — PASS, 0 errors, 0 warnings, 0 section mismatches

--------------------------------------------------------------------------------
gemini_defconfig (arm, gcc-10) — PASS, 0 errors, 0 warnings, 0 section mismatches

--------------------------------------------------------------------------------
gpr_defconfig (mips, gcc-10) — PASS, 0 errors, 0 warnings, 0 section mismatches

--------------------------------------------------------------------------------
h3600_defconfig (arm, gcc-10) — PASS, 0 errors, 0 warnings, 0 section mismatches

--------------------------------------------------------------------------------
h5000_defconfig (arm, gcc-10) — PASS, 0 errors, 0 warnings, 0 section mismatches

--------------------------------------------------------------------------------
hackkit_defconfig (arm, gcc-10) — PASS, 0 errors, 0 warnings, 0 section mismatches

--------------------------------------------------------------------------------
haps_hs_defconfig (arc, gcc-10) — PASS, 0 errors, 0 warnings, 0 section mismatches

--------------------------------------------------------------------------------
haps_hs_smp_defconfig (arc, gcc-10) — PASS, 0 errors, 0 warnings, 0 section mismatches

--------------------------------------------------------------------------------
hisi_defconfig (arm, gcc-10) — PASS, 0 errors, 0 warnings, 0 section mismatches

--------------------------------------------------------------------------------
hsdk_defconfig (arc, gcc-10) — PASS, 0 errors, 0 warnings, 0 section mismatches

--------------------------------------------------------------------------------
i386_defconfig (i386, gcc-10) — PASS, 0 errors, 0 warnings, 0 section mismatches

--------------------------------------------------------------------------------
imote2_defconfig (arm, gcc-10) — PASS, 0 errors, 0 warnings, 0 section mismatches

--------------------------------------------------------------------------------
imx_v4_v5_defconfig (arm, gcc-10) — PASS, 0 errors, 0 warnings, 0 section mismatches

--------------------------------------------------------------------------------
imx_v6_v7_defconfig (arm, gcc-10) — PASS, 0 errors, 0 warnings, 0 section mismatches

--------------------------------------------------------------------------------
integrator_defconfig (arm, gcc-10) — PASS, 0 errors, 0 warnings, 0 section mismatches

--------------------------------------------------------------------------------
iop32x_defconfig (arm, gcc-10) — PASS, 0 errors, 0 warnings, 0 section mismatches

--------------------------------------------------------------------------------
ip22_defconfig (mips, gcc-10) — PASS, 0 errors, 0 warnings, 0 section mismatches

--------------------------------------------------------------------------------
ip27_defconfig (mips, gcc-10) — FAIL, 0 errors, 0 warnings, 0 section mismatches

--------------------------------------------------------------------------------
ip28_defconfig (mips, gcc-10) — FAIL, 0 errors, 0 warnings, 0 section mismatches

--------------------------------------------------------------------------------
ip32_defconfig (mips, gcc-10) — PASS, 0 errors, 0 warnings, 0 section mismatches

--------------------------------------------------------------------------------
ixp4xx_defconfig (arm, gcc-10) — PASS, 0 errors, 0 warnings, 0 section mismatches

Section mismatches:
WARNING: modpost: vmlinux.o(___ksymtab_gpl+ixp4xx_irq_init+0x0): Section mismatch in reference from the variable __ksymtab_ixp4xx_irq_init to the function .init.text:ixp4xx_irq_init()

--------------------------------------------------------------------------------
jazz_defconfig (mips, gcc-10) — PASS, 0 errors, 0 warnings, 0 section mismatches

--------------------------------------------------------------------------------
jmr3927_defconfig (mips, gcc-10) — PASS, 0 errors, 0 warnings, 0 section mismatches

--------------------------------------------------------------------------------
jornada720_defconfig (arm, gcc-10) — PASS, 0 errors, 0 warnings, 0 section mismatches

--------------------------------------------------------------------------------
keystone_defconfig (arm, gcc-10) — PASS, 0 errors, 0 warnings, 0 section mismatches

--------------------------------------------------------------------------------
lart_defconfig (arm, gcc-10) — PASS, 0 errors, 0 warnings, 0 section mismatches

--------------------------------------------------------------------------------
lemote2f_defconfig (mips, gcc-10) — PASS, 0 errors, 1 warning, 0 section mismatches

Warnings:
net/mac80211/mlme.c:4349:1: warning: the frame size of 1040 bytes is larger than 1024 bytes [-Wframe-larger-than=]

--------------------------------------------------------------------------------
loongson1b_defconfig (mips, gcc-10) — PASS, 0 errors, 0 warnings, 0 section mismatches

--------------------------------------------------------------------------------
loongson1c_defconfig (mips, gcc-10) — PASS, 0 errors, 0 warnings, 0 section mismatches

--------------------------------------------------------------------------------
loongson3_defconfig (mips, gcc-10) — PASS, 0 errors, 0 warnings, 0 section mismatches

Section mismatches:
WARNING: modpost: vmlinux.o(___ksymtab+prom_init_numa_memory+0x0): Section mismatch in reference from the variable __ksymtab_prom_init_numa_memory to the function .init.text:prom_init_numa_memory()

--------------------------------------------------------------------------------
lpc18xx_defconfig (arm, gcc-10) — PASS, 0 errors, 0 warnings, 0 section mismatches

--------------------------------------------------------------------------------
lpc32xx_defconfig (arm, gcc-10) — PASS, 0 errors, 0 warnings, 0 section mismatches

--------------------------------------------------------------------------------
lpd270_defconfig (arm, gcc-10) — PASS, 0 errors, 0 warnings, 0 section mismatches

--------------------------------------------------------------------------------
lubbock_defconfig (arm, gcc-10) — PASS, 0 errors, 0 warnings, 0 section mismatches

--------------------------------------------------------------------------------
magician_defconfig (arm, gcc-10) — PASS, 0 errors, 0 warnings, 0 section mismatches

--------------------------------------------------------------------------------
mainstone_defconfig (arm, gcc-10) — PASS, 0 errors, 0 warnings, 0 section mismatches

--------------------------------------------------------------------------------
malta_defconfig (mips, gcc-10) — PASS, 0 errors, 0 warnings, 0 section mismatches

--------------------------------------------------------------------------------
malta_kvm_defconfig (mips, gcc-10) — PASS, 0 errors, 0 warnings, 0 section mismatches

--------------------------------------------------------------------------------
malta_kvm_guest_defconfig (mips, gcc-10) — PASS, 0 errors, 0 warnings, 0 section mismatches

--------------------------------------------------------------------------------
malta_qemu_32r6_defconfig (mips, gcc-10) — PASS, 0 errors, 0 warnings, 0 section mismatches

--------------------------------------------------------------------------------
maltaaprp_defconfig (mips, gcc-10) — PASS, 0 errors, 0 warnings, 0 section mismatches

--------------------------------------------------------------------------------
maltasmvp_defconfig (mips, gcc-10) — PASS, 0 errors, 0 warnings, 0 section mismatches

--------------------------------------------------------------------------------
maltasmvp_eva_defconfig (mips, gcc-10) — PASS, 0 errors, 0 warnings, 0 section mismatches

--------------------------------------------------------------------------------
maltaup_defconfig (mips, gcc-10) — PASS, 0 errors, 0 warnings, 0 section mismatches

--------------------------------------------------------------------------------
maltaup_xpa_defconfig (mips, gcc-10) — PASS, 0 errors, 0 warnings, 0 section mismatches

--------------------------------------------------------------------------------
milbeaut_m10v_defconfig (arm, gcc-10) — PASS, 0 errors, 0 warnings, 0 section mismatches

--------------------------------------------------------------------------------
mini2440_defconfig (arm, gcc-10) — PASS, 0 errors, 0 warnings, 0 section mismatches

--------------------------------------------------------------------------------
mmp2_defconfig (arm, gcc-10) — PASS, 0 errors, 0 warnings, 0 section mismatches

--------------------------------------------------------------------------------
moxart_defconfig (arm, gcc-10) — PASS, 0 errors, 0 warnings, 0 section mismatches

--------------------------------------------------------------------------------
mpc30x_defconfig (mips, gcc-10) — PASS, 0 errors, 0 warnings, 0 section mismatches

--------------------------------------------------------------------------------
mps2_defconfig (arm, gcc-10) — PASS, 0 errors, 0 warnings, 0 section mismatches

--------------------------------------------------------------------------------
mtx1_defconfig (mips, gcc-10) — PASS, 0 errors, 0 warnings, 0 section mismatches

--------------------------------------------------------------------------------
multi_v4t_defconfig (arm, gcc-10) — PASS, 0 errors, 0 warnings, 0 section mismatches

--------------------------------------------------------------------------------
multi_v5_defconfig (arm, gcc-10) — PASS, 0 errors, 0 warnings, 0 section mismatches

--------------------------------------------------------------------------------
multi_v7_defconfig (arm, gcc-10) — PASS, 0 errors, 0 warnings, 0 section mismatches

--------------------------------------------------------------------------------
mvebu_v5_defconfig (arm, gcc-10) — PASS, 0 errors, 0 warnings, 0 section mismatches

--------------------------------------------------------------------------------
mvebu_v7_defconfig (arm, gcc-10) — PASS, 0 errors, 0 warnings, 0 section mismatches

--------------------------------------------------------------------------------
mxs_defconfig (arm, gcc-10) — PASS, 0 errors, 0 warnings, 0 section mismatches

--------------------------------------------------------------------------------
neponset_defconfig (arm, gcc-10) — PASS, 0 errors, 0 warnings, 0 section mismatches

--------------------------------------------------------------------------------
netwinder_defconfig (arm, gcc-10) — PASS, 0 errors, 0 warnings, 0 section mismatches

--------------------------------------------------------------------------------
nhk8815_defconfig (arm, gcc-10) — PASS, 0 errors, 0 warnings, 0 section mismatches

--------------------------------------------------------------------------------
nlm_xlp_defconfig (mips, gcc-10) — PASS, 0 errors, 0 warnings, 0 section mismatches

--------------------------------------------------------------------------------
nlm_xlr_defconfig (mips, gcc-10) — PASS, 0 errors, 0 warnings, 0 section mismatches

--------------------------------------------------------------------------------
nommu_k210_defconfig (riscv, gcc-10) — PASS, 0 errors, 0 warnings, 0 section mismatches

--------------------------------------------------------------------------------
nsimosci_hs_defconfig (arc, gcc-10) — PASS, 0 errors, 0 warnings, 0 section mismatches

--------------------------------------------------------------------------------
nsimosci_hs_smp_defconfig (arc, gcc-10) — PASS, 0 errors, 0 warnings, 0 section mismatches

--------------------------------------------------------------------------------
omap1_defconfig (arm, gcc-10) — PASS, 0 errors, 0 warnings, 0 section mismatches

--------------------------------------------------------------------------------
omap2plus_defconfig (arm, gcc-10) — PASS, 0 errors, 0 warnings, 0 section mismatches

--------------------------------------------------------------------------------
omega2p_defconfig (mips, gcc-10) — PASS, 0 errors, 0 warnings, 0 section mismatches

--------------------------------------------------------------------------------
orion5x_defconfig (arm, gcc-10) — PASS, 0 errors, 0 warnings, 0 section mismatches

--------------------------------------------------------------------------------
oxnas_v6_defconfig (arm, gcc-10) — PASS, 0 errors, 0 warnings, 0 section mismatches

--------------------------------------------------------------------------------
palmz72_defconfig (arm, gcc-10) — PASS, 0 errors, 0 warnings, 0 section mismatches

--------------------------------------------------------------------------------
pcm027_defconfig (arm, gcc-10) — PASS, 0 errors, 0 warnings, 0 section mismatches

--------------------------------------------------------------------------------
pic32mzda_defconfig (mips, gcc-10) — PASS, 0 errors, 0 warnings, 0 section mismatches

--------------------------------------------------------------------------------
pistachio_defconfig (mips, gcc-10) — PASS, 0 errors, 0 warnings, 0 section mismatches

--------------------------------------------------------------------------------
pleb_defconfig (arm, gcc-10) — PASS, 0 errors, 0 warnings, 0 section mismatches

--------------------------------------------------------------------------------
prima2_defconfig (arm, gcc-10) — PASS, 0 errors, 0 warnings, 0 section mismatches

--------------------------------------------------------------------------------
pxa168_defconfig (arm, gcc-10) — PASS, 0 errors, 0 warnings, 0 section mismatches

--------------------------------------------------------------------------------
pxa255-idp_defconfig (arm, gcc-10) — PASS, 0 errors, 0 warnings, 0 section mismatches

--------------------------------------------------------------------------------
pxa3xx_defconfig (arm, gcc-10) — PASS, 0 errors, 0 warnings, 0 section mismatches

--------------------------------------------------------------------------------
pxa910_defconfig (arm, gcc-10) — PASS, 0 errors, 0 warnings, 0 section mismatches

--------------------------------------------------------------------------------
pxa_defconfig (arm, gcc-10) — PASS, 0 errors, 0 warnings, 0 section mismatches

--------------------------------------------------------------------------------
qcom_defconfig (arm, gcc-10) — PASS, 0 errors, 0 warnings, 0 section mismatches

--------------------------------------------------------------------------------
qi_lb60_defconfig (mips, gcc-10) — PASS, 0 errors, 0 warnings, 0 section mismatches

--------------------------------------------------------------------------------
rb532_defconfig (mips, gcc-10) — PASS, 0 errors, 0 warnings, 0 section mismatches

--------------------------------------------------------------------------------
rbtx49xx_defconfig (mips, gcc-10) — PASS, 0 errors, 0 warnings, 0 section mismatches

--------------------------------------------------------------------------------
realview_defconfig (arm, gcc-10) — PASS, 0 errors, 0 warnings, 0 section mismatches

--------------------------------------------------------------------------------
rm200_defconfig (mips, gcc-10) — PASS, 0 errors, 1 warning, 0 section mismatches

Warnings:
drivers/block/paride/bpck.c:32: warning: "PC" redefined

--------------------------------------------------------------------------------
rpc_defconfig (arm, gcc-10) — FAIL, 4 errors, 0 warnings, 0 section mismatches

Errors:
arm-linux-gnueabihf-gcc: error: unrecognized -march target: armv3m
arm-linux-gnueabihf-gcc: error: missing argument to ‘-march=’
arm-linux-gnueabihf-gcc: error: unrecognized -march target: armv3m
arm-linux-gnueabihf-gcc: error: missing argument to ‘-march=’

--------------------------------------------------------------------------------
rs90_defconfig (mips, gcc-10) — PASS, 0 errors, 0 warnings, 0 section mismatches

--------------------------------------------------------------------------------
rt305x_defconfig (mips, gcc-10) — PASS, 0 errors, 0 warnings, 0 section mismatches

--------------------------------------------------------------------------------
rv32_defconfig (riscv, gcc-10) — PASS, 0 errors, 4 warnings, 0 section mismatches

Warnings:
<stdin>:830:2: warning: #warning syscall fstat64 not implemented [-Wcpp]
<stdin>:1127:2: warning: #warning syscall fstatat64 not implemented [-Wcpp]
<stdin>:830:2: warning: #warning syscall fstat64 not implemented [-Wcpp]
<stdin>:1127:2: warning: #warning syscall fstatat64 not implemented [-Wcpp]

--------------------------------------------------------------------------------
s3c2410_defconfig (arm, gcc-10) — PASS, 0 errors, 0 warnings, 0 section mismatches

--------------------------------------------------------------------------------
s3c6400_defconfig (arm, gcc-10) — PASS, 0 errors, 0 warnings, 0 section mismatches

--------------------------------------------------------------------------------
s5pv210_defconfig (arm, gcc-10) — PASS, 0 errors, 0 warnings, 0 section mismatches

--------------------------------------------------------------------------------
sama5_defconfig (arm, gcc-10) — PASS, 0 errors, 0 warnings, 0 section mismatches

--------------------------------------------------------------------------------
sb1250_swarm_defconfig (mips, gcc-10) — PASS, 0 errors, 0 warnings, 0 section mismatches

--------------------------------------------------------------------------------
shannon_defconfig (arm, gcc-10) — PASS, 0 errors, 0 warnings, 0 section mismatches

--------------------------------------------------------------------------------
shmobile_defconfig (arm, gcc-10) — PASS, 0 errors, 0 warnings, 0 section mismatches

--------------------------------------------------------------------------------
simpad_defconfig (arm, gcc-10) — PASS, 0 errors, 0 warnings, 0 section mismatches

--------------------------------------------------------------------------------
socfpga_defconfig (arm, gcc-10) — PASS, 0 errors, 0 warnings, 0 section mismatches

--------------------------------------------------------------------------------
spear13xx_defconfig (arm, gcc-10) — PASS, 0 errors, 0 warnings, 0 section mismatches

--------------------------------------------------------------------------------
spear3xx_defconfig (arm, gcc-10) — PASS, 0 errors, 0 warnings, 0 section mismatches

--------------------------------------------------------------------------------
spear6xx_defconfig (arm, gcc-10) — PASS, 0 errors, 0 warnings, 0 section mismatches

--------------------------------------------------------------------------------
spitz_defconfig (arm, gcc-10) — PASS, 0 errors, 0 warnings, 0 section mismatches

--------------------------------------------------------------------------------
stm32_defconfig (arm, gcc-10) — PASS, 0 errors, 0 warnings, 0 section mismatches

--------------------------------------------------------------------------------
sunxi_defconfig (arm, gcc-10) — PASS, 0 errors, 0 warnings, 0 section mismatches

--------------------------------------------------------------------------------
tango4_defconfig (arm, gcc-10) — PASS, 0 errors, 0 warnings, 0 section mismatches

--------------------------------------------------------------------------------
tb0219_defconfig (mips, gcc-10) — PASS, 0 errors, 0 warnings, 0 section mismatches

--------------------------------------------------------------------------------
tb0226_defconfig (mips, gcc-10) — PASS, 0 errors, 0 warnings, 0 section mismatches

--------------------------------------------------------------------------------
tb0287_defconfig (mips, gcc-10) — PASS, 0 errors, 0 warnings, 0 section mismatches

--------------------------------------------------------------------------------
tct_hammer_defconfig (arm, gcc-10) — PASS, 0 errors, 0 warnings, 0 section mismatches

--------------------------------------------------------------------------------
tegra_defconfig (arm, gcc-10) — PASS, 0 errors, 0 warnings, 0 section mismatches

--------------------------------------------------------------------------------
tinyconfig (i386, gcc-10) — PASS, 0 errors, 0 warnings, 0 section mismatches

--------------------------------------------------------------------------------
tinyconfig (arc, gcc-10) — PASS, 0 errors, 0 warnings, 0 section mismatches

--------------------------------------------------------------------------------
tinyconfig (x86_64, gcc-10) — PASS, 0 errors, 0 warnings, 0 section mismatches

--------------------------------------------------------------------------------
trizeps4_defconfig (arm, gcc-10) — PASS, 0 errors, 0 warnings, 0 section mismatches

--------------------------------------------------------------------------------
u300_defconfig (arm, gcc-10) — PASS, 0 errors, 0 warnings, 0 section mismatches

--------------------------------------------------------------------------------
u8500_defconfig (arm, gcc-10) — PASS, 0 errors, 0 warnings, 0 section mismatches

--------------------------------------------------------------------------------
vdk_hs38_defconfig (arc, gcc-10) — PASS, 0 errors, 0 warnings, 0 section mismatches

--------------------------------------------------------------------------------
vdk_hs38_smp_defconfig (arc, gcc-10) — PASS, 0 errors, 0 warnings, 0 section mismatches

--------------------------------------------------------------------------------
versatile_defconfig (arm, gcc-10) — PASS, 0 errors, 0 warnings, 0 section mismatches

--------------------------------------------------------------------------------
vexpress_defconfig (arm, gcc-10) — PASS, 0 errors, 0 warnings, 0 section mismatches

--------------------------------------------------------------------------------
vf610m4_defconfig (arm, gcc-10) — PASS, 0 errors, 0 warnings, 0 section mismatches

--------------------------------------------------------------------------------
viper_defconfig (arm, gcc-10) — PASS, 0 errors, 0 warnings, 0 section mismatches

--------------------------------------------------------------------------------
vocore2_defconfig (mips, gcc-10) — PASS, 0 errors, 0 warnings, 0 section mismatches

--------------------------------------------------------------------------------
vt8500_v6_v7_defconfig (arm, gcc-10) — PASS, 0 errors, 0 warnings, 0 section mismatches

--------------------------------------------------------------------------------
workpad_defconfig (mips, gcc-10) — PASS, 0 errors, 0 warnings, 0 section mismatches

--------------------------------------------------------------------------------
x86_64_defconfig (x86_64, gcc-10) — PASS, 0 errors, 0 warnings, 0 section mismatches

--------------------------------------------------------------------------------
x86_64_defconfig+x86-chromebook (x86_64, gcc-10) — PASS, 0 errors, 0 warnings, 0 section mismatches

--------------------------------------------------------------------------------
xcep_defconfig (arm, gcc-10) — PASS, 0 errors, 0 warnings, 0 section mismatches

--------------------------------------------------------------------------------
zeus_defconfig (arm, gcc-10) — PASS, 0 errors, 0 warnings, 0 section mismatches

--------------------------------------------------------------------------------
zx_defconfig (arm, gcc-10) — PASS, 0 errors, 0 warnings, 0 section mismatches

---
For more info write to <info@...>


Re: [PATCH v2 5.10.y-cip 00/12] Add thermal driver and watchdog driver enhancements

Nobuhiro Iwamatsu
 

Hi Pavel,

-----Original Message-----
From: Pavel Machek <pavel@...>
Sent: Monday, July 25, 2022 8:41 PM
To: iwamatsu nobuhiro(岩松 信洋 □SWC◯ACT)
<nobuhiro1.iwamatsu@...>
Cc: pavel@...; biju.das.jz@...;
prabhakar.mahadev-lad.rj@...; cip-dev@...
Subject: Re: [PATCH v2 5.10.y-cip 00/12] Add thermal driver and watchdog
driver enhancements

Hi!

Thanks for the series and for the fixes headed for mainline. The
patches look good to me (but I can't test/apply them due to poor
network access at the moment).
Sorry for the late review.
I reviewed this patch series and found no pointout.

I can probably do that on Friday, but I suspect Iwamatsu may be
faster.
Yeah, I will apply this series and push.
I applied the series, tested it, and pushed out the result. Hopefully that is okay.
I was waiting for LAVA to be fixed...
Thanks for pushing to repository.


Thanks for the patches, Biju.

Best regards,
Pavel
Best regards,
Nobuhiro


Re: [PATCH 5.10.y-cip 00/24] RZ/G2L Fixes from mainline

Pavel Machek
 

Hi!

This patch series are backported from Mainline for supporting
future SoCs as well as various bugs and improvements related to
RZ/g2L SMARC EVK Platform.
I made some comments, but nothing serious. I'm currently running
test. If it passes and there are no other comments, I can apply it.

Best regards,
Pavel
--
DENX Software Engineering GmbH, Managing Director: Wolfgang Denk
HRB 165235 Munich, Office: Kirchenstr.5, D-82194 Groebenzell, Germany


Re: [PATCH 5.10.y-cip 01/24] soc: renesas: Consolidate product register handling

Pavel Machek
 

Hi!

From: Geert Uytterhoeven <geert+renesas@...>

commit 05b22caa7490e4f4c94bbde33c61cf72d187b8f7 upstream.

Currently renesas_soc_init() scans the whole device tree up to three
times, to find a device node describing a product register.
Furthermore, the product register handling for the different variants is
very similar, with the major difference being the location of the
product bitfield inside the product register.

Reduce scanning to a single pass using of_find_matching_node_and_match()
instead. Switch to a common handling of product registers, by storing
the intrinsics of each product register type in the data field of the
corresponding match entry.
...

+static const struct of_device_id renesas_ids[] __initconst = {
+ { .compatible = "renesas,bsid", .data = &id_bsid },
+ { .compatible = "renesas,r9a07g044-sysc", .data = &id_rzg2l },
+ { .compatible = "renesas,prr", .data = &id_prr },
+ { /* sentinel */ }
+};
+

match = of_match_node(renesas_socs, of_root);
if (!match)
return -ENODEV;

+ soc_id = strchr(match->compatible, ',') + 1;
soc = match->data;
family = soc->family;
This is quite tricky code. ',' will always be in the compatible with
the current table, but if this ever changes, it will crash. I would
not mind something like.

soc_id = strchr(match->compatible, ',');
if (!soc_id)
return -EIO;
soc_id++;

Best regards,
Pavel
--
DENX Software Engineering GmbH, Managing Director: Wolfgang Denk
HRB 165235 Munich, Office: Kirchenstr.5, D-82194 Groebenzell, Germany


Re: [PATCH 5.10.y-cip 16/24] ASoC: sh: rz-ssi: Release the DMA channels in rz_ssi_probe() error path

Pavel Machek
 

Hi!

From: Lad Prabhakar <prabhakar.mahadev-lad.rj@...>

commit 767e6f26204d3f5406630e86b720d01818b8616d upstream.

DMA channels requested by rz_ssi_dma_request() in rz_ssi_probe() were
never released in the error path apart from one place. This patch fixes
this issue by calling rz_ssi_release_dma_channels() in the error
path.
I believe this is correct, but...
+++ b/sound/soc/sh/rz-ssi.c
@@ -976,14 +976,18 @@ static int rz_ssi_probe(struct platform_device *pdev)
- if (ssi->irq_int < 0)
+ if (ssi->irq_int < 0) {
+ rz_ssi_release_dma_channels(ssi);
return ssi->irq_int;
+ }
+ if (ret < 0) {
+ rz_ssi_release_dma_channels(ssi);
return dev_err_probe(&pdev->dev, ret,
"irq request error (int_req)\n");
+ }
ssi->rstc = devm_reset_control_get_exclusive(&pdev->dev, NULL);
- if (IS_ERR(ssi->rstc))
+ if (IS_ERR(ssi->rstc)) {
+ rz_ssi_release_dma_channels(ssi);
return PTR_ERR(ssi->rstc);
+ }
I believe we have enough cases to use "goto cleanup" style to reduce
code duplication.

if (ret < 0) {
+ rz_ssi_release_dma_channels(ssi);
pm_runtime_disable(ssi->dev);
reset_control_assert(ssi->rstc);
return dev_err_probe(ssi->dev, ret,
"pm_runtime_resume_and_get failed\n");
Plus, we usually do cleanup in reverse order of init.

Best regards,
Pavel
--
DENX Software Engineering GmbH, Managing Director: Wolfgang Denk
HRB 165235 Munich, Office: Kirchenstr.5, D-82194 Groebenzell, Germany


Re: [PATCH 5.10.y-cip 24/24] arm64: dts: renesas: rzg2l-smarc: Move pinctrl definitions

Pavel Machek
 

Hi!

RZ/G2L and RZ/G2LC SMARC EVK use the same carrier board, but the pin
mappings between the RZ/G2L and the RZ/G2LC SMARC SoM are different.
Therefore we need to update the carrier board pin definitions based
on the corresponding SoM pin mapping.

Move pinctrl definitions out of the RZ/G2L SMARC common file, so that
we can reuse the common file to support RZ/G2LC SMARC EVK.
...

This really needs subsequent patches to be useful; plus, git complains
about blank line at EOF. Anyway, I believe we can still take it.

diff --git a/arch/arm64/boot/dts/renesas/rzg2l-smarc-pinfunction.dtsi b/arch/arm64/boot/dts/renesas/rzg2l-smarc-pinfunction.dtsi
new file mode 100644
index 000000000000..71d83e447670
--- /dev/null
+++ b/arch/arm64/boot/dts/renesas/rzg2l-smarc-pinfunction.dtsi
+ };
+};
+
Best regards,
Pavel
--
DENX Software Engineering GmbH, Managing Director: Wolfgang Denk
HRB 165235 Munich, Office: Kirchenstr.5, D-82194 Groebenzell, Germany


cip-gitlab/ci/pavel/linux-test build: 189 builds: 164 failed, 25 passed, 167 errors, 186 warnings (v4.4-st5-511-gca6ad42603895) #kernelci

kernelci.org bot <bot@...>
 

cip-gitlab/ci/pavel/linux-test build: 189 builds: 164 failed, 25 passed, 167 errors, 186 warnings (v4.4-st5-511-gca6ad42603895)

Full Build Summary: https://kernelci.org/build/cip-gitlab/branch/ci%2Fpavel%2Flinux-test/kernel/v4.4-st5-511-gca6ad42603895/

Tree: cip-gitlab
Branch: ci/pavel/linux-test
Git Describe: v4.4-st5-511-gca6ad42603895
Git Commit: ca6ad426038959bca25df3a9f34e4dc7f5234b9c
Git URL: https://gitlab.com/cip-project/cip-kernel/linux-cip.git
Built: 6 unique architectures

Build Failures Detected:

arc:
axs103_defconfig: (gcc-10) FAIL
axs103_smp_defconfig: (gcc-10) FAIL
nsim_hs_defconfig: (gcc-10) FAIL
nsim_hs_smp_defconfig: (gcc-10) FAIL
nsimosci_hs_defconfig: (gcc-10) FAIL
nsimosci_hs_smp_defconfig: (gcc-10) FAIL
vdk_hs38_defconfig: (gcc-10) FAIL
vdk_hs38_smp_defconfig: (gcc-10) FAIL

arm64:
defconfig: (gcc-10) FAIL
defconfig+arm64-chromebook: (gcc-10) FAIL

arm:
acs5k_defconfig: (gcc-10) FAIL
acs5k_tiny_defconfig: (gcc-10) FAIL
am200epdkit_defconfig: (gcc-10) FAIL
assabet_defconfig: (gcc-10) FAIL
at91_dt_defconfig: (gcc-10) FAIL
axm55xx_defconfig: (gcc-10) FAIL
badge4_defconfig: (gcc-10) FAIL
bcm2835_defconfig: (gcc-10) FAIL
bcm_defconfig: (gcc-10) FAIL
cerfcube_defconfig: (gcc-10) FAIL
clps711x_defconfig: (gcc-10) FAIL
cm_x2xx_defconfig: (gcc-10) FAIL
cm_x300_defconfig: (gcc-10) FAIL
colibri_pxa270_defconfig: (gcc-10) FAIL
colibri_pxa300_defconfig: (gcc-10) FAIL
collie_defconfig: (gcc-10) FAIL
corgi_defconfig: (gcc-10) FAIL
davinci_all_defconfig: (gcc-10) FAIL
dove_defconfig: (gcc-10) FAIL
ebsa110_defconfig: (gcc-10) FAIL
efm32_defconfig: (gcc-10) FAIL
em_x270_defconfig: (gcc-10) FAIL
ep93xx_defconfig: (gcc-10) FAIL
eseries_pxa_defconfig: (gcc-10) FAIL
exynos_defconfig: (gcc-10) FAIL
ezx_defconfig: (gcc-10) FAIL
footbridge_defconfig: (gcc-10) FAIL
h3600_defconfig: (gcc-10) FAIL
h5000_defconfig: (gcc-10) FAIL
hackkit_defconfig: (gcc-10) FAIL
hisi_defconfig: (gcc-10) FAIL
imote2_defconfig: (gcc-10) FAIL
imx_v4_v5_defconfig: (gcc-10) FAIL
imx_v6_v7_defconfig: (gcc-10) FAIL
integrator_defconfig: (gcc-10) FAIL
iop13xx_defconfig: (gcc-10) FAIL
iop32x_defconfig: (gcc-10) FAIL
iop33x_defconfig: (gcc-10) FAIL
ixp4xx_defconfig: (gcc-10) FAIL
jornada720_defconfig: (gcc-10) FAIL
keystone_defconfig: (gcc-10) FAIL
ks8695_defconfig: (gcc-10) FAIL
lart_defconfig: (gcc-10) FAIL
lpc18xx_defconfig: (gcc-10) FAIL
lpc32xx_defconfig: (gcc-10) FAIL
lpd270_defconfig: (gcc-10) FAIL
lubbock_defconfig: (gcc-10) FAIL
magician_defconfig: (gcc-10) FAIL
mainstone_defconfig: (gcc-10) FAIL
mini2440_defconfig: (gcc-10) FAIL
mmp2_defconfig: (gcc-10) FAIL
moxart_defconfig: (gcc-10) FAIL
multi_v5_defconfig: (gcc-10) FAIL
multi_v7_defconfig: (gcc-10) FAIL
mv78xx0_defconfig: (gcc-10) FAIL
mvebu_v5_defconfig: (gcc-10) FAIL
mvebu_v7_defconfig: (gcc-10) FAIL
mxs_defconfig: (gcc-10) FAIL
neponset_defconfig: (gcc-10) FAIL
netwinder_defconfig: (gcc-10) FAIL
netx_defconfig: (gcc-10) FAIL
nhk8815_defconfig: (gcc-10) FAIL
omap1_defconfig: (gcc-10) FAIL
omap2plus_defconfig: (gcc-10) FAIL
orion5x_defconfig: (gcc-10) FAIL
palmz72_defconfig: (gcc-10) FAIL
pcm027_defconfig: (gcc-10) FAIL
pleb_defconfig: (gcc-10) FAIL
pxa168_defconfig: (gcc-10) FAIL
pxa255-idp_defconfig: (gcc-10) FAIL
pxa3xx_defconfig: (gcc-10) FAIL
pxa910_defconfig: (gcc-10) FAIL
qcom_defconfig: (gcc-10) FAIL
raumfeld_defconfig: (gcc-10) FAIL
realview-smp_defconfig: (gcc-10) FAIL
realview_defconfig: (gcc-10) FAIL
rpc_defconfig: (gcc-10) FAIL
s3c2410_defconfig: (gcc-10) FAIL
sama5_defconfig: (gcc-10) FAIL
shannon_defconfig: (gcc-10) FAIL
shmobile_defconfig: (gcc-10) FAIL
simpad_defconfig: (gcc-10) FAIL
socfpga_defconfig: (gcc-10) FAIL
spear13xx_defconfig: (gcc-10) FAIL
spitz_defconfig: (gcc-10) FAIL
sunxi_defconfig: (gcc-10) FAIL
tegra_defconfig: (gcc-10) FAIL
trizeps4_defconfig: (gcc-10) FAIL
u8500_defconfig: (gcc-10) FAIL
versatile_defconfig: (gcc-10) FAIL
vexpress_defconfig: (gcc-10) FAIL
viper_defconfig: (gcc-10) FAIL
vt8500_v6_v7_defconfig: (gcc-10) FAIL
xcep_defconfig: (gcc-10) FAIL
zeus_defconfig: (gcc-10) FAIL

i386:
i386_defconfig: (gcc-10) FAIL

mips:
ar7_defconfig: (gcc-10) FAIL
ath79_defconfig: (gcc-10) FAIL
bcm47xx_defconfig: (gcc-10) FAIL
bcm63xx_defconfig: (gcc-10) FAIL
bigsur_defconfig: (gcc-10) FAIL
bmips_be_defconfig: (gcc-10) FAIL
bmips_stb_defconfig: (gcc-10) FAIL
capcella_defconfig: (gcc-10) FAIL
cavium_octeon_defconfig: (gcc-10) FAIL
ci20_defconfig: (gcc-10) FAIL
cobalt_defconfig: (gcc-10) FAIL
db1xxx_defconfig: (gcc-10) FAIL
decstation_defconfig: (gcc-10) FAIL
fuloong2e_defconfig: (gcc-10) FAIL
gpr_defconfig: (gcc-10) FAIL
ip22_defconfig: (gcc-10) FAIL
ip27_defconfig: (gcc-10) FAIL
ip28_defconfig: (gcc-10) FAIL
ip32_defconfig: (gcc-10) FAIL
jazz_defconfig: (gcc-10) FAIL
jmr3927_defconfig: (gcc-10) FAIL
lasat_defconfig: (gcc-10) FAIL
lemote2f_defconfig: (gcc-10) FAIL
loongson3_defconfig: (gcc-10) FAIL
ls1b_defconfig: (gcc-10) FAIL
malta_defconfig: (gcc-10) FAIL
malta_kvm_defconfig: (gcc-10) FAIL
malta_kvm_guest_defconfig: (gcc-10) FAIL
malta_qemu_32r6_defconfig: (gcc-10) FAIL
maltaaprp_defconfig: (gcc-10) FAIL
maltasmvp_defconfig: (gcc-10) FAIL
maltasmvp_eva_defconfig: (gcc-10) FAIL
maltaup_defconfig: (gcc-10) FAIL
maltaup_xpa_defconfig: (gcc-10) FAIL
markeins_defconfig: (gcc-10) FAIL
mips_paravirt_defconfig: (gcc-10) FAIL
mpc30x_defconfig: (gcc-10) FAIL
msp71xx_defconfig: (gcc-10) FAIL
mtx1_defconfig: (gcc-10) FAIL
nlm_xlp_defconfig: (gcc-10) FAIL
nlm_xlr_defconfig: (gcc-10) FAIL
pistachio_defconfig: (gcc-10) FAIL
pnx8335_stb225_defconfig: (gcc-10) FAIL
qi_lb60_defconfig: (gcc-10) FAIL
rb532_defconfig: (gcc-10) FAIL
rbtx49xx_defconfig: (gcc-10) FAIL
rm200_defconfig: (gcc-10) FAIL
rt305x_defconfig: (gcc-10) FAIL
sb1250_swarm_defconfig: (gcc-10) FAIL
sead3_defconfig: (gcc-10) FAIL
sead3micro_defconfig: (gcc-10) FAIL
tb0219_defconfig: (gcc-10) FAIL
tb0226_defconfig: (gcc-10) FAIL
tb0287_defconfig: (gcc-10) FAIL
workpad_defconfig: (gcc-10) FAIL
xway_defconfig: (gcc-10) FAIL

x86_64:
x86_64_defconfig: (gcc-10) FAIL
x86_64_defconfig+x86-chromebook: (gcc-10) FAIL

Errors and Warnings Detected:

arc:
axs103_defconfig (gcc-10): 1 error, 1 warning
axs103_smp_defconfig (gcc-10): 1 error, 1 warning
nsim_hs_defconfig (gcc-10): 1 error, 1 warning
nsim_hs_smp_defconfig (gcc-10): 1 error, 1 warning
nsimosci_hs_defconfig (gcc-10): 1 error, 1 warning
nsimosci_hs_smp_defconfig (gcc-10): 1 error, 1 warning
vdk_hs38_defconfig (gcc-10): 1 error, 1 warning
vdk_hs38_smp_defconfig (gcc-10): 1 error, 1 warning

arm64:
defconfig (gcc-10): 1 error, 2 warnings
defconfig+arm64-chromebook (gcc-10): 1 error, 2 warnings

arm:
acs5k_defconfig (gcc-10): 1 error, 1 warning
acs5k_tiny_defconfig (gcc-10): 1 error, 1 warning
am200epdkit_defconfig (gcc-10): 1 error, 1 warning
assabet_defconfig (gcc-10): 1 error, 1 warning
at91_dt_defconfig (gcc-10): 1 error, 1 warning
axm55xx_defconfig (gcc-10): 1 error, 1 warning
badge4_defconfig (gcc-10): 1 error, 1 warning
bcm2835_defconfig (gcc-10): 1 error, 1 warning
bcm_defconfig (gcc-10): 1 error, 1 warning
cerfcube_defconfig (gcc-10): 1 error, 1 warning
clps711x_defconfig (gcc-10): 1 error, 2 warnings
cm_x2xx_defconfig (gcc-10): 1 error, 1 warning
cm_x300_defconfig (gcc-10): 1 error, 1 warning
colibri_pxa270_defconfig (gcc-10): 1 error, 1 warning
colibri_pxa300_defconfig (gcc-10): 1 error, 1 warning
collie_defconfig (gcc-10): 1 error, 1 warning
corgi_defconfig (gcc-10): 1 error, 1 warning
davinci_all_defconfig (gcc-10): 1 error, 2 warnings
dove_defconfig (gcc-10): 1 error, 1 warning
ebsa110_defconfig (gcc-10): 1 error, 1 warning
efm32_defconfig (gcc-10): 1 error, 1 warning
em_x270_defconfig (gcc-10): 1 error, 1 warning
ep93xx_defconfig (gcc-10): 1 error, 1 warning
eseries_pxa_defconfig (gcc-10): 1 error, 1 warning
exynos_defconfig (gcc-10): 1 error, 1 warning
ezx_defconfig (gcc-10): 1 error, 1 warning
footbridge_defconfig (gcc-10): 1 error, 1 warning
h3600_defconfig (gcc-10): 1 error, 1 warning
h5000_defconfig (gcc-10): 1 error, 1 warning
hackkit_defconfig (gcc-10): 1 error, 1 warning
hisi_defconfig (gcc-10): 1 error, 1 warning
imote2_defconfig (gcc-10): 1 error, 1 warning
imx_v4_v5_defconfig (gcc-10): 1 error, 1 warning
imx_v6_v7_defconfig (gcc-10): 1 error, 1 warning
integrator_defconfig (gcc-10): 1 error, 1 warning
iop13xx_defconfig (gcc-10): 1 error, 1 warning
iop32x_defconfig (gcc-10): 1 error, 1 warning
iop33x_defconfig (gcc-10): 1 error, 1 warning
ixp4xx_defconfig (gcc-10): 1 error, 1 warning
jornada720_defconfig (gcc-10): 1 error, 1 warning
keystone_defconfig (gcc-10): 1 error, 1 warning
ks8695_defconfig (gcc-10): 1 error, 1 warning
lart_defconfig (gcc-10): 1 error, 1 warning
lpc18xx_defconfig (gcc-10): 1 error, 1 warning
lpc32xx_defconfig (gcc-10): 1 error, 2 warnings
lpd270_defconfig (gcc-10): 1 error, 1 warning
lubbock_defconfig (gcc-10): 1 error, 1 warning
magician_defconfig (gcc-10): 1 error, 1 warning
mainstone_defconfig (gcc-10): 1 error, 1 warning
mini2440_defconfig (gcc-10): 1 error, 2 warnings
mmp2_defconfig (gcc-10): 1 error, 1 warning
moxart_defconfig (gcc-10): 1 error, 1 warning
multi_v5_defconfig (gcc-10): 1 error, 1 warning
multi_v7_defconfig (gcc-10): 1 error, 1 warning
mv78xx0_defconfig (gcc-10): 1 error, 1 warning
mvebu_v5_defconfig (gcc-10): 1 error, 1 warning
mvebu_v7_defconfig (gcc-10): 1 error, 1 warning
mxs_defconfig (gcc-10): 1 error, 2 warnings
neponset_defconfig (gcc-10): 1 error, 1 warning
netwinder_defconfig (gcc-10): 1 error, 1 warning
netx_defconfig (gcc-10): 1 error, 1 warning
nhk8815_defconfig (gcc-10): 1 error, 1 warning
omap1_defconfig (gcc-10): 1 error, 2 warnings
omap2plus_defconfig (gcc-10): 1 error, 1 warning
orion5x_defconfig (gcc-10): 1 error, 1 warning
palmz72_defconfig (gcc-10): 1 error, 1 warning
pcm027_defconfig (gcc-10): 1 error, 1 warning
pleb_defconfig (gcc-10): 1 error, 1 warning
pxa168_defconfig (gcc-10): 1 error, 1 warning
pxa255-idp_defconfig (gcc-10): 1 error, 1 warning
pxa3xx_defconfig (gcc-10): 1 error, 1 warning
pxa910_defconfig (gcc-10): 1 error, 1 warning
qcom_defconfig (gcc-10): 1 error, 1 warning
raumfeld_defconfig (gcc-10): 1 error, 1 warning
realview-smp_defconfig (gcc-10): 1 error, 1 warning
realview_defconfig (gcc-10): 1 error, 1 warning
rpc_defconfig (gcc-10): 4 errors
s3c2410_defconfig (gcc-10): 1 error, 2 warnings
s3c6400_defconfig (gcc-10): 2 warnings
sama5_defconfig (gcc-10): 1 error, 1 warning
shannon_defconfig (gcc-10): 1 error, 1 warning
shmobile_defconfig (gcc-10): 1 error, 1 warning
simpad_defconfig (gcc-10): 1 error, 1 warning
socfpga_defconfig (gcc-10): 1 error, 1 warning
spear13xx_defconfig (gcc-10): 1 error, 1 warning
spitz_defconfig (gcc-10): 1 error, 1 warning
sunxi_defconfig (gcc-10): 1 error, 1 warning
tegra_defconfig (gcc-10): 1 error, 1 warning
trizeps4_defconfig (gcc-10): 1 error, 1 warning
u8500_defconfig (gcc-10): 1 error, 1 warning
versatile_defconfig (gcc-10): 1 error, 1 warning
vexpress_defconfig (gcc-10): 1 error, 1 warning
viper_defconfig (gcc-10): 1 error, 1 warning
vt8500_v6_v7_defconfig (gcc-10): 1 error, 1 warning
xcep_defconfig (gcc-10): 1 error, 1 warning
zeus_defconfig (gcc-10): 1 error, 1 warning

i386:
i386_defconfig (gcc-10): 1 error, 1 warning

mips:
ar7_defconfig (gcc-10): 1 error, 1 warning
ath79_defconfig (gcc-10): 1 error, 1 warning
bcm47xx_defconfig (gcc-10): 1 error, 1 warning
bcm63xx_defconfig (gcc-10): 1 error, 1 warning
bigsur_defconfig (gcc-10): 1 error, 1 warning
bmips_be_defconfig (gcc-10): 1 error, 1 warning
bmips_stb_defconfig (gcc-10): 1 error, 1 warning
capcella_defconfig (gcc-10): 1 error, 1 warning
cavium_octeon_defconfig (gcc-10): 1 error, 1 warning
ci20_defconfig (gcc-10): 1 error, 1 warning
cobalt_defconfig (gcc-10): 1 error, 1 warning
db1xxx_defconfig (gcc-10): 1 error, 1 warning
decstation_defconfig (gcc-10): 1 error, 1 warning
fuloong2e_defconfig (gcc-10): 2 errors
gpr_defconfig (gcc-10): 1 error, 1 warning
ip22_defconfig (gcc-10): 1 error, 2 warnings
ip32_defconfig (gcc-10): 1 error, 1 warning
jazz_defconfig (gcc-10): 1 error, 1 warning
jmr3927_defconfig (gcc-10): 1 error, 1 warning
lasat_defconfig (gcc-10): 1 error, 1 warning
lemote2f_defconfig (gcc-10): 2 errors
loongson3_defconfig (gcc-10): 1 error, 1 warning
ls1b_defconfig (gcc-10): 1 error, 1 warning
malta_defconfig (gcc-10): 1 error, 1 warning
malta_kvm_defconfig (gcc-10): 1 error, 1 warning
malta_kvm_guest_defconfig (gcc-10): 1 error, 1 warning
malta_qemu_32r6_defconfig (gcc-10): 1 error, 1 warning
maltaaprp_defconfig (gcc-10): 1 error, 1 warning
maltasmvp_defconfig (gcc-10): 1 error, 1 warning
maltasmvp_eva_defconfig (gcc-10): 1 error, 1 warning
maltaup_defconfig (gcc-10): 1 error, 1 warning
maltaup_xpa_defconfig (gcc-10): 1 error, 1 warning
markeins_defconfig (gcc-10): 1 error, 1 warning
mips_paravirt_defconfig (gcc-10): 1 error, 1 warning
mpc30x_defconfig (gcc-10): 1 error, 1 warning
msp71xx_defconfig (gcc-10): 1 error, 1 warning
mtx1_defconfig (gcc-10): 1 error, 1 warning
nlm_xlp_defconfig (gcc-10): 1 error, 1 warning
nlm_xlr_defconfig (gcc-10): 1 error, 1 warning
pistachio_defconfig (gcc-10): 1 error, 1 warning
pnx8335_stb225_defconfig (gcc-10): 1 error, 1 warning
qi_lb60_defconfig (gcc-10): 1 error, 1 warning
rb532_defconfig (gcc-10): 1 error, 1 warning
rbtx49xx_defconfig (gcc-10): 1 error, 1 warning
rm200_defconfig (gcc-10): 1 error, 1 warning
rt305x_defconfig (gcc-10): 1 error, 1 warning
sb1250_swarm_defconfig (gcc-10): 1 error, 1 warning
sead3_defconfig (gcc-10): 1 error, 1 warning
sead3micro_defconfig (gcc-10): 1 error, 1 warning
tb0219_defconfig (gcc-10): 1 error, 1 warning
tb0226_defconfig (gcc-10): 1 error, 1 warning
tb0287_defconfig (gcc-10): 1 error, 1 warning
workpad_defconfig (gcc-10): 1 error, 1 warning
xway_defconfig (gcc-10): 1 error, 1 warning

x86_64:
allnoconfig (gcc-10): 4 warnings
tinyconfig (gcc-10): 3 warnings
x86_64_defconfig (gcc-10): 1 error, 5 warnings
x86_64_defconfig+x86-chromebook (gcc-10): 1 error, 5 warnings

Errors summary:

151 net/ipv4/inet_hashtables.c:669:12: error: ‘tcp_hashinfo’ undeclared (first use in this function); did you mean ‘raw_hashinfo’?
8 net/ipv4/inet_hashtables.c:669:12: error: 'tcp_hashinfo' undeclared (first use in this function); did you mean 'raw_hashinfo'?
4 cc1: error: ‘-mloongson-mmi’ must be used with ‘-mhard-float’
2 arm-linux-gnueabihf-gcc: error: unrecognized -march target: armv3
2 arm-linux-gnueabihf-gcc: error: missing argument to ‘-march=’

Warnings summary:

151 net/ipv4/inet_hashtables.c:608:68: warning: suggest parentheses around ‘+’ in operand of ‘&’ [-Wparentheses]
8 net/ipv4/inet_hashtables.c:608:68: warning: suggest parentheses around '+' in operand of '&' [-Wparentheses]
7 arch/x86/kernel/process.c:456: Warning: no instruction mnemonic suffix given and no register operands; using default for `btr'
4 arch/x86/entry/entry_64.S:487: Warning: no instruction mnemonic suffix given and no register operands; using default for `btr'
4 arch/x86/entry/entry_64.S:1642: Warning: no instruction mnemonic suffix given and no register operands; using default for `sysret'
3 drivers/tty/serial/samsung.c:1777:34: warning: array ‘s3c24xx_uart_dt_match’ assumed to have one element
2 drivers/net/ethernet/apm/xgene/xgene_enet_main.c:32:36: warning: array ‘xgene_enet_acpi_match’ assumed to have one element
1 drivers/net/ethernet/seeq/sgiseeq.c:804:26: warning: passing argument 5 of ‘dma_free_attrs’ makes pointer from integer without a cast [-Wint-conversion]
1 drivers/mmc/host/sdhci-s3c.c:429:34: warning: array ‘sdhci_s3c_dt_match’ assumed to have one element
1 drivers/gpio/gpio-omap.c:1161:34: warning: array ‘omap_gpio_match’ assumed to have one element
1 arch/arm/mach-mxs/mach-mxs.c:285:26: warning: duplicate ‘const’ declaration specifier [-Wduplicate-decl-specifier]
1 arch/arm/mach-lpc32xx/phy3250.c:215:36: warning: duplicate ‘const’ declaration specifier [-Wduplicate-decl-specifier]
1 arch/arm/mach-davinci/da8xx-dt.c:23:34: warning: duplicate ‘const’ declaration specifier [-Wduplicate-decl-specifier]
1 arch/arm/mach-clps711x/board-autcpu12.c:163:26: warning: duplicate ‘const’ declaration specifier [-Wduplicate-decl-specifier]

================================================================================

Detailed per-defconfig build reports:

--------------------------------------------------------------------------------
acs5k_defconfig (arm, gcc-10) — FAIL, 1 error, 1 warning, 0 section mismatches

Errors:
net/ipv4/inet_hashtables.c:669:12: error: ‘tcp_hashinfo’ undeclared (first use in this function); did you mean ‘raw_hashinfo’?

Warnings:
net/ipv4/inet_hashtables.c:608:68: warning: suggest parentheses around ‘+’ in operand of ‘&’ [-Wparentheses]

--------------------------------------------------------------------------------
acs5k_tiny_defconfig (arm, gcc-10) — FAIL, 1 error, 1 warning, 0 section mismatches

Errors:
net/ipv4/inet_hashtables.c:669:12: error: ‘tcp_hashinfo’ undeclared (first use in this function); did you mean ‘raw_hashinfo’?

Warnings:
net/ipv4/inet_hashtables.c:608:68: warning: suggest parentheses around ‘+’ in operand of ‘&’ [-Wparentheses]

--------------------------------------------------------------------------------
allnoconfig (x86_64, gcc-10) — PASS, 0 errors, 4 warnings, 0 section mismatches

Warnings:
arch/x86/entry/entry_64.S:487: Warning: no instruction mnemonic suffix given and no register operands; using default for `btr'
arch/x86/entry/entry_64.S:1642: Warning: no instruction mnemonic suffix given and no register operands; using default for `sysret'
arch/x86/kernel/process.c:456: Warning: no instruction mnemonic suffix given and no register operands; using default for `btr'
arch/x86/kernel/process.c:456: Warning: no instruction mnemonic suffix given and no register operands; using default for `btr'

--------------------------------------------------------------------------------
allnoconfig (mips, gcc-10) — PASS, 0 errors, 0 warnings, 0 section mismatches

--------------------------------------------------------------------------------
allnoconfig (arc, gcc-10) — PASS, 0 errors, 0 warnings, 0 section mismatches

--------------------------------------------------------------------------------
allnoconfig (i386, gcc-10) — PASS, 0 errors, 0 warnings, 0 section mismatches

--------------------------------------------------------------------------------
allnoconfig (arm, gcc-10) — PASS, 0 errors, 0 warnings, 0 section mismatches

--------------------------------------------------------------------------------
am200epdkit_defconfig (arm, gcc-10) — FAIL, 1 error, 1 warning, 0 section mismatches

Errors:
net/ipv4/inet_hashtables.c:669:12: error: ‘tcp_hashinfo’ undeclared (first use in this function); did you mean ‘raw_hashinfo’?

Warnings:
net/ipv4/inet_hashtables.c:608:68: warning: suggest parentheses around ‘+’ in operand of ‘&’ [-Wparentheses]

--------------------------------------------------------------------------------
ar7_defconfig (mips, gcc-10) — FAIL, 1 error, 1 warning, 0 section mismatches

Errors:
net/ipv4/inet_hashtables.c:669:12: error: ‘tcp_hashinfo’ undeclared (first use in this function); did you mean ‘raw_hashinfo’?

Warnings:
net/ipv4/inet_hashtables.c:608:68: warning: suggest parentheses around ‘+’ in operand of ‘&’ [-Wparentheses]

--------------------------------------------------------------------------------
assabet_defconfig (arm, gcc-10) — FAIL, 1 error, 1 warning, 0 section mismatches

Errors:
net/ipv4/inet_hashtables.c:669:12: error: ‘tcp_hashinfo’ undeclared (first use in this function); did you mean ‘raw_hashinfo’?

Warnings:
net/ipv4/inet_hashtables.c:608:68: warning: suggest parentheses around ‘+’ in operand of ‘&’ [-Wparentheses]

--------------------------------------------------------------------------------
at91_dt_defconfig (arm, gcc-10) — FAIL, 1 error, 1 warning, 0 section mismatches

Errors:
net/ipv4/inet_hashtables.c:669:12: error: ‘tcp_hashinfo’ undeclared (first use in this function); did you mean ‘raw_hashinfo’?

Warnings:
net/ipv4/inet_hashtables.c:608:68: warning: suggest parentheses around ‘+’ in operand of ‘&’ [-Wparentheses]

--------------------------------------------------------------------------------
ath79_defconfig (mips, gcc-10) — FAIL, 1 error, 1 warning, 0 section mismatches

Errors:
net/ipv4/inet_hashtables.c:669:12: error: ‘tcp_hashinfo’ undeclared (first use in this function); did you mean ‘raw_hashinfo’?

Warnings:
net/ipv4/inet_hashtables.c:608:68: warning: suggest parentheses around ‘+’ in operand of ‘&’ [-Wparentheses]

--------------------------------------------------------------------------------
axm55xx_defconfig (arm, gcc-10) — FAIL, 1 error, 1 warning, 0 section mismatches

Errors:
net/ipv4/inet_hashtables.c:669:12: error: ‘tcp_hashinfo’ undeclared (first use in this function); did you mean ‘raw_hashinfo’?

Warnings:
net/ipv4/inet_hashtables.c:608:68: warning: suggest parentheses around ‘+’ in operand of ‘&’ [-Wparentheses]

--------------------------------------------------------------------------------
axs103_defconfig (arc, gcc-10) — FAIL, 1 error, 1 warning, 0 section mismatches

Errors:
net/ipv4/inet_hashtables.c:669:12: error: 'tcp_hashinfo' undeclared (first use in this function); did you mean 'raw_hashinfo'?

Warnings:
net/ipv4/inet_hashtables.c:608:68: warning: suggest parentheses around '+' in operand of '&' [-Wparentheses]

--------------------------------------------------------------------------------
axs103_smp_defconfig (arc, gcc-10) — FAIL, 1 error, 1 warning, 0 section mismatches

Errors:
net/ipv4/inet_hashtables.c:669:12: error: 'tcp_hashinfo' undeclared (first use in this function); did you mean 'raw_hashinfo'?

Warnings:
net/ipv4/inet_hashtables.c:608:68: warning: suggest parentheses around '+' in operand of '&' [-Wparentheses]

--------------------------------------------------------------------------------
badge4_defconfig (arm, gcc-10) — FAIL, 1 error, 1 warning, 0 section mismatches

Errors:
net/ipv4/inet_hashtables.c:669:12: error: ‘tcp_hashinfo’ undeclared (first use in this function); did you mean ‘raw_hashinfo’?

Warnings:
net/ipv4/inet_hashtables.c:608:68: warning: suggest parentheses around ‘+’ in operand of ‘&’ [-Wparentheses]

--------------------------------------------------------------------------------
bcm2835_defconfig (arm, gcc-10) — FAIL, 1 error, 1 warning, 0 section mismatches

Errors:
net/ipv4/inet_hashtables.c:669:12: error: ‘tcp_hashinfo’ undeclared (first use in this function); did you mean ‘raw_hashinfo’?

Warnings:
net/ipv4/inet_hashtables.c:608:68: warning: suggest parentheses around ‘+’ in operand of ‘&’ [-Wparentheses]

--------------------------------------------------------------------------------
bcm47xx_defconfig (mips, gcc-10) — FAIL, 1 error, 1 warning, 0 section mismatches

Errors:
net/ipv4/inet_hashtables.c:669:12: error: ‘tcp_hashinfo’ undeclared (first use in this function); did you mean ‘raw_hashinfo’?

Warnings:
net/ipv4/inet_hashtables.c:608:68: warning: suggest parentheses around ‘+’ in operand of ‘&’ [-Wparentheses]

--------------------------------------------------------------------------------
bcm63xx_defconfig (mips, gcc-10) — FAIL, 1 error, 1 warning, 0 section mismatches

Errors:
net/ipv4/inet_hashtables.c:669:12: error: ‘tcp_hashinfo’ undeclared (first use in this function); did you mean ‘raw_hashinfo’?

Warnings:
net/ipv4/inet_hashtables.c:608:68: warning: suggest parentheses around ‘+’ in operand of ‘&’ [-Wparentheses]

--------------------------------------------------------------------------------
bcm_defconfig (arm, gcc-10) — FAIL, 1 error, 1 warning, 0 section mismatches

Errors:
net/ipv4/inet_hashtables.c:669:12: error: ‘tcp_hashinfo’ undeclared (first use in this function); did you mean ‘raw_hashinfo’?

Warnings:
net/ipv4/inet_hashtables.c:608:68: warning: suggest parentheses around ‘+’ in operand of ‘&’ [-Wparentheses]

--------------------------------------------------------------------------------
bigsur_defconfig (mips, gcc-10) — FAIL, 1 error, 1 warning, 0 section mismatches

Errors:
net/ipv4/inet_hashtables.c:669:12: error: ‘tcp_hashinfo’ undeclared (first use in this function); did you mean ‘raw_hashinfo’?

Warnings:
net/ipv4/inet_hashtables.c:608:68: warning: suggest parentheses around ‘+’ in operand of ‘&’ [-Wparentheses]

--------------------------------------------------------------------------------
bmips_be_defconfig (mips, gcc-10) — FAIL, 1 error, 1 warning, 0 section mismatches

Errors:
net/ipv4/inet_hashtables.c:669:12: error: ‘tcp_hashinfo’ undeclared (first use in this function); did you mean ‘raw_hashinfo’?

Warnings:
net/ipv4/inet_hashtables.c:608:68: warning: suggest parentheses around ‘+’ in operand of ‘&’ [-Wparentheses]

--------------------------------------------------------------------------------
bmips_stb_defconfig (mips, gcc-10) — FAIL, 1 error, 1 warning, 0 section mismatches

Errors:
net/ipv4/inet_hashtables.c:669:12: error: ‘tcp_hashinfo’ undeclared (first use in this function); did you mean ‘raw_hashinfo’?

Warnings:
net/ipv4/inet_hashtables.c:608:68: warning: suggest parentheses around ‘+’ in operand of ‘&’ [-Wparentheses]

--------------------------------------------------------------------------------
capcella_defconfig (mips, gcc-10) — FAIL, 1 error, 1 warning, 0 section mismatches

Errors:
net/ipv4/inet_hashtables.c:669:12: error: ‘tcp_hashinfo’ undeclared (first use in this function); did you mean ‘raw_hashinfo’?

Warnings:
net/ipv4/inet_hashtables.c:608:68: warning: suggest parentheses around ‘+’ in operand of ‘&’ [-Wparentheses]

--------------------------------------------------------------------------------
cavium_octeon_defconfig (mips, gcc-10) — FAIL, 1 error, 1 warning, 0 section mismatches

Errors:
net/ipv4/inet_hashtables.c:669:12: error: ‘tcp_hashinfo’ undeclared (first use in this function); did you mean ‘raw_hashinfo’?

Warnings:
net/ipv4/inet_hashtables.c:608:68: warning: suggest parentheses around ‘+’ in operand of ‘&’ [-Wparentheses]

--------------------------------------------------------------------------------
cerfcube_defconfig (arm, gcc-10) — FAIL, 1 error, 1 warning, 0 section mismatches

Errors:
net/ipv4/inet_hashtables.c:669:12: error: ‘tcp_hashinfo’ undeclared (first use in this function); did you mean ‘raw_hashinfo’?

Warnings:
net/ipv4/inet_hashtables.c:608:68: warning: suggest parentheses around ‘+’ in operand of ‘&’ [-Wparentheses]

--------------------------------------------------------------------------------
ci20_defconfig (mips, gcc-10) — FAIL, 1 error, 1 warning, 0 section mismatches

Errors:
net/ipv4/inet_hashtables.c:669:12: error: ‘tcp_hashinfo’ undeclared (first use in this function); did you mean ‘raw_hashinfo’?

Warnings:
net/ipv4/inet_hashtables.c:608:68: warning: suggest parentheses around ‘+’ in operand of ‘&’ [-Wparentheses]

--------------------------------------------------------------------------------
clps711x_defconfig (arm, gcc-10) — FAIL, 1 error, 2 warnings, 0 section mismatches

Errors:
net/ipv4/inet_hashtables.c:669:12: error: ‘tcp_hashinfo’ undeclared (first use in this function); did you mean ‘raw_hashinfo’?

Warnings:
arch/arm/mach-clps711x/board-autcpu12.c:163:26: warning: duplicate ‘const’ declaration specifier [-Wduplicate-decl-specifier]
net/ipv4/inet_hashtables.c:608:68: warning: suggest parentheses around ‘+’ in operand of ‘&’ [-Wparentheses]

--------------------------------------------------------------------------------
cm_x2xx_defconfig (arm, gcc-10) — FAIL, 1 error, 1 warning, 0 section mismatches

Errors:
net/ipv4/inet_hashtables.c:669:12: error: ‘tcp_hashinfo’ undeclared (first use in this function); did you mean ‘raw_hashinfo’?

Warnings:
net/ipv4/inet_hashtables.c:608:68: warning: suggest parentheses around ‘+’ in operand of ‘&’ [-Wparentheses]

--------------------------------------------------------------------------------
cm_x300_defconfig (arm, gcc-10) — FAIL, 1 error, 1 warning, 0 section mismatches

Errors:
net/ipv4/inet_hashtables.c:669:12: error: ‘tcp_hashinfo’ undeclared (first use in this function); did you mean ‘raw_hashinfo’?

Warnings:
net/ipv4/inet_hashtables.c:608:68: warning: suggest parentheses around ‘+’ in operand of ‘&’ [-Wparentheses]

--------------------------------------------------------------------------------
cobalt_defconfig (mips, gcc-10) — FAIL, 1 error, 1 warning, 0 section mismatches

Errors:
net/ipv4/inet_hashtables.c:669:12: error: ‘tcp_hashinfo’ undeclared (first use in this function); did you mean ‘raw_hashinfo’?

Warnings:
net/ipv4/inet_hashtables.c:608:68: warning: suggest parentheses around ‘+’ in operand of ‘&’ [-Wparentheses]

--------------------------------------------------------------------------------
colibri_pxa270_defconfig (arm, gcc-10) — FAIL, 1 error, 1 warning, 0 section mismatches

Errors:
net/ipv4/inet_hashtables.c:669:12: error: ‘tcp_hashinfo’ undeclared (first use in this function); did you mean ‘raw_hashinfo’?

Warnings:
net/ipv4/inet_hashtables.c:608:68: warning: suggest parentheses around ‘+’ in operand of ‘&’ [-Wparentheses]

--------------------------------------------------------------------------------
colibri_pxa300_defconfig (arm, gcc-10) — FAIL, 1 error, 1 warning, 0 section mismatches

Errors:
net/ipv4/inet_hashtables.c:669:12: error: ‘tcp_hashinfo’ undeclared (first use in this function); did you mean ‘raw_hashinfo’?

Warnings:
net/ipv4/inet_hashtables.c:608:68: warning: suggest parentheses around ‘+’ in operand of ‘&’ [-Wparentheses]

--------------------------------------------------------------------------------
collie_defconfig (arm, gcc-10) — FAIL, 1 error, 1 warning, 0 section mismatches

Errors:
net/ipv4/inet_hashtables.c:669:12: error: ‘tcp_hashinfo’ undeclared (first use in this function); did you mean ‘raw_hashinfo’?

Warnings:
net/ipv4/inet_hashtables.c:608:68: warning: suggest parentheses around ‘+’ in operand of ‘&’ [-Wparentheses]

--------------------------------------------------------------------------------
corgi_defconfig (arm, gcc-10) — FAIL, 1 error, 1 warning, 0 section mismatches

Errors:
net/ipv4/inet_hashtables.c:669:12: error: ‘tcp_hashinfo’ undeclared (first use in this function); did you mean ‘raw_hashinfo’?

Warnings:
net/ipv4/inet_hashtables.c:608:68: warning: suggest parentheses around ‘+’ in operand of ‘&’ [-Wparentheses]

--------------------------------------------------------------------------------
davinci_all_defconfig (arm, gcc-10) — FAIL, 1 error, 2 warnings, 0 section mismatches

Errors:
net/ipv4/inet_hashtables.c:669:12: error: ‘tcp_hashinfo’ undeclared (first use in this function); did you mean ‘raw_hashinfo’?

Warnings:
arch/arm/mach-davinci/da8xx-dt.c:23:34: warning: duplicate ‘const’ declaration specifier [-Wduplicate-decl-specifier]
net/ipv4/inet_hashtables.c:608:68: warning: suggest parentheses around ‘+’ in operand of ‘&’ [-Wparentheses]

--------------------------------------------------------------------------------
db1xxx_defconfig (mips, gcc-10) — FAIL, 1 error, 1 warning, 0 section mismatches

Errors:
net/ipv4/inet_hashtables.c:669:12: error: ‘tcp_hashinfo’ undeclared (first use in this function); did you mean ‘raw_hashinfo’?

Warnings:
net/ipv4/inet_hashtables.c:608:68: warning: suggest parentheses around ‘+’ in operand of ‘&’ [-Wparentheses]

--------------------------------------------------------------------------------
decstation_defconfig (mips, gcc-10) — FAIL, 1 error, 1 warning, 0 section mismatches

Errors:
net/ipv4/inet_hashtables.c:669:12: error: ‘tcp_hashinfo’ undeclared (first use in this function); did you mean ‘raw_hashinfo’?

Warnings:
net/ipv4/inet_hashtables.c:608:68: warning: suggest parentheses around ‘+’ in operand of ‘&’ [-Wparentheses]

--------------------------------------------------------------------------------
defconfig (arm64, gcc-10) — FAIL, 1 error, 2 warnings, 0 section mismatches

Errors:
net/ipv4/inet_hashtables.c:669:12: error: ‘tcp_hashinfo’ undeclared (first use in this function); did you mean ‘raw_hashinfo’?

Warnings:
net/ipv4/inet_hashtables.c:608:68: warning: suggest parentheses around ‘+’ in operand of ‘&’ [-Wparentheses]
drivers/net/ethernet/apm/xgene/xgene_enet_main.c:32:36: warning: array ‘xgene_enet_acpi_match’ assumed to have one element

--------------------------------------------------------------------------------
defconfig+arm64-chromebook (arm64, gcc-10) — FAIL, 1 error, 2 warnings, 0 section mismatches

Errors:
net/ipv4/inet_hashtables.c:669:12: error: ‘tcp_hashinfo’ undeclared (first use in this function); did you mean ‘raw_hashinfo’?

Warnings:
net/ipv4/inet_hashtables.c:608:68: warning: suggest parentheses around ‘+’ in operand of ‘&’ [-Wparentheses]
drivers/net/ethernet/apm/xgene/xgene_enet_main.c:32:36: warning: array ‘xgene_enet_acpi_match’ assumed to have one element

--------------------------------------------------------------------------------
dove_defconfig (arm, gcc-10) — FAIL, 1 error, 1 warning, 0 section mismatches

Errors:
net/ipv4/inet_hashtables.c:669:12: error: ‘tcp_hashinfo’ undeclared (first use in this function); did you mean ‘raw_hashinfo’?

Warnings:
net/ipv4/inet_hashtables.c:608:68: warning: suggest parentheses around ‘+’ in operand of ‘&’ [-Wparentheses]

--------------------------------------------------------------------------------
e55_defconfig (mips, gcc-10) — PASS, 0 errors, 0 warnings, 0 section mismatches

--------------------------------------------------------------------------------
ebsa110_defconfig (arm, gcc-10) — FAIL, 1 error, 1 warning, 0 section mismatches

Errors:
net/ipv4/inet_hashtables.c:669:12: error: ‘tcp_hashinfo’ undeclared (first use in this function); did you mean ‘raw_hashinfo’?

Warnings:
net/ipv4/inet_hashtables.c:608:68: warning: suggest parentheses around ‘+’ in operand of ‘&’ [-Wparentheses]

--------------------------------------------------------------------------------
efm32_defconfig (arm, gcc-10) — FAIL, 1 error, 1 warning, 0 section mismatches

Errors:
net/ipv4/inet_hashtables.c:669:12: error: ‘tcp_hashinfo’ undeclared (first use in this function); did you mean ‘raw_hashinfo’?

Warnings:
net/ipv4/inet_hashtables.c:608:68: warning: suggest parentheses around ‘+’ in operand of ‘&’ [-Wparentheses]

--------------------------------------------------------------------------------
em_x270_defconfig (arm, gcc-10) — FAIL, 1 error, 1 warning, 0 section mismatches

Errors:
net/ipv4/inet_hashtables.c:669:12: error: ‘tcp_hashinfo’ undeclared (first use in this function); did you mean ‘raw_hashinfo’?

Warnings:
net/ipv4/inet_hashtables.c:608:68: warning: suggest parentheses around ‘+’ in operand of ‘&’ [-Wparentheses]

--------------------------------------------------------------------------------
ep93xx_defconfig (arm, gcc-10) — FAIL, 1 error, 1 warning, 0 section mismatches

Errors:
net/ipv4/inet_hashtables.c:669:12: error: ‘tcp_hashinfo’ undeclared (first use in this function); did you mean ‘raw_hashinfo’?

Warnings:
net/ipv4/inet_hashtables.c:608:68: warning: suggest parentheses around ‘+’ in operand of ‘&’ [-Wparentheses]

--------------------------------------------------------------------------------
eseries_pxa_defconfig (arm, gcc-10) — FAIL, 1 error, 1 warning, 0 section mismatches

Errors:
net/ipv4/inet_hashtables.c:669:12: error: ‘tcp_hashinfo’ undeclared (first use in this function); did you mean ‘raw_hashinfo’?

Warnings:
net/ipv4/inet_hashtables.c:608:68: warning: suggest parentheses around ‘+’ in operand of ‘&’ [-Wparentheses]

--------------------------------------------------------------------------------
exynos_defconfig (arm, gcc-10) — FAIL, 1 error, 1 warning, 0 section mismatches

Errors:
net/ipv4/inet_hashtables.c:669:12: error: ‘tcp_hashinfo’ undeclared (first use in this function); did you mean ‘raw_hashinfo’?

Warnings:
net/ipv4/inet_hashtables.c:608:68: warning: suggest parentheses around ‘+’ in operand of ‘&’ [-Wparentheses]

--------------------------------------------------------------------------------
ezx_defconfig (arm, gcc-10) — FAIL, 1 error, 1 warning, 0 section mismatches

Errors:
net/ipv4/inet_hashtables.c:669:12: error: ‘tcp_hashinfo’ undeclared (first use in this function); did you mean ‘raw_hashinfo’?

Warnings:
net/ipv4/inet_hashtables.c:608:68: warning: suggest parentheses around ‘+’ in operand of ‘&’ [-Wparentheses]

--------------------------------------------------------------------------------
footbridge_defconfig (arm, gcc-10) — FAIL, 1 error, 1 warning, 0 section mismatches

Errors:
net/ipv4/inet_hashtables.c:669:12: error: ‘tcp_hashinfo’ undeclared (first use in this function); did you mean ‘raw_hashinfo’?

Warnings:
net/ipv4/inet_hashtables.c:608:68: warning: suggest parentheses around ‘+’ in operand of ‘&’ [-Wparentheses]

--------------------------------------------------------------------------------
fuloong2e_defconfig (mips, gcc-10) — FAIL, 2 errors, 0 warnings, 0 section mismatches

Errors:
cc1: error: ‘-mloongson-mmi’ must be used with ‘-mhard-float’
cc1: error: ‘-mloongson-mmi’ must be used with ‘-mhard-float’

--------------------------------------------------------------------------------
gpr_defconfig (mips, gcc-10) — FAIL, 1 error, 1 warning, 0 section mismatches

Errors:
net/ipv4/inet_hashtables.c:669:12: error: ‘tcp_hashinfo’ undeclared (first use in this function); did you mean ‘raw_hashinfo’?

Warnings:
net/ipv4/inet_hashtables.c:608:68: warning: suggest parentheses around ‘+’ in operand of ‘&’ [-Wparentheses]

--------------------------------------------------------------------------------
h3600_defconfig (arm, gcc-10) — FAIL, 1 error, 1 warning, 0 section mismatches

Errors:
net/ipv4/inet_hashtables.c:669:12: error: ‘tcp_hashinfo’ undeclared (first use in this function); did you mean ‘raw_hashinfo’?

Warnings:
net/ipv4/inet_hashtables.c:608:68: warning: suggest parentheses around ‘+’ in operand of ‘&’ [-Wparentheses]

--------------------------------------------------------------------------------
h5000_defconfig (arm, gcc-10) — FAIL, 1 error, 1 warning, 0 section mismatches

Errors:
net/ipv4/inet_hashtables.c:669:12: error: ‘tcp_hashinfo’ undeclared (first use in this function); did you mean ‘raw_hashinfo’?

Warnings:
net/ipv4/inet_hashtables.c:608:68: warning: suggest parentheses around ‘+’ in operand of ‘&’ [-Wparentheses]

--------------------------------------------------------------------------------
hackkit_defconfig (arm, gcc-10) — FAIL, 1 error, 1 warning, 0 section mismatches

Errors:
net/ipv4/inet_hashtables.c:669:12: error: ‘tcp_hashinfo’ undeclared (first use in this function); did you mean ‘raw_hashinfo’?

Warnings:
net/ipv4/inet_hashtables.c:608:68: warning: suggest parentheses around ‘+’ in operand of ‘&’ [-Wparentheses]

--------------------------------------------------------------------------------
hisi_defconfig (arm, gcc-10) — FAIL, 1 error, 1 warning, 0 section mismatches

Errors:
net/ipv4/inet_hashtables.c:669:12: error: ‘tcp_hashinfo’ undeclared (first use in this function); did you mean ‘raw_hashinfo’?

Warnings:
net/ipv4/inet_hashtables.c:608:68: warning: suggest parentheses around ‘+’ in operand of ‘&’ [-Wparentheses]

--------------------------------------------------------------------------------
i386_defconfig (i386, gcc-10) — FAIL, 1 error, 1 warning, 0 section mismatches

Errors:
net/ipv4/inet_hashtables.c:669:12: error: ‘tcp_hashinfo’ undeclared (first use in this function); did you mean ‘raw_hashinfo’?

Warnings:
net/ipv4/inet_hashtables.c:608:68: warning: suggest parentheses around ‘+’ in operand of ‘&’ [-Wparentheses]

--------------------------------------------------------------------------------
imote2_defconfig (arm, gcc-10) — FAIL, 1 error, 1 warning, 0 section mismatches

Errors:
net/ipv4/inet_hashtables.c:669:12: error: ‘tcp_hashinfo’ undeclared (first use in this function); did you mean ‘raw_hashinfo’?

Warnings:
net/ipv4/inet_hashtables.c:608:68: warning: suggest parentheses around ‘+’ in operand of ‘&’ [-Wparentheses]

--------------------------------------------------------------------------------
imx_v4_v5_defconfig (arm, gcc-10) — FAIL, 1 error, 1 warning, 0 section mismatches

Errors:
net/ipv4/inet_hashtables.c:669:12: error: ‘tcp_hashinfo’ undeclared (first use in this function); did you mean ‘raw_hashinfo’?

Warnings:
net/ipv4/inet_hashtables.c:608:68: warning: suggest parentheses around ‘+’ in operand of ‘&’ [-Wparentheses]

--------------------------------------------------------------------------------
imx_v6_v7_defconfig (arm, gcc-10) — FAIL, 1 error, 1 warning, 0 section mismatches

Errors:
net/ipv4/inet_hashtables.c:669:12: error: ‘tcp_hashinfo’ undeclared (first use in this function); did you mean ‘raw_hashinfo’?

Warnings:
net/ipv4/inet_hashtables.c:608:68: warning: suggest parentheses around ‘+’ in operand of ‘&’ [-Wparentheses]

--------------------------------------------------------------------------------
integrator_defconfig (arm, gcc-10) — FAIL, 1 error, 1 warning, 0 section mismatches

Errors:
net/ipv4/inet_hashtables.c:669:12: error: ‘tcp_hashinfo’ undeclared (first use in this function); did you mean ‘raw_hashinfo’?

Warnings:
net/ipv4/inet_hashtables.c:608:68: warning: suggest parentheses around ‘+’ in operand of ‘&’ [-Wparentheses]

--------------------------------------------------------------------------------
iop13xx_defconfig (arm, gcc-10) — FAIL, 1 error, 1 warning, 0 section mismatches

Errors:
net/ipv4/inet_hashtables.c:669:12: error: ‘tcp_hashinfo’ undeclared (first use in this function); did you mean ‘raw_hashinfo’?

Warnings:
net/ipv4/inet_hashtables.c:608:68: warning: suggest parentheses around ‘+’ in operand of ‘&’ [-Wparentheses]

--------------------------------------------------------------------------------
iop32x_defconfig (arm, gcc-10) — FAIL, 1 error, 1 warning, 0 section mismatches

Errors:
net/ipv4/inet_hashtables.c:669:12: error: ‘tcp_hashinfo’ undeclared (first use in this function); did you mean ‘raw_hashinfo’?

Warnings:
net/ipv4/inet_hashtables.c:608:68: warning: suggest parentheses around ‘+’ in operand of ‘&’ [-Wparentheses]

--------------------------------------------------------------------------------
iop33x_defconfig (arm, gcc-10) — FAIL, 1 error, 1 warning, 0 section mismatches

Errors:
net/ipv4/inet_hashtables.c:669:12: error: ‘tcp_hashinfo’ undeclared (first use in this function); did you mean ‘raw_hashinfo’?

Warnings:
net/ipv4/inet_hashtables.c:608:68: warning: suggest parentheses around ‘+’ in operand of ‘&’ [-Wparentheses]

--------------------------------------------------------------------------------
ip22_defconfig (mips, gcc-10) — FAIL, 1 error, 2 warnings, 0 section mismatches

Errors:
net/ipv4/inet_hashtables.c:669:12: error: ‘tcp_hashinfo’ undeclared (first use in this function); did you mean ‘raw_hashinfo’?

Warnings:
drivers/net/ethernet/seeq/sgiseeq.c:804:26: warning: passing argument 5 of ‘dma_free_attrs’ makes pointer from integer without a cast [-Wint-conversion]
net/ipv4/inet_hashtables.c:608:68: warning: suggest parentheses around ‘+’ in operand of ‘&’ [-Wparentheses]

--------------------------------------------------------------------------------
ip27_defconfig (mips, gcc-10) — FAIL, 0 errors, 0 warnings, 0 section mismatches

--------------------------------------------------------------------------------
ip28_defconfig (mips, gcc-10) — FAIL, 0 errors, 0 warnings, 0 section mismatches

--------------------------------------------------------------------------------
ip32_defconfig (mips, gcc-10) — FAIL, 1 error, 1 warning, 0 section mismatches

Errors:
net/ipv4/inet_hashtables.c:669:12: error: ‘tcp_hashinfo’ undeclared (first use in this function); did you mean ‘raw_hashinfo’?

Warnings:
net/ipv4/inet_hashtables.c:608:68: warning: suggest parentheses around ‘+’ in operand of ‘&’ [-Wparentheses]

--------------------------------------------------------------------------------
ixp4xx_defconfig (arm, gcc-10) — FAIL, 1 error, 1 warning, 0 section mismatches

Errors:
net/ipv4/inet_hashtables.c:669:12: error: ‘tcp_hashinfo’ undeclared (first use in this function); did you mean ‘raw_hashinfo’?

Warnings:
net/ipv4/inet_hashtables.c:608:68: warning: suggest parentheses around ‘+’ in operand of ‘&’ [-Wparentheses]

--------------------------------------------------------------------------------
jazz_defconfig (mips, gcc-10) — FAIL, 1 error, 1 warning, 0 section mismatches

Errors:
net/ipv4/inet_hashtables.c:669:12: error: ‘tcp_hashinfo’ undeclared (first use in this function); did you mean ‘raw_hashinfo’?

Warnings:
net/ipv4/inet_hashtables.c:608:68: warning: suggest parentheses around ‘+’ in operand of ‘&’ [-Wparentheses]

--------------------------------------------------------------------------------
jmr3927_defconfig (mips, gcc-10) — FAIL, 1 error, 1 warning, 0 section mismatches

Errors:
net/ipv4/inet_hashtables.c:669:12: error: ‘tcp_hashinfo’ undeclared (first use in this function); did you mean ‘raw_hashinfo’?

Warnings:
net/ipv4/inet_hashtables.c:608:68: warning: suggest parentheses around ‘+’ in operand of ‘&’ [-Wparentheses]

--------------------------------------------------------------------------------
jornada720_defconfig (arm, gcc-10) — FAIL, 1 error, 1 warning, 0 section mismatches

Errors:
net/ipv4/inet_hashtables.c:669:12: error: ‘tcp_hashinfo’ undeclared (first use in this function); did you mean ‘raw_hashinfo’?

Warnings:
net/ipv4/inet_hashtables.c:608:68: warning: suggest parentheses around ‘+’ in operand of ‘&’ [-Wparentheses]

--------------------------------------------------------------------------------
keystone_defconfig (arm, gcc-10) — FAIL, 1 error, 1 warning, 0 section mismatches

Errors:
net/ipv4/inet_hashtables.c:669:12: error: ‘tcp_hashinfo’ undeclared (first use in this function); did you mean ‘raw_hashinfo’?

Warnings:
net/ipv4/inet_hashtables.c:608:68: warning: suggest parentheses around ‘+’ in operand of ‘&’ [-Wparentheses]

--------------------------------------------------------------------------------
ks8695_defconfig (arm, gcc-10) — FAIL, 1 error, 1 warning, 0 section mismatches

Errors:
net/ipv4/inet_hashtables.c:669:12: error: ‘tcp_hashinfo’ undeclared (first use in this function); did you mean ‘raw_hashinfo’?

Warnings:
net/ipv4/inet_hashtables.c:608:68: warning: suggest parentheses around ‘+’ in operand of ‘&’ [-Wparentheses]

--------------------------------------------------------------------------------
lart_defconfig (arm, gcc-10) — FAIL, 1 error, 1 warning, 0 section mismatches

Errors:
net/ipv4/inet_hashtables.c:669:12: error: ‘tcp_hashinfo’ undeclared (first use in this function); did you mean ‘raw_hashinfo’?

Warnings:
net/ipv4/inet_hashtables.c:608:68: warning: suggest parentheses around ‘+’ in operand of ‘&’ [-Wparentheses]

--------------------------------------------------------------------------------
lasat_defconfig (mips, gcc-10) — FAIL, 1 error, 1 warning, 0 section mismatches

Errors:
net/ipv4/inet_hashtables.c:669:12: error: ‘tcp_hashinfo’ undeclared (first use in this function); did you mean ‘raw_hashinfo’?

Warnings:
net/ipv4/inet_hashtables.c:608:68: warning: suggest parentheses around ‘+’ in operand of ‘&’ [-Wparentheses]

--------------------------------------------------------------------------------
lemote2f_defconfig (mips, gcc-10) — FAIL, 2 errors, 0 warnings, 0 section mismatches

Errors:
cc1: error: ‘-mloongson-mmi’ must be used with ‘-mhard-float’
cc1: error: ‘-mloongson-mmi’ must be used with ‘-mhard-float’

--------------------------------------------------------------------------------
loongson3_defconfig (mips, gcc-10) — FAIL, 1 error, 1 warning, 0 section mismatches

Errors:
net/ipv4/inet_hashtables.c:669:12: error: ‘tcp_hashinfo’ undeclared (first use in this function); did you mean ‘raw_hashinfo’?

Warnings:
net/ipv4/inet_hashtables.c:608:68: warning: suggest parentheses around ‘+’ in operand of ‘&’ [-Wparentheses]

--------------------------------------------------------------------------------
lpc18xx_defconfig (arm, gcc-10) — FAIL, 1 error, 1 warning, 0 section mismatches

Errors:
net/ipv4/inet_hashtables.c:669:12: error: ‘tcp_hashinfo’ undeclared (first use in this function); did you mean ‘raw_hashinfo’?

Warnings:
net/ipv4/inet_hashtables.c:608:68: warning: suggest parentheses around ‘+’ in operand of ‘&’ [-Wparentheses]

--------------------------------------------------------------------------------
lpc32xx_defconfig (arm, gcc-10) — FAIL, 1 error, 2 warnings, 0 section mismatches

Errors:
net/ipv4/inet_hashtables.c:669:12: error: ‘tcp_hashinfo’ undeclared (first use in this function); did you mean ‘raw_hashinfo’?

Warnings:
arch/arm/mach-lpc32xx/phy3250.c:215:36: warning: duplicate ‘const’ declaration specifier [-Wduplicate-decl-specifier]
net/ipv4/inet_hashtables.c:608:68: warning: suggest parentheses around ‘+’ in operand of ‘&’ [-Wparentheses]

--------------------------------------------------------------------------------
lpd270_defconfig (arm, gcc-10) — FAIL, 1 error, 1 warning, 0 section mismatches

Errors:
net/ipv4/inet_hashtables.c:669:12: error: ‘tcp_hashinfo’ undeclared (first use in this function); did you mean ‘raw_hashinfo’?

Warnings:
net/ipv4/inet_hashtables.c:608:68: warning: suggest parentheses around ‘+’ in operand of ‘&’ [-Wparentheses]

--------------------------------------------------------------------------------
ls1b_defconfig (mips, gcc-10) — FAIL, 1 error, 1 warning, 0 section mismatches

Errors:
net/ipv4/inet_hashtables.c:669:12: error: ‘tcp_hashinfo’ undeclared (first use in this function); did you mean ‘raw_hashinfo’?

Warnings:
net/ipv4/inet_hashtables.c:608:68: warning: suggest parentheses around ‘+’ in operand of ‘&’ [-Wparentheses]

--------------------------------------------------------------------------------
lubbock_defconfig (arm, gcc-10) — FAIL, 1 error, 1 warning, 0 section mismatches

Errors:
net/ipv4/inet_hashtables.c:669:12: error: ‘tcp_hashinfo’ undeclared (first use in this function); did you mean ‘raw_hashinfo’?

Warnings:
net/ipv4/inet_hashtables.c:608:68: warning: suggest parentheses around ‘+’ in operand of ‘&’ [-Wparentheses]

--------------------------------------------------------------------------------
magician_defconfig (arm, gcc-10) — FAIL, 1 error, 1 warning, 0 section mismatches

Errors:
net/ipv4/inet_hashtables.c:669:12: error: ‘tcp_hashinfo’ undeclared (first use in this function); did you mean ‘raw_hashinfo’?

Warnings:
net/ipv4/inet_hashtables.c:608:68: warning: suggest parentheses around ‘+’ in operand of ‘&’ [-Wparentheses]

--------------------------------------------------------------------------------
mainstone_defconfig (arm, gcc-10) — FAIL, 1 error, 1 warning, 0 section mismatches

Errors:
net/ipv4/inet_hashtables.c:669:12: error: ‘tcp_hashinfo’ undeclared (first use in this function); did you mean ‘raw_hashinfo’?

Warnings:
net/ipv4/inet_hashtables.c:608:68: warning: suggest parentheses around ‘+’ in operand of ‘&’ [-Wparentheses]

--------------------------------------------------------------------------------
malta_defconfig (mips, gcc-10) — FAIL, 1 error, 1 warning, 0 section mismatches

Errors:
net/ipv4/inet_hashtables.c:669:12: error: ‘tcp_hashinfo’ undeclared (first use in this function); did you mean ‘raw_hashinfo’?

Warnings:
net/ipv4/inet_hashtables.c:608:68: warning: suggest parentheses around ‘+’ in operand of ‘&’ [-Wparentheses]

--------------------------------------------------------------------------------
malta_kvm_defconfig (mips, gcc-10) — FAIL, 1 error, 1 warning, 0 section mismatches

Errors:
net/ipv4/inet_hashtables.c:669:12: error: ‘tcp_hashinfo’ undeclared (first use in this function); did you mean ‘raw_hashinfo’?

Warnings:
net/ipv4/inet_hashtables.c:608:68: warning: suggest parentheses around ‘+’ in operand of ‘&’ [-Wparentheses]

--------------------------------------------------------------------------------
malta_kvm_guest_defconfig (mips, gcc-10) — FAIL, 1 error, 1 warning, 0 section mismatches

Errors:
net/ipv4/inet_hashtables.c:669:12: error: ‘tcp_hashinfo’ undeclared (first use in this function); did you mean ‘raw_hashinfo’?

Warnings:
net/ipv4/inet_hashtables.c:608:68: warning: suggest parentheses around ‘+’ in operand of ‘&’ [-Wparentheses]

--------------------------------------------------------------------------------
malta_qemu_32r6_defconfig (mips, gcc-10) — FAIL, 1 error, 1 warning, 0 section mismatches

Errors:
net/ipv4/inet_hashtables.c:669:12: error: ‘tcp_hashinfo’ undeclared (first use in this function); did you mean ‘raw_hashinfo’?

Warnings:
net/ipv4/inet_hashtables.c:608:68: warning: suggest parentheses around ‘+’ in operand of ‘&’ [-Wparentheses]

--------------------------------------------------------------------------------
maltaaprp_defconfig (mips, gcc-10) — FAIL, 1 error, 1 warning, 0 section mismatches

Errors:
net/ipv4/inet_hashtables.c:669:12: error: ‘tcp_hashinfo’ undeclared (first use in this function); did you mean ‘raw_hashinfo’?

Warnings:
net/ipv4/inet_hashtables.c:608:68: warning: suggest parentheses around ‘+’ in operand of ‘&’ [-Wparentheses]

--------------------------------------------------------------------------------
maltasmvp_defconfig (mips, gcc-10) — FAIL, 1 error, 1 warning, 0 section mismatches

Errors:
net/ipv4/inet_hashtables.c:669:12: error: ‘tcp_hashinfo’ undeclared (first use in this function); did you mean ‘raw_hashinfo’?

Warnings:
net/ipv4/inet_hashtables.c:608:68: warning: suggest parentheses around ‘+’ in operand of ‘&’ [-Wparentheses]

--------------------------------------------------------------------------------
maltasmvp_eva_defconfig (mips, gcc-10) — FAIL, 1 error, 1 warning, 0 section mismatches

Errors:
net/ipv4/inet_hashtables.c:669:12: error: ‘tcp_hashinfo’ undeclared (first use in this function); did you mean ‘raw_hashinfo’?

Warnings:
net/ipv4/inet_hashtables.c:608:68: warning: suggest parentheses around ‘+’ in operand of ‘&’ [-Wparentheses]

--------------------------------------------------------------------------------
maltaup_defconfig (mips, gcc-10) — FAIL, 1 error, 1 warning, 0 section mismatches

Errors:
net/ipv4/inet_hashtables.c:669:12: error: ‘tcp_hashinfo’ undeclared (first use in this function); did you mean ‘raw_hashinfo’?

Warnings:
net/ipv4/inet_hashtables.c:608:68: warning: suggest parentheses around ‘+’ in operand of ‘&’ [-Wparentheses]

--------------------------------------------------------------------------------
maltaup_xpa_defconfig (mips, gcc-10) — FAIL, 1 error, 1 warning, 0 section mismatches

Errors:
net/ipv4/inet_hashtables.c:669:12: error: ‘tcp_hashinfo’ undeclared (first use in this function); did you mean ‘raw_hashinfo’?

Warnings:
net/ipv4/inet_hashtables.c:608:68: warning: suggest parentheses around ‘+’ in operand of ‘&’ [-Wparentheses]

--------------------------------------------------------------------------------
markeins_defconfig (mips, gcc-10) — FAIL, 1 error, 1 warning, 0 section mismatches

Errors:
net/ipv4/inet_hashtables.c:669:12: error: ‘tcp_hashinfo’ undeclared (first use in this function); did you mean ‘raw_hashinfo’?

Warnings:
net/ipv4/inet_hashtables.c:608:68: warning: suggest parentheses around ‘+’ in operand of ‘&’ [-Wparentheses]

--------------------------------------------------------------------------------
mini2440_defconfig (arm, gcc-10) — FAIL, 1 error, 2 warnings, 0 section mismatches

Errors:
net/ipv4/inet_hashtables.c:669:12: error: ‘tcp_hashinfo’ undeclared (first use in this function); did you mean ‘raw_hashinfo’?

Warnings:
net/ipv4/inet_hashtables.c:608:68: warning: suggest parentheses around ‘+’ in operand of ‘&’ [-Wparentheses]
drivers/tty/serial/samsung.c:1777:34: warning: array ‘s3c24xx_uart_dt_match’ assumed to have one element

--------------------------------------------------------------------------------
mips_paravirt_defconfig (mips, gcc-10) — FAIL, 1 error, 1 warning, 0 section mismatches

Errors:
net/ipv4/inet_hashtables.c:669:12: error: ‘tcp_hashinfo’ undeclared (first use in this function); did you mean ‘raw_hashinfo’?

Warnings:
net/ipv4/inet_hashtables.c:608:68: warning: suggest parentheses around ‘+’ in operand of ‘&’ [-Wparentheses]

--------------------------------------------------------------------------------
mmp2_defconfig (arm, gcc-10) — FAIL, 1 error, 1 warning, 0 section mismatches

Errors:
net/ipv4/inet_hashtables.c:669:12: error: ‘tcp_hashinfo’ undeclared (first use in this function); did you mean ‘raw_hashinfo’?

Warnings:
net/ipv4/inet_hashtables.c:608:68: warning: suggest parentheses around ‘+’ in operand of ‘&’ [-Wparentheses]

--------------------------------------------------------------------------------
moxart_defconfig (arm, gcc-10) — FAIL, 1 error, 1 warning, 0 section mismatches

Errors:
net/ipv4/inet_hashtables.c:669:12: error: ‘tcp_hashinfo’ undeclared (first use in this function); did you mean ‘raw_hashinfo’?

Warnings:
net/ipv4/inet_hashtables.c:608:68: warning: suggest parentheses around ‘+’ in operand of ‘&’ [-Wparentheses]

--------------------------------------------------------------------------------
mpc30x_defconfig (mips, gcc-10) — FAIL, 1 error, 1 warning, 0 section mismatches

Errors:
net/ipv4/inet_hashtables.c:669:12: error: ‘tcp_hashinfo’ undeclared (first use in this function); did you mean ‘raw_hashinfo’?

Warnings:
net/ipv4/inet_hashtables.c:608:68: warning: suggest parentheses around ‘+’ in operand of ‘&’ [-Wparentheses]

--------------------------------------------------------------------------------
msp71xx_defconfig (mips, gcc-10) — FAIL, 1 error, 1 warning, 0 section mismatches

Errors:
net/ipv4/inet_hashtables.c:669:12: error: ‘tcp_hashinfo’ undeclared (first use in this function); did you mean ‘raw_hashinfo’?

Warnings:
net/ipv4/inet_hashtables.c:608:68: warning: suggest parentheses around ‘+’ in operand of ‘&’ [-Wparentheses]

--------------------------------------------------------------------------------
mtx1_defconfig (mips, gcc-10) — FAIL, 1 error, 1 warning, 0 section mismatches

Errors:
net/ipv4/inet_hashtables.c:669:12: error: ‘tcp_hashinfo’ undeclared (first use in this function); did you mean ‘raw_hashinfo’?

Warnings:
net/ipv4/inet_hashtables.c:608:68: warning: suggest parentheses around ‘+’ in operand of ‘&’ [-Wparentheses]

--------------------------------------------------------------------------------
multi_v5_defconfig (arm, gcc-10) — FAIL, 1 error, 1 warning, 0 section mismatches

Errors:
net/ipv4/inet_hashtables.c:669:12: error: ‘tcp_hashinfo’ undeclared (first use in this function); did you mean ‘raw_hashinfo’?

Warnings:
net/ipv4/inet_hashtables.c:608:68: warning: suggest parentheses around ‘+’ in operand of ‘&’ [-Wparentheses]

--------------------------------------------------------------------------------
multi_v7_defconfig (arm, gcc-10) — FAIL, 1 error, 1 warning, 0 section mismatches

Errors:
net/ipv4/inet_hashtables.c:669:12: error: ‘tcp_hashinfo’ undeclared (first use in this function); did you mean ‘raw_hashinfo’?

Warnings:
net/ipv4/inet_hashtables.c:608:68: warning: suggest parentheses around ‘+’ in operand of ‘&’ [-Wparentheses]

--------------------------------------------------------------------------------
mv78xx0_defconfig (arm, gcc-10) — FAIL, 1 error, 1 warning, 0 section mismatches

Errors:
net/ipv4/inet_hashtables.c:669:12: error: ‘tcp_hashinfo’ undeclared (first use in this function); did you mean ‘raw_hashinfo’?

Warnings:
net/ipv4/inet_hashtables.c:608:68: warning: suggest parentheses around ‘+’ in operand of ‘&’ [-Wparentheses]

--------------------------------------------------------------------------------
mvebu_v5_defconfig (arm, gcc-10) — FAIL, 1 error, 1 warning, 0 section mismatches

Errors:
net/ipv4/inet_hashtables.c:669:12: error: ‘tcp_hashinfo’ undeclared (first use in this function); did you mean ‘raw_hashinfo’?

Warnings:
net/ipv4/inet_hashtables.c:608:68: warning: suggest parentheses around ‘+’ in operand of ‘&’ [-Wparentheses]

--------------------------------------------------------------------------------
mvebu_v7_defconfig (arm, gcc-10) — FAIL, 1 error, 1 warning, 0 section mismatches

Errors:
net/ipv4/inet_hashtables.c:669:12: error: ‘tcp_hashinfo’ undeclared (first use in this function); did you mean ‘raw_hashinfo’?

Warnings:
net/ipv4/inet_hashtables.c:608:68: warning: suggest parentheses around ‘+’ in operand of ‘&’ [-Wparentheses]

--------------------------------------------------------------------------------
mxs_defconfig (arm, gcc-10) — FAIL, 1 error, 2 warnings, 0 section mismatches

Errors:
net/ipv4/inet_hashtables.c:669:12: error: ‘tcp_hashinfo’ undeclared (first use in this function); did you mean ‘raw_hashinfo’?

Warnings:
arch/arm/mach-mxs/mach-mxs.c:285:26: warning: duplicate ‘const’ declaration specifier [-Wduplicate-decl-specifier]
net/ipv4/inet_hashtables.c:608:68: warning: suggest parentheses around ‘+’ in operand of ‘&’ [-Wparentheses]

--------------------------------------------------------------------------------
neponset_defconfig (arm, gcc-10) — FAIL, 1 error, 1 warning, 0 section mismatches

Errors:
net/ipv4/inet_hashtables.c:669:12: error: ‘tcp_hashinfo’ undeclared (first use in this function); did you mean ‘raw_hashinfo’?

Warnings:
net/ipv4/inet_hashtables.c:608:68: warning: suggest parentheses around ‘+’ in operand of ‘&’ [-Wparentheses]

--------------------------------------------------------------------------------
netwinder_defconfig (arm, gcc-10) — FAIL, 1 error, 1 warning, 0 section mismatches

Errors:
net/ipv4/inet_hashtables.c:669:12: error: ‘tcp_hashinfo’ undeclared (first use in this function); did you mean ‘raw_hashinfo’?

Warnings:
net/ipv4/inet_hashtables.c:608:68: warning: suggest parentheses around ‘+’ in operand of ‘&’ [-Wparentheses]

--------------------------------------------------------------------------------
netx_defconfig (arm, gcc-10) — FAIL, 1 error, 1 warning, 0 section mismatches

Errors:
net/ipv4/inet_hashtables.c:669:12: error: ‘tcp_hashinfo’ undeclared (first use in this function); did you mean ‘raw_hashinfo’?

Warnings:
net/ipv4/inet_hashtables.c:608:68: warning: suggest parentheses around ‘+’ in operand of ‘&’ [-Wparentheses]

--------------------------------------------------------------------------------
nhk8815_defconfig (arm, gcc-10) — FAIL, 1 error, 1 warning, 0 section mismatches

Errors:
net/ipv4/inet_hashtables.c:669:12: error: ‘tcp_hashinfo’ undeclared (first use in this function); did you mean ‘raw_hashinfo’?

Warnings:
net/ipv4/inet_hashtables.c:608:68: warning: suggest parentheses around ‘+’ in operand of ‘&’ [-Wparentheses]

--------------------------------------------------------------------------------
nlm_xlp_defconfig (mips, gcc-10) — FAIL, 1 error, 1 warning, 0 section mismatches

Errors:
net/ipv4/inet_hashtables.c:669:12: error: ‘tcp_hashinfo’ undeclared (first use in this function); did you mean ‘raw_hashinfo’?

Warnings:
net/ipv4/inet_hashtables.c:608:68: warning: suggest parentheses around ‘+’ in operand of ‘&’ [-Wparentheses]

--------------------------------------------------------------------------------
nlm_xlr_defconfig (mips, gcc-10) — FAIL, 1 error, 1 warning, 0 section mismatches

Errors:
net/ipv4/inet_hashtables.c:669:12: error: ‘tcp_hashinfo’ undeclared (first use in this function); did you mean ‘raw_hashinfo’?

Warnings:
net/ipv4/inet_hashtables.c:608:68: warning: suggest parentheses around ‘+’ in operand of ‘&’ [-Wparentheses]

--------------------------------------------------------------------------------
nsim_hs_defconfig (arc, gcc-10) — FAIL, 1 error, 1 warning, 0 section mismatches

Errors:
net/ipv4/inet_hashtables.c:669:12: error: 'tcp_hashinfo' undeclared (first use in this function); did you mean 'raw_hashinfo'?

Warnings:
net/ipv4/inet_hashtables.c:608:68: warning: suggest parentheses around '+' in operand of '&' [-Wparentheses]

--------------------------------------------------------------------------------
nsim_hs_smp_defconfig (arc, gcc-10) — FAIL, 1 error, 1 warning, 0 section mismatches

Errors:
net/ipv4/inet_hashtables.c:669:12: error: 'tcp_hashinfo' undeclared (first use in this function); did you mean 'raw_hashinfo'?

Warnings:
net/ipv4/inet_hashtables.c:608:68: warning: suggest parentheses around '+' in operand of '&' [-Wparentheses]

--------------------------------------------------------------------------------
nsimosci_hs_defconfig (arc, gcc-10) — FAIL, 1 error, 1 warning, 0 section mismatches

Errors:
net/ipv4/inet_hashtables.c:669:12: error: 'tcp_hashinfo' undeclared (first use in this function); did you mean 'raw_hashinfo'?

Warnings:
net/ipv4/inet_hashtables.c:608:68: warning: suggest parentheses around '+' in operand of '&' [-Wparentheses]

--------------------------------------------------------------------------------
nsimosci_hs_smp_defconfig (arc, gcc-10) — FAIL, 1 error, 1 warning, 0 section mismatches

Errors:
net/ipv4/inet_hashtables.c:669:12: error: 'tcp_hashinfo' undeclared (first use in this function); did you mean 'raw_hashinfo'?

Warnings:
net/ipv4/inet_hashtables.c:608:68: warning: suggest parentheses around '+' in operand of '&' [-Wparentheses]

--------------------------------------------------------------------------------
nuc910_defconfig (arm, gcc-10) — PASS, 0 errors, 0 warnings, 0 section mismatches

--------------------------------------------------------------------------------
nuc950_defconfig (arm, gcc-10) — PASS, 0 errors, 0 warnings, 0 section mismatches

--------------------------------------------------------------------------------
nuc960_defconfig (arm, gcc-10) — PASS, 0 errors, 0 warnings, 0 section mismatches

--------------------------------------------------------------------------------
omap1_defconfig (arm, gcc-10) — FAIL, 1 error, 2 warnings, 0 section mismatches

Errors:
net/ipv4/inet_hashtables.c:669:12: error: ‘tcp_hashinfo’ undeclared (first use in this function); did you mean ‘raw_hashinfo’?

Warnings:
drivers/gpio/gpio-omap.c:1161:34: warning: array ‘omap_gpio_match’ assumed to have one element
net/ipv4/inet_hashtables.c:608:68: warning: suggest parentheses around ‘+’ in operand of ‘&’ [-Wparentheses]

--------------------------------------------------------------------------------
omap2plus_defconfig (arm, gcc-10) — FAIL, 1 error, 1 warning, 0 section mismatches

Errors:
net/ipv4/inet_hashtables.c:669:12: error: ‘tcp_hashinfo’ undeclared (first use in this function); did you mean ‘raw_hashinfo’?

Warnings:
net/ipv4/inet_hashtables.c:608:68: warning: suggest parentheses around ‘+’ in operand of ‘&’ [-Wparentheses]

--------------------------------------------------------------------------------
orion5x_defconfig (arm, gcc-10) — FAIL, 1 error, 1 warning, 0 section mismatches

Errors:
net/ipv4/inet_hashtables.c:669:12: error: ‘tcp_hashinfo’ undeclared (first use in this function); did you mean ‘raw_hashinfo’?

Warnings:
net/ipv4/inet_hashtables.c:608:68: warning: suggest parentheses around ‘+’ in operand of ‘&’ [-Wparentheses]

--------------------------------------------------------------------------------
palmz72_defconfig (arm, gcc-10) — FAIL, 1 error, 1 warning, 0 section mismatches

Errors:
net/ipv4/inet_hashtables.c:669:12: error: ‘tcp_hashinfo’ undeclared (first use in this function); did you mean ‘raw_hashinfo’?

Warnings:
net/ipv4/inet_hashtables.c:608:68: warning: suggest parentheses around ‘+’ in operand of ‘&’ [-Wparentheses]

--------------------------------------------------------------------------------
pcm027_defconfig (arm, gcc-10) — FAIL, 1 error, 1 warning, 0 section mismatches

Errors:
net/ipv4/inet_hashtables.c:669:12: error: ‘tcp_hashinfo’ undeclared (first use in this function); did you mean ‘raw_hashinfo’?

Warnings:
net/ipv4/inet_hashtables.c:608:68: warning: suggest parentheses around ‘+’ in operand of ‘&’ [-Wparentheses]

--------------------------------------------------------------------------------
pistachio_defconfig (mips, gcc-10) — FAIL, 1 error, 1 warning, 0 section mismatches

Errors:
net/ipv4/inet_hashtables.c:669:12: error: ‘tcp_hashinfo’ undeclared (first use in this function); did you mean ‘raw_hashinfo’?

Warnings:
net/ipv4/inet_hashtables.c:608:68: warning: suggest parentheses around ‘+’ in operand of ‘&’ [-Wparentheses]

--------------------------------------------------------------------------------
pleb_defconfig (arm, gcc-10) — FAIL, 1 error, 1 warning, 0 section mismatches

Errors:
net/ipv4/inet_hashtables.c:669:12: error: ‘tcp_hashinfo’ undeclared (first use in this function); did you mean ‘raw_hashinfo’?

Warnings:
net/ipv4/inet_hashtables.c:608:68: warning: suggest parentheses around ‘+’ in operand of ‘&’ [-Wparentheses]

--------------------------------------------------------------------------------
pnx8335_stb225_defconfig (mips, gcc-10) — FAIL, 1 error, 1 warning, 0 section mismatches

Errors:
net/ipv4/inet_hashtables.c:669:12: error: ‘tcp_hashinfo’ undeclared (first use in this function); did you mean ‘raw_hashinfo’?

Warnings:
net/ipv4/inet_hashtables.c:608:68: warning: suggest parentheses around ‘+’ in operand of ‘&’ [-Wparentheses]

--------------------------------------------------------------------------------
prima2_defconfig (arm, gcc-10) — PASS, 0 errors, 0 warnings, 0 section mismatches

--------------------------------------------------------------------------------
pxa168_defconfig (arm, gcc-10) — FAIL, 1 error, 1 warning, 0 section mismatches

Errors:
net/ipv4/inet_hashtables.c:669:12: error: ‘tcp_hashinfo’ undeclared (first use in this function); did you mean ‘raw_hashinfo’?

Warnings:
net/ipv4/inet_hashtables.c:608:68: warning: suggest parentheses around ‘+’ in operand of ‘&’ [-Wparentheses]

--------------------------------------------------------------------------------
pxa255-idp_defconfig (arm, gcc-10) — FAIL, 1 error, 1 warning, 0 section mismatches

Errors:
net/ipv4/inet_hashtables.c:669:12: error: ‘tcp_hashinfo’ undeclared (first use in this function); did you mean ‘raw_hashinfo’?

Warnings:
net/ipv4/inet_hashtables.c:608:68: warning: suggest parentheses around ‘+’ in operand of ‘&’ [-Wparentheses]

--------------------------------------------------------------------------------
pxa3xx_defconfig (arm, gcc-10) — FAIL, 1 error, 1 warning, 0 section mismatches

Errors:
net/ipv4/inet_hashtables.c:669:12: error: ‘tcp_hashinfo’ undeclared (first use in this function); did you mean ‘raw_hashinfo’?

Warnings:
net/ipv4/inet_hashtables.c:608:68: warning: suggest parentheses around ‘+’ in operand of ‘&’ [-Wparentheses]

--------------------------------------------------------------------------------
pxa910_defconfig (arm, gcc-10) — FAIL, 1 error, 1 warning, 0 section mismatches

Errors:
net/ipv4/inet_hashtables.c:669:12: error: ‘tcp_hashinfo’ undeclared (first use in this function); did you mean ‘raw_hashinfo’?

Warnings:
net/ipv4/inet_hashtables.c:608:68: warning: suggest parentheses around ‘+’ in operand of ‘&’ [-Wparentheses]

--------------------------------------------------------------------------------
qcom_defconfig (arm, gcc-10) — FAIL, 1 error, 1 warning, 0 section mismatches

Errors:
net/ipv4/inet_hashtables.c:669:12: error: ‘tcp_hashinfo’ undeclared (first use in this function); did you mean ‘raw_hashinfo’?

Warnings:
net/ipv4/inet_hashtables.c:608:68: warning: suggest parentheses around ‘+’ in operand of ‘&’ [-Wparentheses]

--------------------------------------------------------------------------------
qi_lb60_defconfig (mips, gcc-10) — FAIL, 1 error, 1 warning, 0 section mismatches

Errors:
net/ipv4/inet_hashtables.c:669:12: error: ‘tcp_hashinfo’ undeclared (first use in this function); did you mean ‘raw_hashinfo’?

Warnings:
net/ipv4/inet_hashtables.c:608:68: warning: suggest parentheses around ‘+’ in operand of ‘&’ [-Wparentheses]

--------------------------------------------------------------------------------
raumfeld_defconfig (arm, gcc-10) — FAIL, 1 error, 1 warning, 0 section mismatches

Errors:
net/ipv4/inet_hashtables.c:669:12: error: ‘tcp_hashinfo’ undeclared (first use in this function); did you mean ‘raw_hashinfo’?

Warnings:
net/ipv4/inet_hashtables.c:608:68: warning: suggest parentheses around ‘+’ in operand of ‘&’ [-Wparentheses]

--------------------------------------------------------------------------------
rb532_defconfig (mips, gcc-10) — FAIL, 1 error, 1 warning, 0 section mismatches

Errors:
net/ipv4/inet_hashtables.c:669:12: error: ‘tcp_hashinfo’ undeclared (first use in this function); did you mean ‘raw_hashinfo’?

Warnings:
net/ipv4/inet_hashtables.c:608:68: warning: suggest parentheses around ‘+’ in operand of ‘&’ [-Wparentheses]

--------------------------------------------------------------------------------
rbtx49xx_defconfig (mips, gcc-10) — FAIL, 1 error, 1 warning, 0 section mismatches

Errors:
net/ipv4/inet_hashtables.c:669:12: error: ‘tcp_hashinfo’ undeclared (first use in this function); did you mean ‘raw_hashinfo’?

Warnings:
net/ipv4/inet_hashtables.c:608:68: warning: suggest parentheses around ‘+’ in operand of ‘&’ [-Wparentheses]

--------------------------------------------------------------------------------
realview-smp_defconfig (arm, gcc-10) — FAIL, 1 error, 1 warning, 0 section mismatches

Errors:
net/ipv4/inet_hashtables.c:669:12: error: ‘tcp_hashinfo’ undeclared (first use in this function); did you mean ‘raw_hashinfo’?

Warnings:
net/ipv4/inet_hashtables.c:608:68: warning: suggest parentheses around ‘+’ in operand of ‘&’ [-Wparentheses]

--------------------------------------------------------------------------------
realview_defconfig (arm, gcc-10) — FAIL, 1 error, 1 warning, 0 section mismatches

Errors:
net/ipv4/inet_hashtables.c:669:12: error: ‘tcp_hashinfo’ undeclared (first use in this function); did you mean ‘raw_hashinfo’?

Warnings:
net/ipv4/inet_hashtables.c:608:68: warning: suggest parentheses around ‘+’ in operand of ‘&’ [-Wparentheses]

--------------------------------------------------------------------------------
rm200_defconfig (mips, gcc-10) — FAIL, 1 error, 1 warning, 0 section mismatches

Errors:
net/ipv4/inet_hashtables.c:669:12: error: ‘tcp_hashinfo’ undeclared (first use in this function); did you mean ‘raw_hashinfo’?

Warnings:
net/ipv4/inet_hashtables.c:608:68: warning: suggest parentheses around ‘+’ in operand of ‘&’ [-Wparentheses]

--------------------------------------------------------------------------------
rpc_defconfig (arm, gcc-10) — FAIL, 4 errors, 0 warnings, 0 section mismatches

Errors:
arm-linux-gnueabihf-gcc: error: unrecognized -march target: armv3
arm-linux-gnueabihf-gcc: error: missing argument to ‘-march=’
arm-linux-gnueabihf-gcc: error: unrecognized -march target: armv3
arm-linux-gnueabihf-gcc: error: missing argument to ‘-march=’

--------------------------------------------------------------------------------
rt305x_defconfig (mips, gcc-10) — FAIL, 1 error, 1 warning, 0 section mismatches

Errors:
net/ipv4/inet_hashtables.c:669:12: error: ‘tcp_hashinfo’ undeclared (first use in this function); did you mean ‘raw_hashinfo’?

Warnings:
net/ipv4/inet_hashtables.c:608:68: warning: suggest parentheses around ‘+’ in operand of ‘&’ [-Wparentheses]

--------------------------------------------------------------------------------
s3c2410_defconfig (arm, gcc-10) — FAIL, 1 error, 2 warnings, 0 section mismatches

Errors:
net/ipv4/inet_hashtables.c:669:12: error: ‘tcp_hashinfo’ undeclared (first use in this function); did you mean ‘raw_hashinfo’?

Warnings:
drivers/tty/serial/samsung.c:1777:34: warning: array ‘s3c24xx_uart_dt_match’ assumed to have one element
net/ipv4/inet_hashtables.c:608:68: warning: suggest parentheses around ‘+’ in operand of ‘&’ [-Wparentheses]

--------------------------------------------------------------------------------
s3c6400_defconfig (arm, gcc-10) — PASS, 0 errors, 2 warnings, 0 section mismatches

Warnings:
drivers/mmc/host/sdhci-s3c.c:429:34: warning: array ‘sdhci_s3c_dt_match’ assumed to have one element
drivers/tty/serial/samsung.c:1777:34: warning: array ‘s3c24xx_uart_dt_match’ assumed to have one element

--------------------------------------------------------------------------------
s5pv210_defconfig (arm, gcc-10) — PASS, 0 errors, 0 warnings, 0 section mismatches

--------------------------------------------------------------------------------
sama5_defconfig (arm, gcc-10) — FAIL, 1 error, 1 warning, 0 section mismatches

Errors:
net/ipv4/inet_hashtables.c:669:12: error: ‘tcp_hashinfo’ undeclared (first use in this function); did you mean ‘raw_hashinfo’?

Warnings:
net/ipv4/inet_hashtables.c:608:68: warning: suggest parentheses around ‘+’ in operand of ‘&’ [-Wparentheses]

--------------------------------------------------------------------------------
sb1250_swarm_defconfig (mips, gcc-10) — FAIL, 1 error, 1 warning, 0 section mismatches

Errors:
net/ipv4/inet_hashtables.c:669:12: error: ‘tcp_hashinfo’ undeclared (first use in this function); did you mean ‘raw_hashinfo’?

Warnings:
net/ipv4/inet_hashtables.c:608:68: warning: suggest parentheses around ‘+’ in operand of ‘&’ [-Wparentheses]

--------------------------------------------------------------------------------
sead3_defconfig (mips, gcc-10) — FAIL, 1 error, 1 warning, 0 section mismatches

Errors:
net/ipv4/inet_hashtables.c:669:12: error: ‘tcp_hashinfo’ undeclared (first use in this function); did you mean ‘raw_hashinfo’?

Warnings:
net/ipv4/inet_hashtables.c:608:68: warning: suggest parentheses around ‘+’ in operand of ‘&’ [-Wparentheses]

--------------------------------------------------------------------------------
sead3micro_defconfig (mips, gcc-10) — FAIL, 1 error, 1 warning, 0 section mismatches

Errors:
net/ipv4/inet_hashtables.c:669:12: error: ‘tcp_hashinfo’ undeclared (first use in this function); did you mean ‘raw_hashinfo’?

Warnings:
net/ipv4/inet_hashtables.c:608:68: warning: suggest parentheses around ‘+’ in operand of ‘&’ [-Wparentheses]

--------------------------------------------------------------------------------
shannon_defconfig (arm, gcc-10) — FAIL, 1 error, 1 warning, 0 section mismatches

Errors:
net/ipv4/inet_hashtables.c:669:12: error: ‘tcp_hashinfo’ undeclared (first use in this function); did you mean ‘raw_hashinfo’?

Warnings:
net/ipv4/inet_hashtables.c:608:68: warning: suggest parentheses around ‘+’ in operand of ‘&’ [-Wparentheses]

--------------------------------------------------------------------------------
shmobile_defconfig (arm, gcc-10) — FAIL, 1 error, 1 warning, 0 section mismatches

Errors:
net/ipv4/inet_hashtables.c:669:12: error: ‘tcp_hashinfo’ undeclared (first use in this function); did you mean ‘raw_hashinfo’?

Warnings:
net/ipv4/inet_hashtables.c:608:68: warning: suggest parentheses around ‘+’ in operand of ‘&’ [-Wparentheses]

--------------------------------------------------------------------------------
simpad_defconfig (arm, gcc-10) — FAIL, 1 error, 1 warning, 0 section mismatches

Errors:
net/ipv4/inet_hashtables.c:669:12: error: ‘tcp_hashinfo’ undeclared (first use in this function); did you mean ‘raw_hashinfo’?

Warnings:
net/ipv4/inet_hashtables.c:608:68: warning: suggest parentheses around ‘+’ in operand of ‘&’ [-Wparentheses]

--------------------------------------------------------------------------------
socfpga_defconfig (arm, gcc-10) — FAIL, 1 error, 1 warning, 0 section mismatches

Errors:
net/ipv4/inet_hashtables.c:669:12: error: ‘tcp_hashinfo’ undeclared (first use in this function); did you mean ‘raw_hashinfo’?

Warnings:
net/ipv4/inet_hashtables.c:608:68: warning: suggest parentheses around ‘+’ in operand of ‘&’ [-Wparentheses]

--------------------------------------------------------------------------------
spear13xx_defconfig (arm, gcc-10) — FAIL, 1 error, 1 warning, 0 section mismatches

Errors:
net/ipv4/inet_hashtables.c:669:12: error: ‘tcp_hashinfo’ undeclared (first use in this function); did you mean ‘raw_hashinfo’?

Warnings:
net/ipv4/inet_hashtables.c:608:68: warning: suggest parentheses around ‘+’ in operand of ‘&’ [-Wparentheses]

--------------------------------------------------------------------------------
spear3xx_defconfig (arm, gcc-10) — PASS, 0 errors, 0 warnings, 0 section mismatches

--------------------------------------------------------------------------------
spear6xx_defconfig (arm, gcc-10) — PASS, 0 errors, 0 warnings, 0 section mismatches

--------------------------------------------------------------------------------
spitz_defconfig (arm, gcc-10) — FAIL, 1 error, 1 warning, 0 section mismatches

Errors:
net/ipv4/inet_hashtables.c:669:12: error: ‘tcp_hashinfo’ undeclared (first use in this function); did you mean ‘raw_hashinfo’?

Warnings:
net/ipv4/inet_hashtables.c:608:68: warning: suggest parentheses around ‘+’ in operand of ‘&’ [-Wparentheses]

--------------------------------------------------------------------------------
stm32_defconfig (arm, gcc-10) — PASS, 0 errors, 0 warnings, 0 section mismatches

--------------------------------------------------------------------------------
sunxi_defconfig (arm, gcc-10) — FAIL, 1 error, 1 warning, 0 section mismatches

Errors:
net/ipv4/inet_hashtables.c:669:12: error: ‘tcp_hashinfo’ undeclared (first use in this function); did you mean ‘raw_hashinfo’?

Warnings:
net/ipv4/inet_hashtables.c:608:68: warning: suggest parentheses around ‘+’ in operand of ‘&’ [-Wparentheses]

--------------------------------------------------------------------------------
tb0219_defconfig (mips, gcc-10) — FAIL, 1 error, 1 warning, 0 section mismatches

Errors:
net/ipv4/inet_hashtables.c:669:12: error: ‘tcp_hashinfo’ undeclared (first use in this function); did you mean ‘raw_hashinfo’?

Warnings:
net/ipv4/inet_hashtables.c:608:68: warning: suggest parentheses around ‘+’ in operand of ‘&’ [-Wparentheses]

--------------------------------------------------------------------------------
tb0226_defconfig (mips, gcc-10) — FAIL, 1 error, 1 warning, 0 section mismatches

Errors:
net/ipv4/inet_hashtables.c:669:12: error: ‘tcp_hashinfo’ undeclared (first use in this function); did you mean ‘raw_hashinfo’?

Warnings:
net/ipv4/inet_hashtables.c:608:68: warning: suggest parentheses around ‘+’ in operand of ‘&’ [-Wparentheses]

--------------------------------------------------------------------------------
tb0287_defconfig (mips, gcc-10) — FAIL, 1 error, 1 warning, 0 section mismatches

Errors:
net/ipv4/inet_hashtables.c:669:12: error: ‘tcp_hashinfo’ undeclared (first use in this function); did you mean ‘raw_hashinfo’?

Warnings:
net/ipv4/inet_hashtables.c:608:68: warning: suggest parentheses around ‘+’ in operand of ‘&’ [-Wparentheses]

--------------------------------------------------------------------------------
tct_hammer_defconfig (arm, gcc-10) — PASS, 0 errors, 0 warnings, 0 section mismatches

--------------------------------------------------------------------------------
tegra_defconfig (arm, gcc-10) — FAIL, 1 error, 1 warning, 0 section mismatches

Errors:
net/ipv4/inet_hashtables.c:669:12: error: ‘tcp_hashinfo’ undeclared (first use in this function); did you mean ‘raw_hashinfo’?

Warnings:
net/ipv4/inet_hashtables.c:608:68: warning: suggest parentheses around ‘+’ in operand of ‘&’ [-Wparentheses]

--------------------------------------------------------------------------------
tinyconfig (mips, gcc-10) — PASS, 0 errors, 0 warnings, 0 section mismatches

--------------------------------------------------------------------------------
tinyconfig (arm, gcc-10) — PASS, 0 errors, 0 warnings, 0 section mismatches

--------------------------------------------------------------------------------
tinyconfig (x86_64, gcc-10) — PASS, 0 errors, 3 warnings, 0 section mismatches

Warnings:
arch/x86/entry/entry_64.S:487: Warning: no instruction mnemonic suffix given and no register operands; using default for `btr'
arch/x86/entry/entry_64.S:1642: Warning: no instruction mnemonic suffix given and no register operands; using default for `sysret'
arch/x86/kernel/process.c:456: Warning: no instruction mnemonic suffix given and no register operands; using default for `btr'

--------------------------------------------------------------------------------
tinyconfig (i386, gcc-10) — PASS, 0 errors, 0 warnings, 0 section mismatches

--------------------------------------------------------------------------------
tinyconfig (arc, gcc-10) — PASS, 0 errors, 0 warnings, 0 section mismatches

--------------------------------------------------------------------------------
trizeps4_defconfig (arm, gcc-10) — FAIL, 1 error, 1 warning, 0 section mismatches

Errors:
net/ipv4/inet_hashtables.c:669:12: error: ‘tcp_hashinfo’ undeclared (first use in this function); did you mean ‘raw_hashinfo’?

Warnings:
net/ipv4/inet_hashtables.c:608:68: warning: suggest parentheses around ‘+’ in operand of ‘&’ [-Wparentheses]

--------------------------------------------------------------------------------
u300_defconfig (arm, gcc-10) — PASS, 0 errors, 0 warnings, 0 section mismatches

--------------------------------------------------------------------------------
u8500_defconfig (arm, gcc-10) — FAIL, 1 error, 1 warning, 0 section mismatches

Errors:
net/ipv4/inet_hashtables.c:669:12: error: ‘tcp_hashinfo’ undeclared (first use in this function); did you mean ‘raw_hashinfo’?

Warnings:
net/ipv4/inet_hashtables.c:608:68: warning: suggest parentheses around ‘+’ in operand of ‘&’ [-Wparentheses]

--------------------------------------------------------------------------------
vdk_hs38_defconfig (arc, gcc-10) — FAIL, 1 error, 1 warning, 0 section mismatches

Errors:
net/ipv4/inet_hashtables.c:669:12: error: 'tcp_hashinfo' undeclared (first use in this function); did you mean 'raw_hashinfo'?

Warnings:
net/ipv4/inet_hashtables.c:608:68: warning: suggest parentheses around '+' in operand of '&' [-Wparentheses]

--------------------------------------------------------------------------------
vdk_hs38_smp_defconfig (arc, gcc-10) — FAIL, 1 error, 1 warning, 0 section mismatches

Errors:
net/ipv4/inet_hashtables.c:669:12: error: 'tcp_hashinfo' undeclared (first use in this function); did you mean 'raw_hashinfo'?

Warnings:
net/ipv4/inet_hashtables.c:608:68: warning: suggest parentheses around '+' in operand of '&' [-Wparentheses]

--------------------------------------------------------------------------------
versatile_defconfig (arm, gcc-10) — FAIL, 1 error, 1 warning, 0 section mismatches

Errors:
net/ipv4/inet_hashtables.c:669:12: error: ‘tcp_hashinfo’ undeclared (first use in this function); did you mean ‘raw_hashinfo’?

Warnings:
net/ipv4/inet_hashtables.c:608:68: warning: suggest parentheses around ‘+’ in operand of ‘&’ [-Wparentheses]

--------------------------------------------------------------------------------
vexpress_defconfig (arm, gcc-10) — FAIL, 1 error, 1 warning, 0 section mismatches

Errors:
net/ipv4/inet_hashtables.c:669:12: error: ‘tcp_hashinfo’ undeclared (first use in this function); did you mean ‘raw_hashinfo’?

Warnings:
net/ipv4/inet_hashtables.c:608:68: warning: suggest parentheses around ‘+’ in operand of ‘&’ [-Wparentheses]

--------------------------------------------------------------------------------
vf610m4_defconfig (arm, gcc-10) — PASS, 0 errors, 0 warnings, 0 section mismatches

--------------------------------------------------------------------------------
viper_defconfig (arm, gcc-10) — FAIL, 1 error, 1 warning, 0 section mismatches

Errors:
net/ipv4/inet_hashtables.c:669:12: error: ‘tcp_hashinfo’ undeclared (first use in this function); did you mean ‘raw_hashinfo’?

Warnings:
net/ipv4/inet_hashtables.c:608:68: warning: suggest parentheses around ‘+’ in operand of ‘&’ [-Wparentheses]

--------------------------------------------------------------------------------
vt8500_v6_v7_defconfig (arm, gcc-10) — FAIL, 1 error, 1 warning, 0 section mismatches

Errors:
net/ipv4/inet_hashtables.c:669:12: error: ‘tcp_hashinfo’ undeclared (first use in this function); did you mean ‘raw_hashinfo’?

Warnings:
net/ipv4/inet_hashtables.c:608:68: warning: suggest parentheses around ‘+’ in operand of ‘&’ [-Wparentheses]

--------------------------------------------------------------------------------
workpad_defconfig (mips, gcc-10) — FAIL, 1 error, 1 warning, 0 section mismatches

Errors:
net/ipv4/inet_hashtables.c:669:12: error: ‘tcp_hashinfo’ undeclared (first use in this function); did you mean ‘raw_hashinfo’?

Warnings:
net/ipv4/inet_hashtables.c:608:68: warning: suggest parentheses around ‘+’ in operand of ‘&’ [-Wparentheses]

--------------------------------------------------------------------------------
x86_64_defconfig (x86_64, gcc-10) — FAIL, 1 error, 5 warnings, 0 section mismatches

Errors:
net/ipv4/inet_hashtables.c:669:12: error: ‘tcp_hashinfo’ undeclared (first use in this function); did you mean ‘raw_hashinfo’?

Warnings:
arch/x86/entry/entry_64.S:487: Warning: no instruction mnemonic suffix given and no register operands; using default for `btr'
arch/x86/entry/entry_64.S:1642: Warning: no instruction mnemonic suffix given and no register operands; using default for `sysret'
arch/x86/kernel/process.c:456: Warning: no instruction mnemonic suffix given and no register operands; using default for `btr'
arch/x86/kernel/process.c:456: Warning: no instruction mnemonic suffix given and no register operands; using default for `btr'
net/ipv4/inet_hashtables.c:608:68: warning: suggest parentheses around ‘+’ in operand of ‘&’ [-Wparentheses]

--------------------------------------------------------------------------------
x86_64_defconfig+x86-chromebook (x86_64, gcc-10) — FAIL, 1 error, 5 warnings, 0 section mismatches

Errors:
net/ipv4/inet_hashtables.c:669:12: error: ‘tcp_hashinfo’ undeclared (first use in this function); did you mean ‘raw_hashinfo’?

Warnings:
arch/x86/entry/entry_64.S:487: Warning: no instruction mnemonic suffix given and no register operands; using default for `btr'
arch/x86/entry/entry_64.S:1642: Warning: no instruction mnemonic suffix given and no register operands; using default for `sysret'
arch/x86/kernel/process.c:456: Warning: no instruction mnemonic suffix given and no register operands; using default for `btr'
arch/x86/kernel/process.c:456: Warning: no instruction mnemonic suffix given and no register operands; using default for `btr'
net/ipv4/inet_hashtables.c:608:68: warning: suggest parentheses around ‘+’ in operand of ‘&’ [-Wparentheses]

--------------------------------------------------------------------------------
xcep_defconfig (arm, gcc-10) — FAIL, 1 error, 1 warning, 0 section mismatches

Errors:
net/ipv4/inet_hashtables.c:669:12: error: ‘tcp_hashinfo’ undeclared (first use in this function); did you mean ‘raw_hashinfo’?

Warnings:
net/ipv4/inet_hashtables.c:608:68: warning: suggest parentheses around ‘+’ in operand of ‘&’ [-Wparentheses]

--------------------------------------------------------------------------------
xilfpga_defconfig (mips, gcc-10) — PASS, 0 errors, 0 warnings, 0 section mismatches

--------------------------------------------------------------------------------
xway_defconfig (mips, gcc-10) — FAIL, 1 error, 1 warning, 0 section mismatches

Errors:
net/ipv4/inet_hashtables.c:669:12: error: ‘tcp_hashinfo’ undeclared (first use in this function); did you mean ‘raw_hashinfo’?

Warnings:
net/ipv4/inet_hashtables.c:608:68: warning: suggest parentheses around ‘+’ in operand of ‘&’ [-Wparentheses]

--------------------------------------------------------------------------------
zeus_defconfig (arm, gcc-10) — FAIL, 1 error, 1 warning, 0 section mismatches

Errors:
net/ipv4/inet_hashtables.c:669:12: error: ‘tcp_hashinfo’ undeclared (first use in this function); did you mean ‘raw_hashinfo’?

Warnings:
net/ipv4/inet_hashtables.c:608:68: warning: suggest parentheses around ‘+’ in operand of ‘&’ [-Wparentheses]

--------------------------------------------------------------------------------
zx_defconfig (arm, gcc-10) — PASS, 0 errors, 0 warnings, 0 section mismatches

---
For more info write to <info@...>


Re: [PATCH v2 5.10.y-cip 00/12] Add thermal driver and watchdog driver enhancements

Biju Das
 

Subject: Re: [PATCH v2 5.10.y-cip 00/12] Add thermal driver and watchdog
driver enhancements

Hi!

Thanks for the series and for the fixes headed for mainline. The
patches look good to me (but I can't test/apply them due to poor
network access at the moment).
Sorry for the late review.
I reviewed this patch series and found no pointout.

I can probably do that on Friday, but I suspect Iwamatsu may be
faster.
Yeah, I will apply this series and push.
I applied the series, tested it, and pushed out the result. Hopefully
that is okay.
Thank you.

Regards,
Biju


Re: [PATCH v2 5.10.y-cip 00/12] Add thermal driver and watchdog driver enhancements

Pavel Machek
 

Hi!

Thanks for the series and for the fixes headed for mainline. The patches look
good to me (but I can't test/apply them due to poor network access at the
moment).
Sorry for the late review.
I reviewed this patch series and found no pointout.

I can probably do that on Friday, but I suspect Iwamatsu may be
faster.
Yeah, I will apply this series and push.
I applied the series, tested it, and pushed out the result. Hopefully
that is okay.

Thanks for the patches, Biju.

Best regards,
Pavel
--
DENX Software Engineering GmbH, Managing Director: Wolfgang Denk
HRB 165235 Munich, Office: Kirchenstr.5, D-82194 Groebenzell, Germany


Re: Failures in 5.10, 4.4 testing

Hiraku Toyooka
 

Hi Pavel, Nobuhiro and lab maintainers,

Some of the labs are offline now due to some problem although I'm not
sure if it is related to
the failures found by Pavel-san (because labs seem to be online at that time),
https://lava.ciplatform.org/scheduler/allworkers

In any case, lab reboots (the rest are lab-cip-mentor and
lab-cip-renesas) will be needed.
# I brought the lab-cip-cybertrust (includes bbb-03) back online a
little while ago.

Best regards,
Hiraku Toyooka

On Sun, Jul 24, 2022 at 8:12 AM Nobuhiro Iwamatsu <iwamatsu@...> wrote:

Hi Pavel,

2022年7月24日(日) 6:05 Pavel Machek <pavel@...>:

Hi!

I see a lot of failures this week. 5.10.133-rc1:
https://gitlab.com/cip-project/cip-testing/linux-stable-rc-ci/-/pipelines/595045922

4.4:
https://gitlab.com/cip-project/cip-kernel/linux-cip/-/pipelines/595036439
(renesas failure is expected).

Is bbb expected to work in 4.4? What is going on with 5.10 testing?
Lava slave (Lava lab) seems to have NFS problems.

Best regards,
Nobuhiro

--
Nobuhiro Iwamatsu
iwamatsu at {nigauri.org / debian.org}
GPG ID: 40AD1FA6


--
Hiraku Toyooka
Cybertrust Japan Co., Ltd.


[isar-cip-core v2] security-customizations: Fix pam_tally2 deprecation

Venkata Pyla
 

From: venkata pyla <venkata.pyla@...>

pam_tally2 is deprecated from PAM version 1.4.0-7 that is from
Debian Bullseye, and introduced pam_faillock as replacement.

Modified the security customizations to check first pam_tally2 existence
for backward compatibility and if not found use the pam_faillock
instead to achieve the same functionality.

Fixes #33

Signed-off-by: venkata pyla <venkata.pyla@...>
---
.../security-customizations/files/postinst | 20 +++++++++++++++----
1 file changed, 16 insertions(+), 4 deletions(-)

diff --git a/recipes-core/security-customizations/files/postinst b/recipes-core/security-customizations/files/postinst
index 9ba8540..0d0eb07 100644
--- a/recipes-core/security-customizations/files/postinst
+++ b/recipes-core/security-customizations/files/postinst
@@ -22,11 +22,23 @@ sed -i "0,/^password.*/s/^password.*/${pam_cracklib_config}\n&/" "${PAM_PWD_FILE
# CR1.11: Unsuccessful login attempts
# Lock user account after unsuccessful login attempts
PAM_AUTH_FILE="/etc/pam.d/common-auth"
-pam_tally="auth required pam_tally2.so deny=3 even_deny_root unlock_time=60 root_unlock_time=60"
-if grep -c "pam_tally2.so" "${PAM_AUTH_FILE}";then
- sed -i '/pam_tally2/ s/^#*/#/' "${PAM_AUTH_FILE}"
+# pam_tally2 is deprecated from pam version 1.4.0-7
+if [ -f /lib/*-linux-gnu*/security/pam_tally2.so ]; then
+ PAM_MODULE="pam_tally2.so"
+ PAM_CONFIG="auth required pam_tally2.so deny=3 even_deny_root unlock_time=60 root_unlock_time=60"
+elif [ -f /lib/*-linux-gnu*/security/pam_faillock.so ]; then
+ PAM_MODULE="pam_faillock.so"
+ PAM_CONFIG="auth required pam_faillock.so preauth silent deny=3 even_deny_root unlock_time=60 root_unlock_time=60 \
+ \nauth required pam_faillock.so .so authfail deny=3 even_deny_root unlock_time=60 root_unlock_time=60"
+else
+ echo "No suitable pam module found to lock failed login attempts"
+ exit 1
fi
-sed -i "0,/^auth.*/s/^auth.*/${pam_tally}\n&/" "${PAM_AUTH_FILE}"
+
+if grep -c "${PAM_MODULE}" "${PAM_AUTH_FILE}";then
+ sed -i '/${PAM_MODULE}/ s/^#*/#/' "${PAM_AUTH_FILE}"
+fi
+sed -i "0,/^auth.*/s/^auth.*/${PAM_CONFIG}\n&/" "${PAM_AUTH_FILE}"

# CR2.6: Remote session termination
# Terminate remote session after inactive time period
--
2.20.1


Re: [isar-cip-core] security-customizations: Fix pam_tally2 deprecation

Venkata Pyla
 

-----Original Message-----
From: cip-dev@... <cip-dev@...> On Behalf Of
Jan Kiszka
Sent: 24 July 2022 20:22
To: pyla venkata(TSIP TMIEC ODG Porting) <Venkata.Pyla@toshiba-
tsip.com>; cip-dev@...
Cc: dinesh kumar(TSIP TMIEC ODG Porting) <dinesh.kumar@toshiba-
tsip.com>; hayashi kazuhiro(林 和宏 □SWC◯ACT)
<kazuhiro3.hayashi@...>
Subject: Re: [cip-dev] [isar-cip-core] security-customizations: Fix pam_tally2
deprecation

On 24.07.22 07:40, Venkata.Pyla@... wrote:


-----Original Message-----
From: Jan Kiszka <jan.kiszka@...>
Sent: 23 July 2022 22:54
To: pyla venkata(TSIP TMIEC ODG Porting) <Venkata.Pyla@toshiba-
tsip.com>; cip-dev@...
Cc: dinesh kumar(TSIP TMIEC ODG Porting) <dinesh.kumar@toshiba-
tsip.com>; hayashi kazuhiro(林 和宏 □SWC◯ACT)
<kazuhiro3.hayashi@...>
Subject: Re: [isar-cip-core] security-customizations: Fix pam_tally2
deprecation

On 21.07.22 08:59, venkata.pyla@... wrote:
From: venkata pyla <venkata.pyla@...>

pam_tally2 is deprecated from PAM version 1.4.0 that is from Debian
Bullseye, and introduced pam_faillock as replacement [1].

Modified the security customizations to check first pam_tally2
existence for backward compatibility and if not found use the
pam_faillock to achieve the same functionality.

Fixes #33

[1] https://github.com/linux-pam/linux-pam/releases/tag/v1.4.0

Signed-off-by: venkata pyla <venkata.pyla@...>
---
.../security-customizations/files/postinst | 19 +++++++++++++++----
1 file changed, 15 insertions(+), 4 deletions(-)

diff --git a/recipes-core/security-customizations/files/postinst
b/recipes-core/security-customizations/files/postinst
index 9ba8540..ae06ab7 100644
--- a/recipes-core/security-customizations/files/postinst
+++ b/recipes-core/security-customizations/files/postinst
@@ -22,11 +22,22 @@ sed -i
"0,/^password.*/s/^password.*/${pam_cracklib_config}\n&/"
"${PAM_PWD_FILE # CR1.11: Unsuccessful login attempts # Lock user
account after unsuccessful login attempts
PAM_AUTH_FILE="/etc/pam.d/common-auth"
-pam_tally="auth required pam_tally2.so deny=3 even_deny_root
unlock_time=60 root_unlock_time=60"
-if grep -c "pam_tally2.so" "${PAM_AUTH_FILE}";then
- sed -i '/pam_tally2/ s/^#*/#/' "${PAM_AUTH_FILE}"
+# pam_tally2 is deprecated from pam version 1.4.0-7 if [ -f
+/lib/*-linux-gnu*/security/pam_tally2.so ]; then
+ PAM_MODULE="pam_tally2.so"
+ PAM_CONFIG="auth required pam_tally2.so deny=3 even_deny_root
unlock_time=60 root_unlock_time=60"
+elif [ -f /lib/*-linux-gnu*/security/pam_faillock.so ]; then
+ PAM_MODULE="pam_faillock.so"
+ PAM_CONFIG="auth required pam_faillock.so preauth silent deny=3
even_deny_root unlock_time=60 root_unlock_time=60 \
+ \nauth required pam_faillock.so .so authfail deny=3
even_deny_root unlock_time=60 root_unlock_time=60"
+else
+ echo "No suitable pam module found to lock failed login attempts"
Shouldn't we rather fail (exit 1) in this case?
I tried not to fail in the middle of applying security configurations,
rather giving warning to the user and one can check later why this
configuration is not applied.
Will that not make it hard to track regressions? Keep in mind that we generally
have no interactive users here, rather automated imaging steps. Inside Isar, this
message will not be shown to anyway but a log file no one looks at when the
installation succeeds.
Thanks for the explanation, I understood now, the echo messages are not showing up during the build time and it is difficult to know to the user if the configuration is not applied due to failure.

I will correct this patch and resend v2.


Jan

--
Siemens AG, Technology
Competence Center Embedded Linux


Re: [isar-cip-core] security-customizations: Fix pam_tally2 deprecation

Jan Kiszka
 

On 24.07.22 07:40, Venkata.Pyla@... wrote:


-----Original Message-----
From: Jan Kiszka <jan.kiszka@...>
Sent: 23 July 2022 22:54
To: pyla venkata(TSIP TMIEC ODG Porting) <Venkata.Pyla@toshiba-
tsip.com>; cip-dev@...
Cc: dinesh kumar(TSIP TMIEC ODG Porting) <dinesh.kumar@toshiba-
tsip.com>; hayashi kazuhiro(林 和宏 □SWC◯ACT)
<kazuhiro3.hayashi@...>
Subject: Re: [isar-cip-core] security-customizations: Fix pam_tally2 deprecation

On 21.07.22 08:59, venkata.pyla@... wrote:
From: venkata pyla <venkata.pyla@...>

pam_tally2 is deprecated from PAM version 1.4.0 that is from Debian
Bullseye, and introduced pam_faillock as replacement [1].

Modified the security customizations to check first pam_tally2
existence for backward compatibility and if not found use the
pam_faillock to achieve the same functionality.

Fixes #33

[1] https://github.com/linux-pam/linux-pam/releases/tag/v1.4.0

Signed-off-by: venkata pyla <venkata.pyla@...>
---
.../security-customizations/files/postinst | 19 +++++++++++++++----
1 file changed, 15 insertions(+), 4 deletions(-)

diff --git a/recipes-core/security-customizations/files/postinst
b/recipes-core/security-customizations/files/postinst
index 9ba8540..ae06ab7 100644
--- a/recipes-core/security-customizations/files/postinst
+++ b/recipes-core/security-customizations/files/postinst
@@ -22,11 +22,22 @@ sed -i
"0,/^password.*/s/^password.*/${pam_cracklib_config}\n&/"
"${PAM_PWD_FILE # CR1.11: Unsuccessful login attempts # Lock user
account after unsuccessful login attempts
PAM_AUTH_FILE="/etc/pam.d/common-auth"
-pam_tally="auth required pam_tally2.so deny=3 even_deny_root
unlock_time=60 root_unlock_time=60"
-if grep -c "pam_tally2.so" "${PAM_AUTH_FILE}";then
- sed -i '/pam_tally2/ s/^#*/#/' "${PAM_AUTH_FILE}"
+# pam_tally2 is deprecated from pam version 1.4.0-7 if [ -f
+/lib/*-linux-gnu*/security/pam_tally2.so ]; then
+ PAM_MODULE="pam_tally2.so"
+ PAM_CONFIG="auth required pam_tally2.so deny=3 even_deny_root
unlock_time=60 root_unlock_time=60"
+elif [ -f /lib/*-linux-gnu*/security/pam_faillock.so ]; then
+ PAM_MODULE="pam_faillock.so"
+ PAM_CONFIG="auth required pam_faillock.so preauth silent deny=3
even_deny_root unlock_time=60 root_unlock_time=60 \
+ \nauth required pam_faillock.so .so authfail deny=3
even_deny_root unlock_time=60 root_unlock_time=60"
+else
+ echo "No suitable pam module found to lock failed login attempts"
Shouldn't we rather fail (exit 1) in this case?
I tried not to fail in the middle of applying security configurations,
rather giving warning to the user and one can check later why this configuration is not applied.
Will that not make it hard to track regressions? Keep in mind that we
generally have no interactive users here, rather automated imaging
steps. Inside Isar, this message will not be shown to anyway but a log
file no one looks at when the installation succeeds.

Jan

--
Siemens AG, Technology
Competence Center Embedded Linux


4.4-st20 -- Re: [cip-dev] Failures in 5.10, 4.4 testing

Pavel Machek
 

Hi!

I pushed 4.4-st20 to linux-4.4.y-st-rc tree. Testing does not work too
well at the moment, but I believe it is candidate for -st and -cip
releases.

Specifically testing that TCP still works in 4.4 and that privacy
fixes are effective would not be bad.

I would not mind someone reviewing "tcp: change source port
randomizarion at connect() time". In particular, 4.9 code has " %
remaining" there.

Best regards,
Pavel
--
DENX Software Engineering GmbH, Managing Director: Wolfgang Denk
HRB 165235 Munich, Office: Kirchenstr.5, D-82194 Groebenzell, Germany


Re: [isar-cip-core] security-customizations: Fix pam_tally2 deprecation

Venkata Pyla
 

-----Original Message-----
From: Jan Kiszka <jan.kiszka@...>
Sent: 23 July 2022 22:54
To: pyla venkata(TSIP TMIEC ODG Porting) <Venkata.Pyla@toshiba-
tsip.com>; cip-dev@...
Cc: dinesh kumar(TSIP TMIEC ODG Porting) <dinesh.kumar@toshiba-
tsip.com>; hayashi kazuhiro(林 和宏 □SWC◯ACT)
<kazuhiro3.hayashi@...>
Subject: Re: [isar-cip-core] security-customizations: Fix pam_tally2 deprecation

On 21.07.22 08:59, venkata.pyla@... wrote:
From: venkata pyla <venkata.pyla@...>

pam_tally2 is deprecated from PAM version 1.4.0 that is from Debian
Bullseye, and introduced pam_faillock as replacement [1].

Modified the security customizations to check first pam_tally2
existence for backward compatibility and if not found use the
pam_faillock to achieve the same functionality.

Fixes #33

[1] https://github.com/linux-pam/linux-pam/releases/tag/v1.4.0

Signed-off-by: venkata pyla <venkata.pyla@...>
---
.../security-customizations/files/postinst | 19 +++++++++++++++----
1 file changed, 15 insertions(+), 4 deletions(-)

diff --git a/recipes-core/security-customizations/files/postinst
b/recipes-core/security-customizations/files/postinst
index 9ba8540..ae06ab7 100644
--- a/recipes-core/security-customizations/files/postinst
+++ b/recipes-core/security-customizations/files/postinst
@@ -22,11 +22,22 @@ sed -i
"0,/^password.*/s/^password.*/${pam_cracklib_config}\n&/"
"${PAM_PWD_FILE # CR1.11: Unsuccessful login attempts # Lock user
account after unsuccessful login attempts
PAM_AUTH_FILE="/etc/pam.d/common-auth"
-pam_tally="auth required pam_tally2.so deny=3 even_deny_root
unlock_time=60 root_unlock_time=60"
-if grep -c "pam_tally2.so" "${PAM_AUTH_FILE}";then
- sed -i '/pam_tally2/ s/^#*/#/' "${PAM_AUTH_FILE}"
+# pam_tally2 is deprecated from pam version 1.4.0-7 if [ -f
+/lib/*-linux-gnu*/security/pam_tally2.so ]; then
+ PAM_MODULE="pam_tally2.so"
+ PAM_CONFIG="auth required pam_tally2.so deny=3 even_deny_root
unlock_time=60 root_unlock_time=60"
+elif [ -f /lib/*-linux-gnu*/security/pam_faillock.so ]; then
+ PAM_MODULE="pam_faillock.so"
+ PAM_CONFIG="auth required pam_faillock.so preauth silent deny=3
even_deny_root unlock_time=60 root_unlock_time=60 \
+ \nauth required pam_faillock.so .so authfail deny=3
even_deny_root unlock_time=60 root_unlock_time=60"
+else
+ echo "No suitable pam module found to lock failed login attempts"
Shouldn't we rather fail (exit 1) in this case?
I tried not to fail in the middle of applying security configurations,
rather giving warning to the user and one can check later why this configuration is not applied.


fi
-sed -i "0,/^auth.*/s/^auth.*/${pam_tally}\n&/" "${PAM_AUTH_FILE}"
+
+if grep -c "${PAM_MODULE}" "${PAM_AUTH_FILE}";then
+ sed -i '/${PAM_MODULE}/ s/^#*/#/' "${PAM_AUTH_FILE}"
+fi
+sed -i "0,/^auth.*/s/^auth.*/${PAM_CONFIG}\n&/" "${PAM_AUTH_FILE}"

# CR2.6: Remote session termination
# Terminate remote session after inactive time period
Jan

--
Siemens AG, Technology
Competence Center Embedded Linux


Re: Failures in 5.10, 4.4 testing

Nobuhiro Iwamatsu
 

Hi Pavel,

2022年7月24日(日) 6:05 Pavel Machek <pavel@...>:

Hi!

I see a lot of failures this week. 5.10.133-rc1:
https://gitlab.com/cip-project/cip-testing/linux-stable-rc-ci/-/pipelines/595045922

4.4:
https://gitlab.com/cip-project/cip-kernel/linux-cip/-/pipelines/595036439
(renesas failure is expected).

Is bbb expected to work in 4.4? What is going on with 5.10 testing?
Lava slave (Lava lab) seems to have NFS problems.

Best regards,
Nobuhiro

--
Nobuhiro Iwamatsu
iwamatsu at {nigauri.org / debian.org}
GPG ID: 40AD1FA6


Failures in 5.10, 4.4 testing

Pavel Machek
 

Hi!

I see a lot of failures this week. 5.10.133-rc1:
https://gitlab.com/cip-project/cip-testing/linux-stable-rc-ci/-/pipelines/595045922

4.4:
https://gitlab.com/cip-project/cip-kernel/linux-cip/-/pipelines/595036439
(renesas failure is expected).

Is bbb expected to work in 4.4? What is going on with 5.10 testing?

Best regards,
Pavel

--
DENX Software Engineering GmbH, Managing Director: Wolfgang Denk
HRB 165235 Munich, Office: Kirchenstr.5, D-82194 Groebenzell, Germany


Re: [isar-cip-core] security-customizations: Fix pam_tally2 deprecation

Jan Kiszka
 

On 21.07.22 08:59, venkata.pyla@... wrote:
From: venkata pyla <venkata.pyla@...>

pam_tally2 is deprecated from PAM version 1.4.0 that is from
Debian Bullseye, and introduced pam_faillock as replacement [1].

Modified the security customizations to check first pam_tally2 existence
for backward compatibility and if not found use the pam_faillock to
achieve the same functionality.

Fixes #33

[1] https://github.com/linux-pam/linux-pam/releases/tag/v1.4.0

Signed-off-by: venkata pyla <venkata.pyla@...>
---
.../security-customizations/files/postinst | 19 +++++++++++++++----
1 file changed, 15 insertions(+), 4 deletions(-)

diff --git a/recipes-core/security-customizations/files/postinst b/recipes-core/security-customizations/files/postinst
index 9ba8540..ae06ab7 100644
--- a/recipes-core/security-customizations/files/postinst
+++ b/recipes-core/security-customizations/files/postinst
@@ -22,11 +22,22 @@ sed -i "0,/^password.*/s/^password.*/${pam_cracklib_config}\n&/" "${PAM_PWD_FILE
# CR1.11: Unsuccessful login attempts
# Lock user account after unsuccessful login attempts
PAM_AUTH_FILE="/etc/pam.d/common-auth"
-pam_tally="auth required pam_tally2.so deny=3 even_deny_root unlock_time=60 root_unlock_time=60"
-if grep -c "pam_tally2.so" "${PAM_AUTH_FILE}";then
- sed -i '/pam_tally2/ s/^#*/#/' "${PAM_AUTH_FILE}"
+# pam_tally2 is deprecated from pam version 1.4.0-7
+if [ -f /lib/*-linux-gnu*/security/pam_tally2.so ]; then
+ PAM_MODULE="pam_tally2.so"
+ PAM_CONFIG="auth required pam_tally2.so deny=3 even_deny_root unlock_time=60 root_unlock_time=60"
+elif [ -f /lib/*-linux-gnu*/security/pam_faillock.so ]; then
+ PAM_MODULE="pam_faillock.so"
+ PAM_CONFIG="auth required pam_faillock.so preauth silent deny=3 even_deny_root unlock_time=60 root_unlock_time=60 \
+ \nauth required pam_faillock.so .so authfail deny=3 even_deny_root unlock_time=60 root_unlock_time=60"
+else
+ echo "No suitable pam module found to lock failed login attempts"
Shouldn't we rather fail (exit 1) in this case?

fi
-sed -i "0,/^auth.*/s/^auth.*/${pam_tally}\n&/" "${PAM_AUTH_FILE}"
+
+if grep -c "${PAM_MODULE}" "${PAM_AUTH_FILE}";then
+ sed -i '/${PAM_MODULE}/ s/^#*/#/' "${PAM_AUTH_FILE}"
+fi
+sed -i "0,/^auth.*/s/^auth.*/${PAM_CONFIG}\n&/" "${PAM_AUTH_FILE}"

# CR2.6: Remote session termination
# Terminate remote session after inactive time period
Jan

--
Siemens AG, Technology
Competence Center Embedded Linux


cip-gitlab/ci/iwamatsu/linux-4.19.y-cip-rc smc: 11 runs, 2 regressions (v4.19.251-cip77-82-g10c370b53152) #kernelci

kernelci.org bot <bot@...>
 

cip-gitlab/ci/iwamatsu/linux-4.19.y-cip-rc smc: 11 runs, 2 regressions (v4.19.251-cip77-82-g10c370b53152)

Regressions Summary
-------------------

platform | arch | lab | compiler | defconfig | regressions
----------------------+-------+-------------+----------+----------------------------+------------
qemu_arm64-virt-gicv3 | arm64 | lab-broonie | gcc-10 | defconfig | 1
qemu_arm64-virt-gicv3 | arm64 | lab-broonie | gcc-10 | defconfig+arm64-chromebook | 1

Details: https://kernelci.org/test/job/cip-gitlab/branch/ci%2Fiwamatsu%2Flinux-4.19.y-cip-rc/kernel/v4.19.251-cip77-82-g10c370b53152/plan/smc/

Test: smc
Tree: cip-gitlab
Branch: ci/iwamatsu/linux-4.19.y-cip-rc
Describe: v4.19.251-cip77-82-g10c370b53152
URL: https://gitlab.com/cip-project/cip-kernel/linux-cip.git
SHA: 10c370b53152e01c8282be083dc0943e33d50ead


Test Regressions
----------------


platform | arch | lab | compiler | defconfig | regressions
----------------------+-------+-------------+----------+----------------------------+------------
qemu_arm64-virt-gicv3 | arm64 | lab-broonie | gcc-10 | defconfig | 1

Details: https://kernelci.org/test/plan/id/62da59c84b0ef31303daf06f

Results: 0 PASS, 1 FAIL, 0 SKIP
Full config: defconfig
Compiler: gcc-10 (aarch64-linux-gnu-gcc (Debian 10.2.1-6) 10.2.1 20210110)
Plain log: https://storage.kernelci.org//cip-gitlab/ci-iwamatsu-linux-4.19.y-cip-rc/v4.19.251-cip77-82-g10c370b53152/arm64/defconfig/gcc-10/lab-broonie/smc-qemu_arm64-virt-gicv3.txt
HTML log: https://storage.kernelci.org//cip-gitlab/ci-iwamatsu-linux-4.19.y-cip-rc/v4.19.251-cip77-82-g10c370b53152/arm64/defconfig/gcc-10/lab-broonie/smc-qemu_arm64-virt-gicv3.html
Rootfs: http://storage.kernelci.org/images/rootfs/buildroot/buildroot-baseline/20220716.0/arm64/rootfs.cpio.gz


* smc.login: https://kernelci.org/test/case/id/62da59c84b0ef31303daf070
failing since 45 days (last pass: v4.19.239-cip72-68-g407458469172, first fail: v4.19.245-cip74-32-g2d021d7a9e637)



platform | arch | lab | compiler | defconfig | regressions
----------------------+-------+-------------+----------+----------------------------+------------
qemu_arm64-virt-gicv3 | arm64 | lab-broonie | gcc-10 | defconfig+arm64-chromebook | 1

Details: https://kernelci.org/test/plan/id/62da5b1c9fffdc60bbdaf068

Results: 0 PASS, 1 FAIL, 0 SKIP
Full config: defconfig+arm64-chromebook
Compiler: gcc-10 (aarch64-linux-gnu-gcc (Debian 10.2.1-6) 10.2.1 20210110)
Plain log: https://storage.kernelci.org//cip-gitlab/ci-iwamatsu-linux-4.19.y-cip-rc/v4.19.251-cip77-82-g10c370b53152/arm64/defconfig+arm64-chromebook/gcc-10/lab-broonie/smc-qemu_arm64-virt-gicv3.txt
HTML log: https://storage.kernelci.org//cip-gitlab/ci-iwamatsu-linux-4.19.y-cip-rc/v4.19.251-cip77-82-g10c370b53152/arm64/defconfig+arm64-chromebook/gcc-10/lab-broonie/smc-qemu_arm64-virt-gicv3.html
Rootfs: http://storage.kernelci.org/images/rootfs/buildroot/buildroot-baseline/20220716.0/arm64/rootfs.cpio.gz


* smc.login: https://kernelci.org/test/case/id/62da5b1c9fffdc60bbdaf069
failing since 45 days (last pass: v4.19.239-cip72-68-g407458469172, first fail: v4.19.245-cip74-32-g2d021d7a9e637)


cip-gitlab/ci/iwamatsu/linux-4.19.y-cip-rc ltp-timers: 11 runs, 2 regressions (v4.19.251-cip77-82-g10c370b53152) #kernelci

kernelci.org bot <bot@...>
 

cip-gitlab/ci/iwamatsu/linux-4.19.y-cip-rc ltp-timers: 11 runs, 2 regressions (v4.19.251-cip77-82-g10c370b53152)

Regressions Summary
-------------------

platform | arch | lab | compiler | defconfig | regressions
-------------------------+-------+---------+----------+----------------------------+------------
r8a774a1-hihope-rzg2m-ex | arm64 | lab-cip | gcc-10 | defconfig | 1
r8a774a1-hihope-rzg2m-ex | arm64 | lab-cip | gcc-10 | defconfig+arm64-chromebook | 1

Details: https://kernelci.org/test/job/cip-gitlab/branch/ci%2Fiwamatsu%2Flinux-4.19.y-cip-rc/kernel/v4.19.251-cip77-82-g10c370b53152/plan/ltp-timers/

Test: ltp-timers
Tree: cip-gitlab
Branch: ci/iwamatsu/linux-4.19.y-cip-rc
Describe: v4.19.251-cip77-82-g10c370b53152
URL: https://gitlab.com/cip-project/cip-kernel/linux-cip.git
SHA: 10c370b53152e01c8282be083dc0943e33d50ead

Test suite revisions:
ltp-tests
URL: https://github.com/linux-test-project/ltp.git
SHA: bda92ad659a52d38ac810099f69adff626b064c6


Test Regressions
----------------


platform | arch | lab | compiler | defconfig | regressions
-------------------------+-------+---------+----------+----------------------------+------------
r8a774a1-hihope-rzg2m-ex | arm64 | lab-cip | gcc-10 | defconfig | 1

Details: https://kernelci.org/test/plan/id/62da583a1454fa8b22daf05e

Results: 0 PASS, 1 FAIL, 0 SKIP
Full config: defconfig
Compiler: gcc-10 (aarch64-linux-gnu-gcc (Debian 10.2.1-6) 10.2.1 20210110)
Plain log: https://storage.kernelci.org//cip-gitlab/ci-iwamatsu-linux-4.19.y-cip-rc/v4.19.251-cip77-82-g10c370b53152/arm64/defconfig/gcc-10/lab-cip/ltp-timers-r8a774a1-hihope-rzg2m-ex.txt
HTML log: https://storage.kernelci.org//cip-gitlab/ci-iwamatsu-linux-4.19.y-cip-rc/v4.19.251-cip77-82-g10c370b53152/arm64/defconfig/gcc-10/lab-cip/ltp-timers-r8a774a1-hihope-rzg2m-ex.html
Rootfs: http://storage.kernelci.org/images/rootfs/debian/bullseye-ltp/20220716.0/arm64/initrd.cpio.gz


* ltp-timers.login: https://kernelci.org/test/case/id/62da583a1454fa8b22daf05f
new failure (last pass: v4.19.249-cip76-57-gef3cc1b9e556)



platform | arch | lab | compiler | defconfig | regressions
-------------------------+-------+---------+----------+----------------------------+------------
r8a774a1-hihope-rzg2m-ex | arm64 | lab-cip | gcc-10 | defconfig+arm64-chromebook | 1

Details: https://kernelci.org/test/plan/id/62da65e5ee6dcc6b29daf056

Results: 0 PASS, 1 FAIL, 0 SKIP
Full config: defconfig+arm64-chromebook
Compiler: gcc-10 (aarch64-linux-gnu-gcc (Debian 10.2.1-6) 10.2.1 20210110)
Plain log: https://storage.kernelci.org//cip-gitlab/ci-iwamatsu-linux-4.19.y-cip-rc/v4.19.251-cip77-82-g10c370b53152/arm64/defconfig+arm64-chromebook/gcc-10/lab-cip/ltp-timers-r8a774a1-hihope-rzg2m-ex.txt
HTML log: https://storage.kernelci.org//cip-gitlab/ci-iwamatsu-linux-4.19.y-cip-rc/v4.19.251-cip77-82-g10c370b53152/arm64/defconfig+arm64-chromebook/gcc-10/lab-cip/ltp-timers-r8a774a1-hihope-rzg2m-ex.html
Rootfs: http://storage.kernelci.org/images/rootfs/debian/bullseye-ltp/20220716.0/arm64/initrd.cpio.gz


* ltp-timers.login: https://kernelci.org/test/case/id/62da65e5ee6dcc6b29daf057
new failure (last pass: v4.19.249-cip76-57-gef3cc1b9e556)

361 - 380 of 9267