Date   

cip-gitlab/ci/iwamatsu/linux-5.10.y-cip-rc kselftest-filesystems: 8 runs, 1 regressions (v5.10.129-cip12-12-ge4e007863cc76) #kernelci

kernelci.org bot <bot@...>
 

cip-gitlab/ci/iwamatsu/linux-5.10.y-cip-rc kselftest-filesystems: 8 runs, 1 regressions (v5.10.129-cip12-12-ge4e007863cc76)

Regressions Summary
-------------------

platform | arch | lab | compiler | defconfig | regressions
-------------------------+-------+---------+----------+----------------------------+------------
r8a774a1-hihope-rzg2m-ex | arm64 | lab-cip | gcc-10 | defconfig+arm64-chromebook | 1

Details: https://kernelci.org/test/job/cip-gitlab/branch/ci%2Fiwamatsu%2Flinux-5.10.y-cip-rc/kernel/v5.10.129-cip12-12-ge4e007863cc76/plan/kselftest-filesystems/

Test: kselftest-filesystems
Tree: cip-gitlab
Branch: ci/iwamatsu/linux-5.10.y-cip-rc
Describe: v5.10.129-cip12-12-ge4e007863cc76
URL: https://gitlab.com/cip-project/cip-kernel/linux-cip.git
SHA: e4e007863cc767efd75ca69c0b98e5daab0c20ff


Test Regressions
----------------


platform | arch | lab | compiler | defconfig | regressions
-------------------------+-------+---------+----------+----------------------------+------------
r8a774a1-hihope-rzg2m-ex | arm64 | lab-cip | gcc-10 | defconfig+arm64-chromebook | 1

Details: https://kernelci.org/test/plan/id/62d91c7f5467f861fedaf09c

Results: 0 PASS, 1 FAIL, 0 SKIP
Full config: defconfig+arm64-chromebook
Compiler: gcc-10 (aarch64-linux-gnu-gcc (Debian 10.2.1-6) 10.2.1 20210110)
Plain log: https://storage.kernelci.org//cip-gitlab/ci-iwamatsu-linux-5.10.y-cip-rc/v5.10.129-cip12-12-ge4e007863cc76/arm64/defconfig+arm64-chromebook/gcc-10/lab-cip/kselftest-filesystems-r8a774a1-hihope-rzg2m-ex.txt
HTML log: https://storage.kernelci.org//cip-gitlab/ci-iwamatsu-linux-5.10.y-cip-rc/v5.10.129-cip12-12-ge4e007863cc76/arm64/defconfig+arm64-chromebook/gcc-10/lab-cip/kselftest-filesystems-r8a774a1-hihope-rzg2m-ex.html
Rootfs: http://storage.kernelci.org/images/rootfs/debian/bullseye-kselftest/20220716.0/arm64/initrd.cpio.gz


* kselftest-filesystems.login: https://kernelci.org/test/case/id/62d91c7f5467f861fedaf09d
new failure (last pass: v5.10.126-cip11-116-gef362fbbff528)


cip-gitlab/ci/iwamatsu/linux-5.10.y-cip-rc baseline: 116 runs, 13 regressions (v5.10.129-cip12-12-ge4e007863cc76) #kernelci

kernelci.org bot <bot@...>
 

cip-gitlab/ci/iwamatsu/linux-5.10.y-cip-rc baseline: 116 runs, 13 regressions (v5.10.129-cip12-12-ge4e007863cc76)

Regressions Summary
-------------------

platform | arch | lab | compiler | defconfig | regressions
---------------------------+-------+---------------+----------+----------------------------+------------
jetson-tk1 | arm | lab-baylibre | gcc-10 | multi_v7_defconfig | 1
jetson-tk1 | arm | lab-baylibre | gcc-10 | tegra_defconfig | 1
qemu_arm64-virt-gicv2 | arm64 | lab-baylibre | gcc-10 | defconfig+arm64-chromebook | 1
qemu_arm64-virt-gicv2 | arm64 | lab-broonie | gcc-10 | defconfig+arm64-chromebook | 1
qemu_arm64-virt-gicv2-uefi | arm64 | lab-baylibre | gcc-10 | defconfig+arm64-chromebook | 1
qemu_arm64-virt-gicv2-uefi | arm64 | lab-broonie | gcc-10 | defconfig+arm64-chromebook | 1
qemu_arm64-virt-gicv3 | arm64 | lab-baylibre | gcc-10 | defconfig+arm64-chromebook | 1
qemu_arm64-virt-gicv3 | arm64 | lab-broonie | gcc-10 | defconfig+arm64-chromebook | 1
qemu_arm64-virt-gicv3-uefi | arm64 | lab-baylibre | gcc-10 | defconfig+arm64-chromebook | 1
qemu_arm64-virt-gicv3-uefi | arm64 | lab-broonie | gcc-10 | defconfig+arm64-chromebook | 1
r8a774a1-hihope-rzg2m-ex | arm64 | lab-cip | gcc-10 | defconfig+arm64-chromebook | 1
rk3399-gru-kevin | arm64 | lab-collabora | gcc-10 | defconfig+arm64-chromebook | 1
tegra124-nyan-big | arm | lab-collabora | gcc-10 | multi_v7_defconfig | 1

Details: https://kernelci.org/test/job/cip-gitlab/branch/ci%2Fiwamatsu%2Flinux-5.10.y-cip-rc/kernel/v5.10.129-cip12-12-ge4e007863cc76/plan/baseline/

Test: baseline
Tree: cip-gitlab
Branch: ci/iwamatsu/linux-5.10.y-cip-rc
Describe: v5.10.129-cip12-12-ge4e007863cc76
URL: https://gitlab.com/cip-project/cip-kernel/linux-cip.git
SHA: e4e007863cc767efd75ca69c0b98e5daab0c20ff


Test Regressions
----------------


platform | arch | lab | compiler | defconfig | regressions
---------------------------+-------+---------------+----------+----------------------------+------------
jetson-tk1 | arm | lab-baylibre | gcc-10 | multi_v7_defconfig | 1

Details: https://kernelci.org/test/plan/id/62d91f79fafc8c99f9daf05e

Results: 0 PASS, 1 FAIL, 0 SKIP
Full config: multi_v7_defconfig
Compiler: gcc-10 (arm-linux-gnueabihf-gcc (Debian 10.2.1-6) 10.2.1 20210110)
Plain log: https://storage.kernelci.org//cip-gitlab/ci-iwamatsu-linux-5.10.y-cip-rc/v5.10.129-cip12-12-ge4e007863cc76/arm/multi_v7_defconfig/gcc-10/lab-baylibre/baseline-jetson-tk1.txt
HTML log: https://storage.kernelci.org//cip-gitlab/ci-iwamatsu-linux-5.10.y-cip-rc/v5.10.129-cip12-12-ge4e007863cc76/arm/multi_v7_defconfig/gcc-10/lab-baylibre/baseline-jetson-tk1.html
Rootfs: http://storage.kernelci.org/images/rootfs/buildroot/buildroot-baseline/20220716.0/armel/rootfs.cpio.gz


* baseline.login: https://kernelci.org/test/case/id/62d91f79fafc8c99f9daf05f
failing since 51 days (last pass: v5.10.112-cip6-289-g2969e096d186, first fail: v5.10.118-465-g0af29783a3c9)



platform | arch | lab | compiler | defconfig | regressions
---------------------------+-------+---------------+----------+----------------------------+------------
jetson-tk1 | arm | lab-baylibre | gcc-10 | tegra_defconfig | 1

Details: https://kernelci.org/test/plan/id/62d91cbca64ee53e80daf074

Results: 0 PASS, 1 FAIL, 0 SKIP
Full config: tegra_defconfig
Compiler: gcc-10 (arm-linux-gnueabihf-gcc (Debian 10.2.1-6) 10.2.1 20210110)
Plain log: https://storage.kernelci.org//cip-gitlab/ci-iwamatsu-linux-5.10.y-cip-rc/v5.10.129-cip12-12-ge4e007863cc76/arm/tegra_defconfig/gcc-10/lab-baylibre/baseline-jetson-tk1.txt
HTML log: https://storage.kernelci.org//cip-gitlab/ci-iwamatsu-linux-5.10.y-cip-rc/v5.10.129-cip12-12-ge4e007863cc76/arm/tegra_defconfig/gcc-10/lab-baylibre/baseline-jetson-tk1.html
Rootfs: http://storage.kernelci.org/images/rootfs/buildroot/buildroot-baseline/20220716.0/armel/rootfs.cpio.gz


* baseline.login: https://kernelci.org/test/case/id/62d91cbca64ee53e80daf075
failing since 51 days (last pass: v5.10.112-cip6-289-g2969e096d186, first fail: v5.10.118-465-g0af29783a3c9)



platform | arch | lab | compiler | defconfig | regressions
---------------------------+-------+---------------+----------+----------------------------+------------
qemu_arm64-virt-gicv2 | arm64 | lab-baylibre | gcc-10 | defconfig+arm64-chromebook | 1

Details: https://kernelci.org/test/plan/id/62d91c0aeb83c54da5daf07a

Results: 0 PASS, 1 FAIL, 0 SKIP
Full config: defconfig+arm64-chromebook
Compiler: gcc-10 (aarch64-linux-gnu-gcc (Debian 10.2.1-6) 10.2.1 20210110)
Plain log: https://storage.kernelci.org//cip-gitlab/ci-iwamatsu-linux-5.10.y-cip-rc/v5.10.129-cip12-12-ge4e007863cc76/arm64/defconfig+arm64-chromebook/gcc-10/lab-baylibre/baseline-qemu_arm64-virt-gicv2.txt
HTML log: https://storage.kernelci.org//cip-gitlab/ci-iwamatsu-linux-5.10.y-cip-rc/v5.10.129-cip12-12-ge4e007863cc76/arm64/defconfig+arm64-chromebook/gcc-10/lab-baylibre/baseline-qemu_arm64-virt-gicv2.html
Rootfs: http://storage.kernelci.org/images/rootfs/buildroot/buildroot-baseline/20220716.0/arm64/rootfs.cpio.gz


* baseline.login: https://kernelci.org/test/case/id/62d91c0aeb83c54da5daf07b
failing since 69 days (last pass: v5.10.112-cip6-88-gf3397cadb2dd6, first fail: v5.10.112-cip6-289-g2969e096d186)



platform | arch | lab | compiler | defconfig | regressions
---------------------------+-------+---------------+----------+----------------------------+------------
qemu_arm64-virt-gicv2 | arm64 | lab-broonie | gcc-10 | defconfig+arm64-chromebook | 1

Details: https://kernelci.org/test/plan/id/62d91c16cf8ba45c7fdaf075

Results: 0 PASS, 1 FAIL, 0 SKIP
Full config: defconfig+arm64-chromebook
Compiler: gcc-10 (aarch64-linux-gnu-gcc (Debian 10.2.1-6) 10.2.1 20210110)
Plain log: https://storage.kernelci.org//cip-gitlab/ci-iwamatsu-linux-5.10.y-cip-rc/v5.10.129-cip12-12-ge4e007863cc76/arm64/defconfig+arm64-chromebook/gcc-10/lab-broonie/baseline-qemu_arm64-virt-gicv2.txt
HTML log: https://storage.kernelci.org//cip-gitlab/ci-iwamatsu-linux-5.10.y-cip-rc/v5.10.129-cip12-12-ge4e007863cc76/arm64/defconfig+arm64-chromebook/gcc-10/lab-broonie/baseline-qemu_arm64-virt-gicv2.html
Rootfs: http://storage.kernelci.org/images/rootfs/buildroot/buildroot-baseline/20220716.0/arm64/rootfs.cpio.gz


* baseline.login: https://kernelci.org/test/case/id/62d91c16cf8ba45c7fdaf076
failing since 69 days (last pass: v5.10.112-cip6-88-gf3397cadb2dd6, first fail: v5.10.112-cip6-289-g2969e096d186)



platform | arch | lab | compiler | defconfig | regressions
---------------------------+-------+---------------+----------+----------------------------+------------
qemu_arm64-virt-gicv2-uefi | arm64 | lab-baylibre | gcc-10 | defconfig+arm64-chromebook | 1

Details: https://kernelci.org/test/plan/id/62d91c0cb0bf8fc6d5daf05a

Results: 0 PASS, 1 FAIL, 0 SKIP
Full config: defconfig+arm64-chromebook
Compiler: gcc-10 (aarch64-linux-gnu-gcc (Debian 10.2.1-6) 10.2.1 20210110)
Plain log: https://storage.kernelci.org//cip-gitlab/ci-iwamatsu-linux-5.10.y-cip-rc/v5.10.129-cip12-12-ge4e007863cc76/arm64/defconfig+arm64-chromebook/gcc-10/lab-baylibre/baseline-qemu_arm64-virt-gicv2-uefi.txt
HTML log: https://storage.kernelci.org//cip-gitlab/ci-iwamatsu-linux-5.10.y-cip-rc/v5.10.129-cip12-12-ge4e007863cc76/arm64/defconfig+arm64-chromebook/gcc-10/lab-baylibre/baseline-qemu_arm64-virt-gicv2-uefi.html
Rootfs: http://storage.kernelci.org/images/rootfs/buildroot/buildroot-baseline/20220716.0/arm64/rootfs.cpio.gz


* baseline.login: https://kernelci.org/test/case/id/62d91c0cb0bf8fc6d5daf05b
failing since 69 days (last pass: v5.10.112-cip6-88-gf3397cadb2dd6, first fail: v5.10.112-cip6-289-g2969e096d186)



platform | arch | lab | compiler | defconfig | regressions
---------------------------+-------+---------------+----------+----------------------------+------------
qemu_arm64-virt-gicv2-uefi | arm64 | lab-broonie | gcc-10 | defconfig+arm64-chromebook | 1

Details: https://kernelci.org/test/plan/id/62d91c2ab0bf8fc6d5daf088

Results: 0 PASS, 1 FAIL, 0 SKIP
Full config: defconfig+arm64-chromebook
Compiler: gcc-10 (aarch64-linux-gnu-gcc (Debian 10.2.1-6) 10.2.1 20210110)
Plain log: https://storage.kernelci.org//cip-gitlab/ci-iwamatsu-linux-5.10.y-cip-rc/v5.10.129-cip12-12-ge4e007863cc76/arm64/defconfig+arm64-chromebook/gcc-10/lab-broonie/baseline-qemu_arm64-virt-gicv2-uefi.txt
HTML log: https://storage.kernelci.org//cip-gitlab/ci-iwamatsu-linux-5.10.y-cip-rc/v5.10.129-cip12-12-ge4e007863cc76/arm64/defconfig+arm64-chromebook/gcc-10/lab-broonie/baseline-qemu_arm64-virt-gicv2-uefi.html
Rootfs: http://storage.kernelci.org/images/rootfs/buildroot/buildroot-baseline/20220716.0/arm64/rootfs.cpio.gz


* baseline.login: https://kernelci.org/test/case/id/62d91c2ab0bf8fc6d5daf089
failing since 69 days (last pass: v5.10.112-cip6-88-gf3397cadb2dd6, first fail: v5.10.112-cip6-289-g2969e096d186)



platform | arch | lab | compiler | defconfig | regressions
---------------------------+-------+---------------+----------+----------------------------+------------
qemu_arm64-virt-gicv3 | arm64 | lab-baylibre | gcc-10 | defconfig+arm64-chromebook | 1

Details: https://kernelci.org/test/plan/id/62d91c0ecf8ba45c7fdaf06d

Results: 0 PASS, 1 FAIL, 0 SKIP
Full config: defconfig+arm64-chromebook
Compiler: gcc-10 (aarch64-linux-gnu-gcc (Debian 10.2.1-6) 10.2.1 20210110)
Plain log: https://storage.kernelci.org//cip-gitlab/ci-iwamatsu-linux-5.10.y-cip-rc/v5.10.129-cip12-12-ge4e007863cc76/arm64/defconfig+arm64-chromebook/gcc-10/lab-baylibre/baseline-qemu_arm64-virt-gicv3.txt
HTML log: https://storage.kernelci.org//cip-gitlab/ci-iwamatsu-linux-5.10.y-cip-rc/v5.10.129-cip12-12-ge4e007863cc76/arm64/defconfig+arm64-chromebook/gcc-10/lab-baylibre/baseline-qemu_arm64-virt-gicv3.html
Rootfs: http://storage.kernelci.org/images/rootfs/buildroot/buildroot-baseline/20220716.0/arm64/rootfs.cpio.gz


* baseline.login: https://kernelci.org/test/case/id/62d91c0ecf8ba45c7fdaf06e
failing since 69 days (last pass: v5.10.112-cip6-88-gf3397cadb2dd6, first fail: v5.10.112-cip6-289-g2969e096d186)



platform | arch | lab | compiler | defconfig | regressions
---------------------------+-------+---------------+----------+----------------------------+------------
qemu_arm64-virt-gicv3 | arm64 | lab-broonie | gcc-10 | defconfig+arm64-chromebook | 1

Details: https://kernelci.org/test/plan/id/62d91d7eb5c948a665daf08b

Results: 0 PASS, 1 FAIL, 0 SKIP
Full config: defconfig+arm64-chromebook
Compiler: gcc-10 (aarch64-linux-gnu-gcc (Debian 10.2.1-6) 10.2.1 20210110)
Plain log: https://storage.kernelci.org//cip-gitlab/ci-iwamatsu-linux-5.10.y-cip-rc/v5.10.129-cip12-12-ge4e007863cc76/arm64/defconfig+arm64-chromebook/gcc-10/lab-broonie/baseline-qemu_arm64-virt-gicv3.txt
HTML log: https://storage.kernelci.org//cip-gitlab/ci-iwamatsu-linux-5.10.y-cip-rc/v5.10.129-cip12-12-ge4e007863cc76/arm64/defconfig+arm64-chromebook/gcc-10/lab-broonie/baseline-qemu_arm64-virt-gicv3.html
Rootfs: http://storage.kernelci.org/images/rootfs/buildroot/buildroot-baseline/20220716.0/arm64/rootfs.cpio.gz


* baseline.login: https://kernelci.org/test/case/id/62d91d7eb5c948a665daf08c
failing since 69 days (last pass: v5.10.112-cip6-88-gf3397cadb2dd6, first fail: v5.10.112-cip6-289-g2969e096d186)



platform | arch | lab | compiler | defconfig | regressions
---------------------------+-------+---------------+----------+----------------------------+------------
qemu_arm64-virt-gicv3-uefi | arm64 | lab-baylibre | gcc-10 | defconfig+arm64-chromebook | 1

Details: https://kernelci.org/test/plan/id/62d91c0bdca0ab5038daf061

Results: 0 PASS, 1 FAIL, 0 SKIP
Full config: defconfig+arm64-chromebook
Compiler: gcc-10 (aarch64-linux-gnu-gcc (Debian 10.2.1-6) 10.2.1 20210110)
Plain log: https://storage.kernelci.org//cip-gitlab/ci-iwamatsu-linux-5.10.y-cip-rc/v5.10.129-cip12-12-ge4e007863cc76/arm64/defconfig+arm64-chromebook/gcc-10/lab-baylibre/baseline-qemu_arm64-virt-gicv3-uefi.txt
HTML log: https://storage.kernelci.org//cip-gitlab/ci-iwamatsu-linux-5.10.y-cip-rc/v5.10.129-cip12-12-ge4e007863cc76/arm64/defconfig+arm64-chromebook/gcc-10/lab-baylibre/baseline-qemu_arm64-virt-gicv3-uefi.html
Rootfs: http://storage.kernelci.org/images/rootfs/buildroot/buildroot-baseline/20220716.0/arm64/rootfs.cpio.gz


* baseline.login: https://kernelci.org/test/case/id/62d91c0bdca0ab5038daf062
failing since 69 days (last pass: v5.10.112-cip6-88-gf3397cadb2dd6, first fail: v5.10.112-cip6-289-g2969e096d186)



platform | arch | lab | compiler | defconfig | regressions
---------------------------+-------+---------------+----------+----------------------------+------------
qemu_arm64-virt-gicv3-uefi | arm64 | lab-broonie | gcc-10 | defconfig+arm64-chromebook | 1

Details: https://kernelci.org/test/plan/id/62d91c17eb83c54da5daf085

Results: 0 PASS, 1 FAIL, 0 SKIP
Full config: defconfig+arm64-chromebook
Compiler: gcc-10 (aarch64-linux-gnu-gcc (Debian 10.2.1-6) 10.2.1 20210110)
Plain log: https://storage.kernelci.org//cip-gitlab/ci-iwamatsu-linux-5.10.y-cip-rc/v5.10.129-cip12-12-ge4e007863cc76/arm64/defconfig+arm64-chromebook/gcc-10/lab-broonie/baseline-qemu_arm64-virt-gicv3-uefi.txt
HTML log: https://storage.kernelci.org//cip-gitlab/ci-iwamatsu-linux-5.10.y-cip-rc/v5.10.129-cip12-12-ge4e007863cc76/arm64/defconfig+arm64-chromebook/gcc-10/lab-broonie/baseline-qemu_arm64-virt-gicv3-uefi.html
Rootfs: http://storage.kernelci.org/images/rootfs/buildroot/buildroot-baseline/20220716.0/arm64/rootfs.cpio.gz


* baseline.login: https://kernelci.org/test/case/id/62d91c17eb83c54da5daf086
failing since 69 days (last pass: v5.10.112-cip6-88-gf3397cadb2dd6, first fail: v5.10.112-cip6-289-g2969e096d186)



platform | arch | lab | compiler | defconfig | regressions
---------------------------+-------+---------------+----------+----------------------------+------------
r8a774a1-hihope-rzg2m-ex | arm64 | lab-cip | gcc-10 | defconfig+arm64-chromebook | 1

Details: https://kernelci.org/test/plan/id/62d91dad114ab2ae1bdaf072

Results: 0 PASS, 1 FAIL, 0 SKIP
Full config: defconfig+arm64-chromebook
Compiler: gcc-10 (aarch64-linux-gnu-gcc (Debian 10.2.1-6) 10.2.1 20210110)
Plain log: https://storage.kernelci.org//cip-gitlab/ci-iwamatsu-linux-5.10.y-cip-rc/v5.10.129-cip12-12-ge4e007863cc76/arm64/defconfig+arm64-chromebook/gcc-10/lab-cip/baseline-r8a774a1-hihope-rzg2m-ex.txt
HTML log: https://storage.kernelci.org//cip-gitlab/ci-iwamatsu-linux-5.10.y-cip-rc/v5.10.129-cip12-12-ge4e007863cc76/arm64/defconfig+arm64-chromebook/gcc-10/lab-cip/baseline-r8a774a1-hihope-rzg2m-ex.html
Rootfs: http://storage.kernelci.org/images/rootfs/buildroot/buildroot-baseline/20220716.0/arm64/rootfs.cpio.gz


* baseline.login: https://kernelci.org/test/case/id/62d91dad114ab2ae1bdaf073
new failure (last pass: v5.10.109-cip5-899-g234e7e7d5bd3)



platform | arch | lab | compiler | defconfig | regressions
---------------------------+-------+---------------+----------+----------------------------+------------
rk3399-gru-kevin | arm64 | lab-collabora | gcc-10 | defconfig+arm64-chromebook | 1

Details: https://kernelci.org/test/plan/id/62d91b312c8301d780daf05f

Results: 90 PASS, 2 FAIL, 0 SKIP
Full config: defconfig+arm64-chromebook
Compiler: gcc-10 (aarch64-linux-gnu-gcc (Debian 10.2.1-6) 10.2.1 20210110)
Plain log: https://storage.kernelci.org//cip-gitlab/ci-iwamatsu-linux-5.10.y-cip-rc/v5.10.129-cip12-12-ge4e007863cc76/arm64/defconfig+arm64-chromebook/gcc-10/lab-collabora/baseline-rk3399-gru-kevin.txt
HTML log: https://storage.kernelci.org//cip-gitlab/ci-iwamatsu-linux-5.10.y-cip-rc/v5.10.129-cip12-12-ge4e007863cc76/arm64/defconfig+arm64-chromebook/gcc-10/lab-collabora/baseline-rk3399-gru-kevin.html
Rootfs: http://storage.kernelci.org/images/rootfs/buildroot/buildroot-baseline/20220716.0/arm64/rootfs.cpio.gz


* baseline.bootrr.rockchip-i2s1-probed: https://kernelci.org/test/case/id/62d91b312c8301d780daf081
failing since 134 days (last pass: v5.10.100-cip2-319-gcbff87047566, first fail: v5.10.100-cip2-425-g0a0d92194f39)

2022-07-21T09:23:48.803268 /lava-6860818/1/../bin/lava-test-case
2022-07-21T09:23:48.813784 <8>[ 33.600973] <LAVA_SIGNAL_TESTCASE TEST_CASE_ID=rockchip-i2s1-probed RESULT=fail>



platform | arch | lab | compiler | defconfig | regressions
---------------------------+-------+---------------+----------+----------------------------+------------
tegra124-nyan-big | arm | lab-collabora | gcc-10 | multi_v7_defconfig | 1

Details: https://kernelci.org/test/plan/id/62d91dcaa70c76b839daf06d

Results: 0 PASS, 1 FAIL, 0 SKIP
Full config: multi_v7_defconfig
Compiler: gcc-10 (arm-linux-gnueabihf-gcc (Debian 10.2.1-6) 10.2.1 20210110)
Plain log: https://storage.kernelci.org//cip-gitlab/ci-iwamatsu-linux-5.10.y-cip-rc/v5.10.129-cip12-12-ge4e007863cc76/arm/multi_v7_defconfig/gcc-10/lab-collabora/baseline-tegra124-nyan-big.txt
HTML log: https://storage.kernelci.org//cip-gitlab/ci-iwamatsu-linux-5.10.y-cip-rc/v5.10.129-cip12-12-ge4e007863cc76/arm/multi_v7_defconfig/gcc-10/lab-collabora/baseline-tegra124-nyan-big.html
Rootfs: http://storage.kernelci.org/images/rootfs/buildroot/buildroot-baseline/20220716.0/armel/rootfs.cpio.gz


* baseline.login: https://kernelci.org/test/case/id/62d91dcaa70c76b839daf06e
new failure (last pass: v5.10.126-cip11-116-gef362fbbff528)


cip-gitlab/ci/iwamatsu/linux-5.10.y-cip-rc baseline-nfs: 36 runs, 4 regressions (v5.10.129-cip12-12-ge4e007863cc76) #kernelci

kernelci.org bot <bot@...>
 

cip-gitlab/ci/iwamatsu/linux-5.10.y-cip-rc baseline-nfs: 36 runs, 4 regressions (v5.10.129-cip12-12-ge4e007863cc76)

Regressions Summary
-------------------

platform | arch | lab | compiler | defconfig | regressions
-------------------------+-------+---------------+----------+----------------------------+------------
jetson-tk1 | arm | lab-baylibre | gcc-10 | multi_v7_defconfig | 1
jetson-tk1 | arm | lab-baylibre | gcc-10 | tegra_defconfig | 1
r8a774a1-hihope-rzg2m-ex | arm64 | lab-cip | gcc-10 | defconfig+arm64-chromebook | 1
rk3399-gru-kevin | arm64 | lab-collabora | gcc-10 | defconfig+arm64-chromebook | 1

Details: https://kernelci.org/test/job/cip-gitlab/branch/ci%2Fiwamatsu%2Flinux-5.10.y-cip-rc/kernel/v5.10.129-cip12-12-ge4e007863cc76/plan/baseline-nfs/

Test: baseline-nfs
Tree: cip-gitlab
Branch: ci/iwamatsu/linux-5.10.y-cip-rc
Describe: v5.10.129-cip12-12-ge4e007863cc76
URL: https://gitlab.com/cip-project/cip-kernel/linux-cip.git
SHA: e4e007863cc767efd75ca69c0b98e5daab0c20ff


Test Regressions
----------------


platform | arch | lab | compiler | defconfig | regressions
-------------------------+-------+---------------+----------+----------------------------+------------
jetson-tk1 | arm | lab-baylibre | gcc-10 | multi_v7_defconfig | 1

Details: https://kernelci.org/test/plan/id/62d920a9b9349eb727daf07c

Results: 0 PASS, 1 FAIL, 0 SKIP
Full config: multi_v7_defconfig
Compiler: gcc-10 (arm-linux-gnueabihf-gcc (Debian 10.2.1-6) 10.2.1 20210110)
Plain log: https://storage.kernelci.org//cip-gitlab/ci-iwamatsu-linux-5.10.y-cip-rc/v5.10.129-cip12-12-ge4e007863cc76/arm/multi_v7_defconfig/gcc-10/lab-baylibre/baseline-nfs-jetson-tk1.txt
HTML log: https://storage.kernelci.org//cip-gitlab/ci-iwamatsu-linux-5.10.y-cip-rc/v5.10.129-cip12-12-ge4e007863cc76/arm/multi_v7_defconfig/gcc-10/lab-baylibre/baseline-nfs-jetson-tk1.html
Rootfs: http://storage.kernelci.org/images/rootfs/debian/bullseye/20220716.0/armhf/initrd.cpio.gz


* baseline-nfs.login: https://kernelci.org/test/case/id/62d920a9b9349eb727daf07d
failing since 51 days (last pass: v5.10.112-cip6-289-g2969e096d186, first fail: v5.10.118-465-g0af29783a3c9)



platform | arch | lab | compiler | defconfig | regressions
-------------------------+-------+---------------+----------+----------------------------+------------
jetson-tk1 | arm | lab-baylibre | gcc-10 | tegra_defconfig | 1

Details: https://kernelci.org/test/plan/id/62d91e2a5a3d47fa01daf089

Results: 0 PASS, 1 FAIL, 0 SKIP
Full config: tegra_defconfig
Compiler: gcc-10 (arm-linux-gnueabihf-gcc (Debian 10.2.1-6) 10.2.1 20210110)
Plain log: https://storage.kernelci.org//cip-gitlab/ci-iwamatsu-linux-5.10.y-cip-rc/v5.10.129-cip12-12-ge4e007863cc76/arm/tegra_defconfig/gcc-10/lab-baylibre/baseline-nfs-jetson-tk1.txt
HTML log: https://storage.kernelci.org//cip-gitlab/ci-iwamatsu-linux-5.10.y-cip-rc/v5.10.129-cip12-12-ge4e007863cc76/arm/tegra_defconfig/gcc-10/lab-baylibre/baseline-nfs-jetson-tk1.html
Rootfs: http://storage.kernelci.org/images/rootfs/debian/bullseye/20220716.0/armhf/initrd.cpio.gz


* baseline-nfs.login: https://kernelci.org/test/case/id/62d91e2a5a3d47fa01daf08a
failing since 51 days (last pass: v5.10.112-cip6-289-g2969e096d186, first fail: v5.10.118-465-g0af29783a3c9)



platform | arch | lab | compiler | defconfig | regressions
-------------------------+-------+---------------+----------+----------------------------+------------
r8a774a1-hihope-rzg2m-ex | arm64 | lab-cip | gcc-10 | defconfig+arm64-chromebook | 1

Details: https://kernelci.org/test/plan/id/62d926e49dcc4d071cdaf11e

Results: 0 PASS, 1 FAIL, 0 SKIP
Full config: defconfig+arm64-chromebook
Compiler: gcc-10 (aarch64-linux-gnu-gcc (Debian 10.2.1-6) 10.2.1 20210110)
Plain log: https://storage.kernelci.org//cip-gitlab/ci-iwamatsu-linux-5.10.y-cip-rc/v5.10.129-cip12-12-ge4e007863cc76/arm64/defconfig+arm64-chromebook/gcc-10/lab-cip/baseline-nfs-r8a774a1-hihope-rzg2m-ex.txt
HTML log: https://storage.kernelci.org//cip-gitlab/ci-iwamatsu-linux-5.10.y-cip-rc/v5.10.129-cip12-12-ge4e007863cc76/arm64/defconfig+arm64-chromebook/gcc-10/lab-cip/baseline-nfs-r8a774a1-hihope-rzg2m-ex.html
Rootfs: http://storage.kernelci.org/images/rootfs/debian/bullseye/20220716.0/arm64/initrd.cpio.gz


* baseline-nfs.login: https://kernelci.org/test/case/id/62d926e49dcc4d071cdaf11f
new failure (last pass: v5.10.126-cip11-116-gef362fbbff528)



platform | arch | lab | compiler | defconfig | regressions
-------------------------+-------+---------------+----------+----------------------------+------------
rk3399-gru-kevin | arm64 | lab-collabora | gcc-10 | defconfig+arm64-chromebook | 1

Details: https://kernelci.org/test/plan/id/62d91c68e8e5ed5250daf09c

Results: 84 PASS, 4 FAIL, 0 SKIP
Full config: defconfig+arm64-chromebook
Compiler: gcc-10 (aarch64-linux-gnu-gcc (Debian 10.2.1-6) 10.2.1 20210110)
Plain log: https://storage.kernelci.org//cip-gitlab/ci-iwamatsu-linux-5.10.y-cip-rc/v5.10.129-cip12-12-ge4e007863cc76/arm64/defconfig+arm64-chromebook/gcc-10/lab-collabora/baseline-nfs-rk3399-gru-kevin.txt
HTML log: https://storage.kernelci.org//cip-gitlab/ci-iwamatsu-linux-5.10.y-cip-rc/v5.10.129-cip12-12-ge4e007863cc76/arm64/defconfig+arm64-chromebook/gcc-10/lab-collabora/baseline-nfs-rk3399-gru-kevin.html
Rootfs: http://storage.kernelci.org/images/rootfs/debian/bullseye/20220716.0/arm64/initrd.cpio.gz


* baseline-nfs.bootrr.rockchip-i2s1-probed: https://kernelci.org/test/case/id/62d91c68e8e5ed5250daf0be
failing since 134 days (last pass: v5.10.100-cip2-319-gcbff87047566, first fail: v5.10.100-cip2-425-g0a0d92194f39)

2022-07-21T09:28:59.681660 /lava-6860834/1/../bin/lava-test-case
2022-07-21T09:28:59.715143 <8>[ 98.213802] <LAVA_SIGNAL_TESTCASE TEST_CASE_ID=rockchip-i2s1-probed RESULT=fail>


cip-gitlab/ci/iwamatsu/linux-5.10.y-cip-rc baseline-cip-nfs: 8 runs, 2 regressions (v5.10.129-cip12-12-ge4e007863cc76) #kernelci

kernelci.org bot <bot@...>
 

cip-gitlab/ci/iwamatsu/linux-5.10.y-cip-rc baseline-cip-nfs: 8 runs, 2 regressions (v5.10.129-cip12-12-ge4e007863cc76)

Regressions Summary
-------------------

platform | arch | lab | compiler | defconfig | regressions
-------------------------+-------+---------+----------+----------------------------+------------
beaglebone-black | arm | lab-cip | gcc-10 | omap2plus_defconfig | 1
r8a774a1-hihope-rzg2m-ex | arm64 | lab-cip | gcc-10 | defconfig+arm64-chromebook | 1

Details: https://kernelci.org/test/job/cip-gitlab/branch/ci%2Fiwamatsu%2Flinux-5.10.y-cip-rc/kernel/v5.10.129-cip12-12-ge4e007863cc76/plan/baseline-cip-nfs/

Test: baseline-cip-nfs
Tree: cip-gitlab
Branch: ci/iwamatsu/linux-5.10.y-cip-rc
Describe: v5.10.129-cip12-12-ge4e007863cc76
URL: https://gitlab.com/cip-project/cip-kernel/linux-cip.git
SHA: e4e007863cc767efd75ca69c0b98e5daab0c20ff


Test Regressions
----------------


platform | arch | lab | compiler | defconfig | regressions
-------------------------+-------+---------+----------+----------------------------+------------
beaglebone-black | arm | lab-cip | gcc-10 | omap2plus_defconfig | 1

Details: https://kernelci.org/test/plan/id/62d91ccf14844b662cdaf08a

Results: 0 PASS, 1 FAIL, 0 SKIP
Full config: omap2plus_defconfig
Compiler: gcc-10 (arm-linux-gnueabihf-gcc (Debian 10.2.1-6) 10.2.1 20210110)
Plain log: https://storage.kernelci.org//cip-gitlab/ci-iwamatsu-linux-5.10.y-cip-rc/v5.10.129-cip12-12-ge4e007863cc76/arm/omap2plus_defconfig/gcc-10/lab-cip/baseline-cip-nfs-beaglebone-black.txt
HTML log: https://storage.kernelci.org//cip-gitlab/ci-iwamatsu-linux-5.10.y-cip-rc/v5.10.129-cip12-12-ge4e007863cc76/arm/omap2plus_defconfig/gcc-10/lab-cip/baseline-cip-nfs-beaglebone-black.html
Rootfs: https://storage.kernelci.org/images/rootfs/cip/20211105/qemu-arm/cip-core-image-kernelci-cip-core-buster-qemu-arm-initrd.img.gz


* baseline-cip-nfs.login: https://kernelci.org/test/case/id/62d91ccf14844b662cdaf08b
failing since 14 days (last pass: v5.10.126-cip11-1-gc5218dc69ff1, first fail: v5.10.126-cip11-116-gef362fbbff528)



platform | arch | lab | compiler | defconfig | regressions
-------------------------+-------+---------+----------+----------------------------+------------
r8a774a1-hihope-rzg2m-ex | arm64 | lab-cip | gcc-10 | defconfig+arm64-chromebook | 1

Details: https://kernelci.org/test/plan/id/62d91c43e8e5ed5250daf064

Results: 0 PASS, 1 FAIL, 0 SKIP
Full config: defconfig+arm64-chromebook
Compiler: gcc-10 (aarch64-linux-gnu-gcc (Debian 10.2.1-6) 10.2.1 20210110)
Plain log: https://storage.kernelci.org//cip-gitlab/ci-iwamatsu-linux-5.10.y-cip-rc/v5.10.129-cip12-12-ge4e007863cc76/arm64/defconfig+arm64-chromebook/gcc-10/lab-cip/baseline-cip-nfs-r8a774a1-hihope-rzg2m-ex.txt
HTML log: https://storage.kernelci.org//cip-gitlab/ci-iwamatsu-linux-5.10.y-cip-rc/v5.10.129-cip12-12-ge4e007863cc76/arm64/defconfig+arm64-chromebook/gcc-10/lab-cip/baseline-cip-nfs-r8a774a1-hihope-rzg2m-ex.html
Rootfs: https://storage.kernelci.org/images/rootfs/cip/20211105/qemu-arm64/cip-core-image-kernelci-cip-core-buster-qemu-arm64-initrd.img.gz


* baseline-cip-nfs.login: https://kernelci.org/test/case/id/62d91c43e8e5ed5250daf065
new failure (last pass: v5.10.126-cip11-116-gef362fbbff528)


NFS boot error on some boards

Nobuhiro Iwamatsu
 

Hi Chris,

NFS boot is not possible on some boards.
The board with the problem appears to under to lab-cip-denx.
Could you check it ?
https://lava.ciplatform.org/scheduler/job/714812
https://lava.ciplatform.org/scheduler/job/714806

Best regards,
Nobuhiro

--
Nobuhiro Iwamatsu
iwamatsu at {nigauri.org / debian.org}
GPG ID: 40AD1FA6


cip-gitlab/ci/iwamatsu/linux-5.10.y-cip-rc build: 188 builds: 3 failed, 185 passed, 4 errors, 10 warnings (v5.10.129-cip12-12-ge4e007863cc76) #kernelci

kernelci.org bot <bot@...>
 

cip-gitlab/ci/iwamatsu/linux-5.10.y-cip-rc build: 188 builds: 3 failed, 185 passed, 4 errors, 10 warnings (v5.10.129-cip12-12-ge4e007863cc76)

Full Build Summary: https://kernelci.org/build/cip-gitlab/branch/ci%2Fiwamatsu%2Flinux-5.10.y-cip-rc/kernel/v5.10.129-cip12-12-ge4e007863cc76/

Tree: cip-gitlab
Branch: ci/iwamatsu/linux-5.10.y-cip-rc
Git Describe: v5.10.129-cip12-12-ge4e007863cc76
Git Commit: e4e007863cc767efd75ca69c0b98e5daab0c20ff
Git URL: https://gitlab.com/cip-project/cip-kernel/linux-cip.git
Built: 7 unique architectures

Build Failures Detected:

arm:
rpc_defconfig: (gcc-10) FAIL

mips:
ip27_defconfig: (gcc-10) FAIL
ip28_defconfig: (gcc-10) FAIL

Errors and Warnings Detected:

arc:

arm64:

arm:
rpc_defconfig (gcc-10): 4 errors

i386:

mips:
32r2el_defconfig (gcc-10): 1 warning
decstation_64_defconfig (gcc-10): 1 warning
decstation_defconfig (gcc-10): 1 warning
decstation_r4k_defconfig (gcc-10): 1 warning
lemote2f_defconfig (gcc-10): 1 warning
rm200_defconfig (gcc-10): 1 warning

riscv:
rv32_defconfig (gcc-10): 4 warnings

x86_64:

Errors summary:

2 arm-linux-gnueabihf-gcc: error: unrecognized -march target: armv3m
2 arm-linux-gnueabihf-gcc: error: missing argument to ‘-march=’

Warnings summary:

3 kernel/rcu/tasks.h:710:13: warning: ‘show_rcu_tasks_rude_gp_kthread’ defined but not used [-Wunused-function]
2 <stdin>:830:2: warning: #warning syscall fstat64 not implemented [-Wcpp]
2 <stdin>:1127:2: warning: #warning syscall fstatat64 not implemented [-Wcpp]
1 net/mac80211/mlme.c:4349:1: warning: the frame size of 1040 bytes is larger than 1024 bytes [-Wframe-larger-than=]
1 drivers/block/paride/bpck.c:32: warning: "PC" redefined
1 WARNING: modpost: Symbol info of vmlinux is missing. Unresolved symbol check will be entirely skipped.

Section mismatches summary:

1 WARNING: modpost: vmlinux.o(___ksymtab_gpl+ixp4xx_irq_init+0x0): Section mismatch in reference from the variable __ksymtab_ixp4xx_irq_init to the function .init.text:ixp4xx_irq_init()
1 WARNING: modpost: vmlinux.o(___ksymtab+prom_init_numa_memory+0x0): Section mismatch in reference from the variable __ksymtab_prom_init_numa_memory to the function .init.text:prom_init_numa_memory()

================================================================================

Detailed per-defconfig build reports:

--------------------------------------------------------------------------------
32r2el_defconfig (mips, gcc-10) — PASS, 0 errors, 1 warning, 0 section mismatches

Warnings:
WARNING: modpost: Symbol info of vmlinux is missing. Unresolved symbol check will be entirely skipped.

--------------------------------------------------------------------------------
allnoconfig (i386, gcc-10) — PASS, 0 errors, 0 warnings, 0 section mismatches

--------------------------------------------------------------------------------
allnoconfig (x86_64, gcc-10) — PASS, 0 errors, 0 warnings, 0 section mismatches

--------------------------------------------------------------------------------
allnoconfig (arc, gcc-10) — PASS, 0 errors, 0 warnings, 0 section mismatches

--------------------------------------------------------------------------------
am200epdkit_defconfig (arm, gcc-10) — PASS, 0 errors, 0 warnings, 0 section mismatches

--------------------------------------------------------------------------------
ar7_defconfig (mips, gcc-10) — PASS, 0 errors, 0 warnings, 0 section mismatches

--------------------------------------------------------------------------------
aspeed_g4_defconfig (arm, gcc-10) — PASS, 0 errors, 0 warnings, 0 section mismatches

--------------------------------------------------------------------------------
aspeed_g5_defconfig (arm, gcc-10) — PASS, 0 errors, 0 warnings, 0 section mismatches

--------------------------------------------------------------------------------
assabet_defconfig (arm, gcc-10) — PASS, 0 errors, 0 warnings, 0 section mismatches

--------------------------------------------------------------------------------
at91_dt_defconfig (arm, gcc-10) — PASS, 0 errors, 0 warnings, 0 section mismatches

--------------------------------------------------------------------------------
ath25_defconfig (mips, gcc-10) — PASS, 0 errors, 0 warnings, 0 section mismatches

--------------------------------------------------------------------------------
ath79_defconfig (mips, gcc-10) — PASS, 0 errors, 0 warnings, 0 section mismatches

--------------------------------------------------------------------------------
axm55xx_defconfig (arm, gcc-10) — PASS, 0 errors, 0 warnings, 0 section mismatches

--------------------------------------------------------------------------------
axs103_defconfig (arc, gcc-10) — PASS, 0 errors, 0 warnings, 0 section mismatches

--------------------------------------------------------------------------------
axs103_smp_defconfig (arc, gcc-10) — PASS, 0 errors, 0 warnings, 0 section mismatches

--------------------------------------------------------------------------------
badge4_defconfig (arm, gcc-10) — PASS, 0 errors, 0 warnings, 0 section mismatches

--------------------------------------------------------------------------------
bcm2835_defconfig (arm, gcc-10) — PASS, 0 errors, 0 warnings, 0 section mismatches

--------------------------------------------------------------------------------
bcm47xx_defconfig (mips, gcc-10) — PASS, 0 errors, 0 warnings, 0 section mismatches

--------------------------------------------------------------------------------
bcm63xx_defconfig (mips, gcc-10) — PASS, 0 errors, 0 warnings, 0 section mismatches

--------------------------------------------------------------------------------
bigsur_defconfig (mips, gcc-10) — PASS, 0 errors, 0 warnings, 0 section mismatches

--------------------------------------------------------------------------------
bmips_be_defconfig (mips, gcc-10) — PASS, 0 errors, 0 warnings, 0 section mismatches

--------------------------------------------------------------------------------
bmips_stb_defconfig (mips, gcc-10) — PASS, 0 errors, 0 warnings, 0 section mismatches

--------------------------------------------------------------------------------
capcella_defconfig (mips, gcc-10) — PASS, 0 errors, 0 warnings, 0 section mismatches

--------------------------------------------------------------------------------
cavium_octeon_defconfig (mips, gcc-10) — PASS, 0 errors, 0 warnings, 0 section mismatches

--------------------------------------------------------------------------------
cerfcube_defconfig (arm, gcc-10) — PASS, 0 errors, 0 warnings, 0 section mismatches

--------------------------------------------------------------------------------
ci20_defconfig (mips, gcc-10) — PASS, 0 errors, 0 warnings, 0 section mismatches

--------------------------------------------------------------------------------
cm_x300_defconfig (arm, gcc-10) — PASS, 0 errors, 0 warnings, 0 section mismatches

--------------------------------------------------------------------------------
cobalt_defconfig (mips, gcc-10) — PASS, 0 errors, 0 warnings, 0 section mismatches

--------------------------------------------------------------------------------
colibri_pxa270_defconfig (arm, gcc-10) — PASS, 0 errors, 0 warnings, 0 section mismatches

--------------------------------------------------------------------------------
colibri_pxa300_defconfig (arm, gcc-10) — PASS, 0 errors, 0 warnings, 0 section mismatches

--------------------------------------------------------------------------------
collie_defconfig (arm, gcc-10) — PASS, 0 errors, 0 warnings, 0 section mismatches

--------------------------------------------------------------------------------
corgi_defconfig (arm, gcc-10) — PASS, 0 errors, 0 warnings, 0 section mismatches

--------------------------------------------------------------------------------
cu1000-neo_defconfig (mips, gcc-10) — PASS, 0 errors, 0 warnings, 0 section mismatches

--------------------------------------------------------------------------------
cu1830-neo_defconfig (mips, gcc-10) — PASS, 0 errors, 0 warnings, 0 section mismatches

--------------------------------------------------------------------------------
davinci_all_defconfig (arm, gcc-10) — PASS, 0 errors, 0 warnings, 0 section mismatches

--------------------------------------------------------------------------------
db1xxx_defconfig (mips, gcc-10) — PASS, 0 errors, 0 warnings, 0 section mismatches

--------------------------------------------------------------------------------
decstation_64_defconfig (mips, gcc-10) — PASS, 0 errors, 1 warning, 0 section mismatches

Warnings:
kernel/rcu/tasks.h:710:13: warning: ‘show_rcu_tasks_rude_gp_kthread’ defined but not used [-Wunused-function]

--------------------------------------------------------------------------------
decstation_defconfig (mips, gcc-10) — PASS, 0 errors, 1 warning, 0 section mismatches

Warnings:
kernel/rcu/tasks.h:710:13: warning: ‘show_rcu_tasks_rude_gp_kthread’ defined but not used [-Wunused-function]

--------------------------------------------------------------------------------
decstation_r4k_defconfig (mips, gcc-10) — PASS, 0 errors, 1 warning, 0 section mismatches

Warnings:
kernel/rcu/tasks.h:710:13: warning: ‘show_rcu_tasks_rude_gp_kthread’ defined but not used [-Wunused-function]

--------------------------------------------------------------------------------
defconfig (riscv, gcc-10) — PASS, 0 errors, 0 warnings, 0 section mismatches

--------------------------------------------------------------------------------
defconfig+arm64-chromebook (arm64, gcc-10) — PASS, 0 errors, 0 warnings, 0 section mismatches

--------------------------------------------------------------------------------
defconfig+arm64-chromebook+kselftest (arm64, gcc-10) — PASS, 0 errors, 0 warnings, 0 section mismatches

--------------------------------------------------------------------------------
defconfig+kselftest (arm64, gcc-10) — PASS, 0 errors, 0 warnings, 0 section mismatches

--------------------------------------------------------------------------------
dove_defconfig (arm, gcc-10) — PASS, 0 errors, 0 warnings, 0 section mismatches

--------------------------------------------------------------------------------
e55_defconfig (mips, gcc-10) — PASS, 0 errors, 0 warnings, 0 section mismatches

--------------------------------------------------------------------------------
ebsa110_defconfig (arm, gcc-10) — PASS, 0 errors, 0 warnings, 0 section mismatches

--------------------------------------------------------------------------------
efm32_defconfig (arm, gcc-10) — PASS, 0 errors, 0 warnings, 0 section mismatches

--------------------------------------------------------------------------------
ep93xx_defconfig (arm, gcc-10) — PASS, 0 errors, 0 warnings, 0 section mismatches

--------------------------------------------------------------------------------
eseries_pxa_defconfig (arm, gcc-10) — PASS, 0 errors, 0 warnings, 0 section mismatches

--------------------------------------------------------------------------------
exynos_defconfig (arm, gcc-10) — PASS, 0 errors, 0 warnings, 0 section mismatches

--------------------------------------------------------------------------------
ezx_defconfig (arm, gcc-10) — PASS, 0 errors, 0 warnings, 0 section mismatches

--------------------------------------------------------------------------------
footbridge_defconfig (arm, gcc-10) — PASS, 0 errors, 0 warnings, 0 section mismatches

--------------------------------------------------------------------------------
fuloong2e_defconfig (mips, gcc-10) — PASS, 0 errors, 0 warnings, 0 section mismatches

--------------------------------------------------------------------------------
gcw0_defconfig (mips, gcc-10) — PASS, 0 errors, 0 warnings, 0 section mismatches

--------------------------------------------------------------------------------
gemini_defconfig (arm, gcc-10) — PASS, 0 errors, 0 warnings, 0 section mismatches

--------------------------------------------------------------------------------
gpr_defconfig (mips, gcc-10) — PASS, 0 errors, 0 warnings, 0 section mismatches

--------------------------------------------------------------------------------
h3600_defconfig (arm, gcc-10) — PASS, 0 errors, 0 warnings, 0 section mismatches

--------------------------------------------------------------------------------
h5000_defconfig (arm, gcc-10) — PASS, 0 errors, 0 warnings, 0 section mismatches

--------------------------------------------------------------------------------
hackkit_defconfig (arm, gcc-10) — PASS, 0 errors, 0 warnings, 0 section mismatches

--------------------------------------------------------------------------------
haps_hs_defconfig (arc, gcc-10) — PASS, 0 errors, 0 warnings, 0 section mismatches

--------------------------------------------------------------------------------
haps_hs_smp_defconfig (arc, gcc-10) — PASS, 0 errors, 0 warnings, 0 section mismatches

--------------------------------------------------------------------------------
hisi_defconfig (arm, gcc-10) — PASS, 0 errors, 0 warnings, 0 section mismatches

--------------------------------------------------------------------------------
hsdk_defconfig (arc, gcc-10) — PASS, 0 errors, 0 warnings, 0 section mismatches

--------------------------------------------------------------------------------
i386_defconfig (i386, gcc-10) — PASS, 0 errors, 0 warnings, 0 section mismatches

--------------------------------------------------------------------------------
imote2_defconfig (arm, gcc-10) — PASS, 0 errors, 0 warnings, 0 section mismatches

--------------------------------------------------------------------------------
imx_v4_v5_defconfig (arm, gcc-10) — PASS, 0 errors, 0 warnings, 0 section mismatches

--------------------------------------------------------------------------------
imx_v6_v7_defconfig (arm, gcc-10) — PASS, 0 errors, 0 warnings, 0 section mismatches

--------------------------------------------------------------------------------
integrator_defconfig (arm, gcc-10) — PASS, 0 errors, 0 warnings, 0 section mismatches

--------------------------------------------------------------------------------
iop32x_defconfig (arm, gcc-10) — PASS, 0 errors, 0 warnings, 0 section mismatches

--------------------------------------------------------------------------------
ip22_defconfig (mips, gcc-10) — PASS, 0 errors, 0 warnings, 0 section mismatches

--------------------------------------------------------------------------------
ip27_defconfig (mips, gcc-10) — FAIL, 0 errors, 0 warnings, 0 section mismatches

--------------------------------------------------------------------------------
ip28_defconfig (mips, gcc-10) — FAIL, 0 errors, 0 warnings, 0 section mismatches

--------------------------------------------------------------------------------
ip32_defconfig (mips, gcc-10) — PASS, 0 errors, 0 warnings, 0 section mismatches

--------------------------------------------------------------------------------
ixp4xx_defconfig (arm, gcc-10) — PASS, 0 errors, 0 warnings, 0 section mismatches

Section mismatches:
WARNING: modpost: vmlinux.o(___ksymtab_gpl+ixp4xx_irq_init+0x0): Section mismatch in reference from the variable __ksymtab_ixp4xx_irq_init to the function .init.text:ixp4xx_irq_init()

--------------------------------------------------------------------------------
jazz_defconfig (mips, gcc-10) — PASS, 0 errors, 0 warnings, 0 section mismatches

--------------------------------------------------------------------------------
jmr3927_defconfig (mips, gcc-10) — PASS, 0 errors, 0 warnings, 0 section mismatches

--------------------------------------------------------------------------------
jornada720_defconfig (arm, gcc-10) — PASS, 0 errors, 0 warnings, 0 section mismatches

--------------------------------------------------------------------------------
keystone_defconfig (arm, gcc-10) — PASS, 0 errors, 0 warnings, 0 section mismatches

--------------------------------------------------------------------------------
lart_defconfig (arm, gcc-10) — PASS, 0 errors, 0 warnings, 0 section mismatches

--------------------------------------------------------------------------------
lemote2f_defconfig (mips, gcc-10) — PASS, 0 errors, 1 warning, 0 section mismatches

Warnings:
net/mac80211/mlme.c:4349:1: warning: the frame size of 1040 bytes is larger than 1024 bytes [-Wframe-larger-than=]

--------------------------------------------------------------------------------
loongson1b_defconfig (mips, gcc-10) — PASS, 0 errors, 0 warnings, 0 section mismatches

--------------------------------------------------------------------------------
loongson1c_defconfig (mips, gcc-10) — PASS, 0 errors, 0 warnings, 0 section mismatches

--------------------------------------------------------------------------------
loongson3_defconfig (mips, gcc-10) — PASS, 0 errors, 0 warnings, 0 section mismatches

Section mismatches:
WARNING: modpost: vmlinux.o(___ksymtab+prom_init_numa_memory+0x0): Section mismatch in reference from the variable __ksymtab_prom_init_numa_memory to the function .init.text:prom_init_numa_memory()

--------------------------------------------------------------------------------
lpc18xx_defconfig (arm, gcc-10) — PASS, 0 errors, 0 warnings, 0 section mismatches

--------------------------------------------------------------------------------
lpc32xx_defconfig (arm, gcc-10) — PASS, 0 errors, 0 warnings, 0 section mismatches

--------------------------------------------------------------------------------
lpd270_defconfig (arm, gcc-10) — PASS, 0 errors, 0 warnings, 0 section mismatches

--------------------------------------------------------------------------------
lubbock_defconfig (arm, gcc-10) — PASS, 0 errors, 0 warnings, 0 section mismatches

--------------------------------------------------------------------------------
magician_defconfig (arm, gcc-10) — PASS, 0 errors, 0 warnings, 0 section mismatches

--------------------------------------------------------------------------------
mainstone_defconfig (arm, gcc-10) — PASS, 0 errors, 0 warnings, 0 section mismatches

--------------------------------------------------------------------------------
malta_defconfig (mips, gcc-10) — PASS, 0 errors, 0 warnings, 0 section mismatches

--------------------------------------------------------------------------------
malta_kvm_defconfig (mips, gcc-10) — PASS, 0 errors, 0 warnings, 0 section mismatches

--------------------------------------------------------------------------------
malta_kvm_guest_defconfig (mips, gcc-10) — PASS, 0 errors, 0 warnings, 0 section mismatches

--------------------------------------------------------------------------------
malta_qemu_32r6_defconfig (mips, gcc-10) — PASS, 0 errors, 0 warnings, 0 section mismatches

--------------------------------------------------------------------------------
maltaaprp_defconfig (mips, gcc-10) — PASS, 0 errors, 0 warnings, 0 section mismatches

--------------------------------------------------------------------------------
maltasmvp_defconfig (mips, gcc-10) — PASS, 0 errors, 0 warnings, 0 section mismatches

--------------------------------------------------------------------------------
maltasmvp_eva_defconfig (mips, gcc-10) — PASS, 0 errors, 0 warnings, 0 section mismatches

--------------------------------------------------------------------------------
maltaup_defconfig (mips, gcc-10) — PASS, 0 errors, 0 warnings, 0 section mismatches

--------------------------------------------------------------------------------
maltaup_xpa_defconfig (mips, gcc-10) — PASS, 0 errors, 0 warnings, 0 section mismatches

--------------------------------------------------------------------------------
milbeaut_m10v_defconfig (arm, gcc-10) — PASS, 0 errors, 0 warnings, 0 section mismatches

--------------------------------------------------------------------------------
mini2440_defconfig (arm, gcc-10) — PASS, 0 errors, 0 warnings, 0 section mismatches

--------------------------------------------------------------------------------
mmp2_defconfig (arm, gcc-10) — PASS, 0 errors, 0 warnings, 0 section mismatches

--------------------------------------------------------------------------------
moxart_defconfig (arm, gcc-10) — PASS, 0 errors, 0 warnings, 0 section mismatches

--------------------------------------------------------------------------------
mpc30x_defconfig (mips, gcc-10) — PASS, 0 errors, 0 warnings, 0 section mismatches

--------------------------------------------------------------------------------
mps2_defconfig (arm, gcc-10) — PASS, 0 errors, 0 warnings, 0 section mismatches

--------------------------------------------------------------------------------
mtx1_defconfig (mips, gcc-10) — PASS, 0 errors, 0 warnings, 0 section mismatches

--------------------------------------------------------------------------------
multi_v4t_defconfig (arm, gcc-10) — PASS, 0 errors, 0 warnings, 0 section mismatches

--------------------------------------------------------------------------------
multi_v5_defconfig (arm, gcc-10) — PASS, 0 errors, 0 warnings, 0 section mismatches

--------------------------------------------------------------------------------
multi_v7_defconfig (arm, gcc-10) — PASS, 0 errors, 0 warnings, 0 section mismatches

--------------------------------------------------------------------------------
multi_v7_defconfig+kselftest (arm, gcc-10) — PASS, 0 errors, 0 warnings, 0 section mismatches

--------------------------------------------------------------------------------
mvebu_v5_defconfig (arm, gcc-10) — PASS, 0 errors, 0 warnings, 0 section mismatches

--------------------------------------------------------------------------------
mvebu_v7_defconfig (arm, gcc-10) — PASS, 0 errors, 0 warnings, 0 section mismatches

--------------------------------------------------------------------------------
mxs_defconfig (arm, gcc-10) — PASS, 0 errors, 0 warnings, 0 section mismatches

--------------------------------------------------------------------------------
neponset_defconfig (arm, gcc-10) — PASS, 0 errors, 0 warnings, 0 section mismatches

--------------------------------------------------------------------------------
netwinder_defconfig (arm, gcc-10) — PASS, 0 errors, 0 warnings, 0 section mismatches

--------------------------------------------------------------------------------
nhk8815_defconfig (arm, gcc-10) — PASS, 0 errors, 0 warnings, 0 section mismatches

--------------------------------------------------------------------------------
nlm_xlp_defconfig (mips, gcc-10) — PASS, 0 errors, 0 warnings, 0 section mismatches

--------------------------------------------------------------------------------
nlm_xlr_defconfig (mips, gcc-10) — PASS, 0 errors, 0 warnings, 0 section mismatches

--------------------------------------------------------------------------------
nommu_k210_defconfig (riscv, gcc-10) — PASS, 0 errors, 0 warnings, 0 section mismatches

--------------------------------------------------------------------------------
nsimosci_hs_defconfig (arc, gcc-10) — PASS, 0 errors, 0 warnings, 0 section mismatches

--------------------------------------------------------------------------------
nsimosci_hs_smp_defconfig (arc, gcc-10) — PASS, 0 errors, 0 warnings, 0 section mismatches

--------------------------------------------------------------------------------
omap1_defconfig (arm, gcc-10) — PASS, 0 errors, 0 warnings, 0 section mismatches

--------------------------------------------------------------------------------
omap2plus_defconfig (arm, gcc-10) — PASS, 0 errors, 0 warnings, 0 section mismatches

--------------------------------------------------------------------------------
omega2p_defconfig (mips, gcc-10) — PASS, 0 errors, 0 warnings, 0 section mismatches

--------------------------------------------------------------------------------
orion5x_defconfig (arm, gcc-10) — PASS, 0 errors, 0 warnings, 0 section mismatches

--------------------------------------------------------------------------------
oxnas_v6_defconfig (arm, gcc-10) — PASS, 0 errors, 0 warnings, 0 section mismatches

--------------------------------------------------------------------------------
palmz72_defconfig (arm, gcc-10) — PASS, 0 errors, 0 warnings, 0 section mismatches

--------------------------------------------------------------------------------
pcm027_defconfig (arm, gcc-10) — PASS, 0 errors, 0 warnings, 0 section mismatches

--------------------------------------------------------------------------------
pic32mzda_defconfig (mips, gcc-10) — PASS, 0 errors, 0 warnings, 0 section mismatches

--------------------------------------------------------------------------------
pistachio_defconfig (mips, gcc-10) — PASS, 0 errors, 0 warnings, 0 section mismatches

--------------------------------------------------------------------------------
pleb_defconfig (arm, gcc-10) — PASS, 0 errors, 0 warnings, 0 section mismatches

--------------------------------------------------------------------------------
prima2_defconfig (arm, gcc-10) — PASS, 0 errors, 0 warnings, 0 section mismatches

--------------------------------------------------------------------------------
pxa168_defconfig (arm, gcc-10) — PASS, 0 errors, 0 warnings, 0 section mismatches

--------------------------------------------------------------------------------
pxa255-idp_defconfig (arm, gcc-10) — PASS, 0 errors, 0 warnings, 0 section mismatches

--------------------------------------------------------------------------------
pxa3xx_defconfig (arm, gcc-10) — PASS, 0 errors, 0 warnings, 0 section mismatches

--------------------------------------------------------------------------------
pxa910_defconfig (arm, gcc-10) — PASS, 0 errors, 0 warnings, 0 section mismatches

--------------------------------------------------------------------------------
pxa_defconfig (arm, gcc-10) — PASS, 0 errors, 0 warnings, 0 section mismatches

--------------------------------------------------------------------------------
qcom_defconfig (arm, gcc-10) — PASS, 0 errors, 0 warnings, 0 section mismatches

--------------------------------------------------------------------------------
qi_lb60_defconfig (mips, gcc-10) — PASS, 0 errors, 0 warnings, 0 section mismatches

--------------------------------------------------------------------------------
rb532_defconfig (mips, gcc-10) — PASS, 0 errors, 0 warnings, 0 section mismatches

--------------------------------------------------------------------------------
rbtx49xx_defconfig (mips, gcc-10) — PASS, 0 errors, 0 warnings, 0 section mismatches

--------------------------------------------------------------------------------
realview_defconfig (arm, gcc-10) — PASS, 0 errors, 0 warnings, 0 section mismatches

--------------------------------------------------------------------------------
rm200_defconfig (mips, gcc-10) — PASS, 0 errors, 1 warning, 0 section mismatches

Warnings:
drivers/block/paride/bpck.c:32: warning: "PC" redefined

--------------------------------------------------------------------------------
rpc_defconfig (arm, gcc-10) — FAIL, 4 errors, 0 warnings, 0 section mismatches

Errors:
arm-linux-gnueabihf-gcc: error: unrecognized -march target: armv3m
arm-linux-gnueabihf-gcc: error: missing argument to ‘-march=’
arm-linux-gnueabihf-gcc: error: unrecognized -march target: armv3m
arm-linux-gnueabihf-gcc: error: missing argument to ‘-march=’

--------------------------------------------------------------------------------
rs90_defconfig (mips, gcc-10) — PASS, 0 errors, 0 warnings, 0 section mismatches

--------------------------------------------------------------------------------
rt305x_defconfig (mips, gcc-10) — PASS, 0 errors, 0 warnings, 0 section mismatches

--------------------------------------------------------------------------------
rv32_defconfig (riscv, gcc-10) — PASS, 0 errors, 4 warnings, 0 section mismatches

Warnings:
<stdin>:830:2: warning: #warning syscall fstat64 not implemented [-Wcpp]
<stdin>:1127:2: warning: #warning syscall fstatat64 not implemented [-Wcpp]
<stdin>:830:2: warning: #warning syscall fstat64 not implemented [-Wcpp]
<stdin>:1127:2: warning: #warning syscall fstatat64 not implemented [-Wcpp]

--------------------------------------------------------------------------------
s3c2410_defconfig (arm, gcc-10) — PASS, 0 errors, 0 warnings, 0 section mismatches

--------------------------------------------------------------------------------
s3c6400_defconfig (arm, gcc-10) — PASS, 0 errors, 0 warnings, 0 section mismatches

--------------------------------------------------------------------------------
s5pv210_defconfig (arm, gcc-10) — PASS, 0 errors, 0 warnings, 0 section mismatches

--------------------------------------------------------------------------------
sama5_defconfig (arm, gcc-10) — PASS, 0 errors, 0 warnings, 0 section mismatches

--------------------------------------------------------------------------------
sb1250_swarm_defconfig (mips, gcc-10) — PASS, 0 errors, 0 warnings, 0 section mismatches

--------------------------------------------------------------------------------
shannon_defconfig (arm, gcc-10) — PASS, 0 errors, 0 warnings, 0 section mismatches

--------------------------------------------------------------------------------
shmobile_defconfig (arm, gcc-10) — PASS, 0 errors, 0 warnings, 0 section mismatches

--------------------------------------------------------------------------------
simpad_defconfig (arm, gcc-10) — PASS, 0 errors, 0 warnings, 0 section mismatches

--------------------------------------------------------------------------------
socfpga_defconfig (arm, gcc-10) — PASS, 0 errors, 0 warnings, 0 section mismatches

--------------------------------------------------------------------------------
spear13xx_defconfig (arm, gcc-10) — PASS, 0 errors, 0 warnings, 0 section mismatches

--------------------------------------------------------------------------------
spear3xx_defconfig (arm, gcc-10) — PASS, 0 errors, 0 warnings, 0 section mismatches

--------------------------------------------------------------------------------
spear6xx_defconfig (arm, gcc-10) — PASS, 0 errors, 0 warnings, 0 section mismatches

--------------------------------------------------------------------------------
spitz_defconfig (arm, gcc-10) — PASS, 0 errors, 0 warnings, 0 section mismatches

--------------------------------------------------------------------------------
stm32_defconfig (arm, gcc-10) — PASS, 0 errors, 0 warnings, 0 section mismatches

--------------------------------------------------------------------------------
sunxi_defconfig (arm, gcc-10) — PASS, 0 errors, 0 warnings, 0 section mismatches

--------------------------------------------------------------------------------
tango4_defconfig (arm, gcc-10) — PASS, 0 errors, 0 warnings, 0 section mismatches

--------------------------------------------------------------------------------
tb0219_defconfig (mips, gcc-10) — PASS, 0 errors, 0 warnings, 0 section mismatches

--------------------------------------------------------------------------------
tb0226_defconfig (mips, gcc-10) — PASS, 0 errors, 0 warnings, 0 section mismatches

--------------------------------------------------------------------------------
tb0287_defconfig (mips, gcc-10) — PASS, 0 errors, 0 warnings, 0 section mismatches

--------------------------------------------------------------------------------
tct_hammer_defconfig (arm, gcc-10) — PASS, 0 errors, 0 warnings, 0 section mismatches

--------------------------------------------------------------------------------
tegra_defconfig (arm, gcc-10) — PASS, 0 errors, 0 warnings, 0 section mismatches

--------------------------------------------------------------------------------
tinyconfig (x86_64, gcc-10) — PASS, 0 errors, 0 warnings, 0 section mismatches

--------------------------------------------------------------------------------
tinyconfig (i386, gcc-10) — PASS, 0 errors, 0 warnings, 0 section mismatches

--------------------------------------------------------------------------------
tinyconfig (arc, gcc-10) — PASS, 0 errors, 0 warnings, 0 section mismatches

--------------------------------------------------------------------------------
trizeps4_defconfig (arm, gcc-10) — PASS, 0 errors, 0 warnings, 0 section mismatches

--------------------------------------------------------------------------------
u300_defconfig (arm, gcc-10) — PASS, 0 errors, 0 warnings, 0 section mismatches

--------------------------------------------------------------------------------
u8500_defconfig (arm, gcc-10) — PASS, 0 errors, 0 warnings, 0 section mismatches

--------------------------------------------------------------------------------
vdk_hs38_defconfig (arc, gcc-10) — PASS, 0 errors, 0 warnings, 0 section mismatches

--------------------------------------------------------------------------------
vdk_hs38_smp_defconfig (arc, gcc-10) — PASS, 0 errors, 0 warnings, 0 section mismatches

--------------------------------------------------------------------------------
versatile_defconfig (arm, gcc-10) — PASS, 0 errors, 0 warnings, 0 section mismatches

--------------------------------------------------------------------------------
vexpress_defconfig (arm, gcc-10) — PASS, 0 errors, 0 warnings, 0 section mismatches

--------------------------------------------------------------------------------
vf610m4_defconfig (arm, gcc-10) — PASS, 0 errors, 0 warnings, 0 section mismatches

--------------------------------------------------------------------------------
viper_defconfig (arm, gcc-10) — PASS, 0 errors, 0 warnings, 0 section mismatches

--------------------------------------------------------------------------------
vocore2_defconfig (mips, gcc-10) — PASS, 0 errors, 0 warnings, 0 section mismatches

--------------------------------------------------------------------------------
vt8500_v6_v7_defconfig (arm, gcc-10) — PASS, 0 errors, 0 warnings, 0 section mismatches

--------------------------------------------------------------------------------
workpad_defconfig (mips, gcc-10) — PASS, 0 errors, 0 warnings, 0 section mismatches

--------------------------------------------------------------------------------
x86_64_defconfig (x86_64, gcc-10) — PASS, 0 errors, 0 warnings, 0 section mismatches

--------------------------------------------------------------------------------
x86_64_defconfig+kselftest (x86_64, gcc-10) — PASS, 0 errors, 0 warnings, 0 section mismatches

--------------------------------------------------------------------------------
x86_64_defconfig+x86-chromebook (x86_64, gcc-10) — PASS, 0 errors, 0 warnings, 0 section mismatches

--------------------------------------------------------------------------------
x86_64_defconfig+x86-chromebook+kselftest (x86_64, gcc-10) — PASS, 0 errors, 0 warnings, 0 section mismatches

--------------------------------------------------------------------------------
xcep_defconfig (arm, gcc-10) — PASS, 0 errors, 0 warnings, 0 section mismatches

--------------------------------------------------------------------------------
zeus_defconfig (arm, gcc-10) — PASS, 0 errors, 0 warnings, 0 section mismatches

--------------------------------------------------------------------------------
zx_defconfig (arm, gcc-10) — PASS, 0 errors, 0 warnings, 0 section mismatches

---
For more info write to <info@...>


Re: [PATCH v2 5.10.y-cip 00/12] Add thermal driver and watchdog driver enhancements

Nobuhiro Iwamatsu
 

Hi all,

Thanks for the series and for the fixes headed for mainline. The patches look
good to me (but I can't test/apply them due to poor network access at the
moment).
Sorry for the late review.
I reviewed this patch series and found no pointout.

I can probably do that on Friday, but I suspect Iwamatsu may be
faster.
Yeah, I will apply this series and push.

Best regards,
Nobuhiro

-----Original Message-----
From: Pavel Machek <pavel@...>
Sent: Wednesday, July 20, 2022 4:43 AM
To: Biju Das <biju.das.jz@...>
Cc: Pavel Machek <pavel@...>; iwamatsu nobuhiro(岩松 信洋 □SWC
◯ACT) <nobuhiro1.iwamatsu@...>; Lad Prabhakar
<prabhakar.mahadev-lad.rj@...>; cip-dev@...
Subject: Re: [PATCH v2 5.10.y-cip 00/12] Add thermal driver and watchdog
driver enhancements

Hi!

This patch series aims to add thermal driver support and watchdog
driver enhancments for RZ/G2L platform.

v1->v2:
* Removed patch#1 and updated rzg2l_thermal.c to use kernel.h.
Thanks for the series and for the fixes headed for mainline. The patches look
good to me (but I can't test/apply them due to poor network access at the
moment). I can probably do that on Friday, but I suspect Iwamatsu may be
faster.

Best regards,
Pavel
--
DENX Software Engineering GmbH, Managing Director: Wolfgang Denk
HRB 165235 Munich, Office: Kirchenstr.5, D-82194 Groebenzell, Germany


[isar-cip-core] security-customizations: Fix pam_tally2 deprecation

Venkata Pyla
 

From: venkata pyla <venkata.pyla@...>

pam_tally2 is deprecated from PAM version 1.4.0 that is from
Debian Bullseye, and introduced pam_faillock as replacement [1].

Modified the security customizations to check first pam_tally2 existence
for backward compatibility and if not found use the pam_faillock to
achieve the same functionality.

Fixes #33

[1] https://github.com/linux-pam/linux-pam/releases/tag/v1.4.0

Signed-off-by: venkata pyla <venkata.pyla@...>
---
.../security-customizations/files/postinst | 19 +++++++++++++++----
1 file changed, 15 insertions(+), 4 deletions(-)

diff --git a/recipes-core/security-customizations/files/postinst b/recipes-core/security-customizations/files/postinst
index 9ba8540..ae06ab7 100644
--- a/recipes-core/security-customizations/files/postinst
+++ b/recipes-core/security-customizations/files/postinst
@@ -22,11 +22,22 @@ sed -i "0,/^password.*/s/^password.*/${pam_cracklib_config}\n&/" "${PAM_PWD_FILE
# CR1.11: Unsuccessful login attempts
# Lock user account after unsuccessful login attempts
PAM_AUTH_FILE="/etc/pam.d/common-auth"
-pam_tally="auth required pam_tally2.so deny=3 even_deny_root unlock_time=60 root_unlock_time=60"
-if grep -c "pam_tally2.so" "${PAM_AUTH_FILE}";then
- sed -i '/pam_tally2/ s/^#*/#/' "${PAM_AUTH_FILE}"
+# pam_tally2 is deprecated from pam version 1.4.0-7
+if [ -f /lib/*-linux-gnu*/security/pam_tally2.so ]; then
+ PAM_MODULE="pam_tally2.so"
+ PAM_CONFIG="auth required pam_tally2.so deny=3 even_deny_root unlock_time=60 root_unlock_time=60"
+elif [ -f /lib/*-linux-gnu*/security/pam_faillock.so ]; then
+ PAM_MODULE="pam_faillock.so"
+ PAM_CONFIG="auth required pam_faillock.so preauth silent deny=3 even_deny_root unlock_time=60 root_unlock_time=60 \
+ \nauth required pam_faillock.so .so authfail deny=3 even_deny_root unlock_time=60 root_unlock_time=60"
+else
+ echo "No suitable pam module found to lock failed login attempts"
fi
-sed -i "0,/^auth.*/s/^auth.*/${pam_tally}\n&/" "${PAM_AUTH_FILE}"
+
+if grep -c "${PAM_MODULE}" "${PAM_AUTH_FILE}";then
+ sed -i '/${PAM_MODULE}/ s/^#*/#/' "${PAM_AUTH_FILE}"
+fi
+sed -i "0,/^auth.*/s/^auth.*/${PAM_CONFIG}\n&/" "${PAM_AUTH_FILE}"

# CR2.6: Remote session termination
# Terminate remote session after inactive time period
--
2.20.1


New CVE entries this week

Masami Ichikawa
 

Hi !

It's this week's CVE report.

This week reported 3 CVEs and no updated CVEs.

* New CVEs

CVE-2021-33655: When sending malicous data to kernel by ioctl cmd
FBIOPUT_VSCREENINFO,kernel will write memory out of bounds.

CVSS v3 score is not assigned.

This vulnerability allows buffer overwrite when a user passes an
invalid font size.
There are three patches in the mainline. Each commit contains an
affected version.

e64242c ("fbcon: Prevent that screen size is smaller than font size"): 5.4+
65a01e6 ("fbcon: Disallow setting font bigger than screen size"): 4.14+
6c11df5 ("fbmem: Check virtual screen sizes in fb_set_var()"): 5.4+

Fixed status
mainline: [e64242caef18b4a5840b0e7a9bff37abd4f4f933,
65a01e601dbba8b7a51a2677811f70f783766682,
6c11df58fd1ac0aefcb3b227f72769272b939e56]
stable/5.10: [cecb806c766c78e1be62b6b7b1483ef59bbaeabe]
stable/5.15: [9c9e44bb3dd5233232f2379c2dde0e403b1fd642]
stable/5.18: [365b729e36ca942f4d2d184afc8486017504a597]
stable/5.4: [af93e821973426ded00158ea66a977039483997e]

CVE-2021-33656: When setting font with malicous data by ioctl cmd
PIO_FONT,kernel will write memory out of bounds.

CVSS v3 score is not assigned.

This vulnerability requires a user to have permission to access a
console device(e.g. /dev/tth1).

Fixed status
mainline: [ff2047fb755d4415ec3c70ac799889371151796d]
stable/4.14: [259742e9ad3551d5be58cd4754e65e0aabc1f9c8]
stable/4.19: [b15d5731b708a2190fec836990b8aefbbf36b07a]
stable/4.9: [dc1421db273b725ebe90978a4b2d9bfba5cef702]
stable/5.10: [3acb7dc242ca25eb258493b513ef2f4b0f2a9ad1]
stable/5.4: [c87e851b23e5cb2ba90a3049ef38340ed7d5746f]

CVE-2022-21505: Kernel lockdown bypass bug

CVSS v3 score is not assigned.

When UEFI Secure Boot is disable and linux boots with
"ima_appraise=log" parameter, user is able to do kexec even if the
lockdown feature is enabled.
A reporter attached a
patch(https://www.openwall.com/lists/oss-security/2022/07/19/4) but it
hasn't been merged yet.
This vulnerability was introduced by commit 29d3c1c ("kexec: Allow
kexec_file() with appropriate IMA policy when locked down") which was
merged in 5.4. Less than 5.4 kernels aren't affected by this issue.

Fixed status
Patch is available but not merged yet

* Updated CVEs

No updated CVEs this week.

Currently tracking CVEs

CVE-2021-31615: Unencrypted Bluetooth Low Energy baseband links in
Bluetooth Core Specifications 4.0 through 5.2

There is no fix information.

CVE-2020-26556: kernel: malleable commitment Bluetooth Mesh Provisioning

No fix information.

CVE-2020-26557: kernel: predictable Authvalue in Bluetooth Mesh
Provisioning Leads to MITM

No fix information.

CVE-2020-26559: kernel: Authvalue leak in Bluetooth Mesh Provisioning

No fix information.

CVE-2020-26560: kernel: impersonation attack in Bluetooth Mesh Provisioning

No fix information.

Regards,
--
Masami Ichikawa
Cybertrust Japan Co., Ltd.

Email :masami.ichikawa@...
:masami.ichikawa@...


Re: [PATCH v2 5.10.y-cip 00/12] Add thermal driver and watchdog driver enhancements

Pavel Machek
 

Hi!

This patch series aims to add thermal driver support and watchdog driver enhancments
for RZ/G2L platform.

v1->v2:
* Removed patch#1 and updated rzg2l_thermal.c to use kernel.h.
Thanks for the series and for the fixes headed for mainline. The patches look good to me
(but I can't test/apply them due to poor network access at the moment). I can probably do
that on Friday, but I suspect Iwamatsu may be faster.

Best regards,
Pavel
--
DENX Software Engineering GmbH, Managing Director: Wolfgang Denk
HRB 165235 Munich, Office: Kirchenstr.5, D-82194 Groebenzell, Germany


Re: [isar-cip-core][PATCH] doc: Update the document for bullseye image

Jan Kiszka
 

On 18.07.22 14:52, Srinuvasan A wrote:
From: Srinuvasan A <srinuvasan_a@...>

Now the default distro is bullseye, hence correct the document of
swupdate and secureboot w.r.t bullseye image.

Signed-off-by: Srinuvasan A <srinuvasan_a@...>
---
doc/README.secureboot.md | 6 +++---
doc/README.swupdate.md | 16 ++++++++--------
2 files changed, 11 insertions(+), 11 deletions(-)

diff --git a/doc/README.secureboot.md b/doc/README.secureboot.md
index c1a0301..319b4db 100644
--- a/doc/README.secureboot.md
+++ b/doc/README.secureboot.md
@@ -204,10 +204,10 @@ OVMF_VARS=<path to the modified OVMF_VARS.fd> \

For updating the image, the following steps are necessary:
- [Build the image with snakeoil keys](### Build image)
-- save the generated swu `build/tmp/deploy/images/qemu-amd64/cip-core-image-cip-core-buster-qemu-amd64.swu` to /tmp
+- save the generated swu `build/tmp/deploy/images/qemu-amd64/cip-core-image-cip-core-bullseye-qemu-amd64.swu` to /tmp
- modify the image for example add a new version to the image by adding `PV=2.0.0` to
[cip-core-image.bb](recipes-core/images/cip-core-image.bb)
-- start the new target and copy the swu `cip-core-image-cip-core-buster-qemu-amd64.swu`
+- start the new target and copy the swu `cip-core-image-cip-core-bullseye-qemu-amd64.swu`
to the running system, e.g.:
```
SECURE=y ./start-qemu.sh amd64 -virtfs local,path=/tmp,mount_tag=host0,security_model=passthrough,id=host0
@@ -228,7 +228,7 @@ sda 8:0 0 2G 0 disk
└─sda5 8:5 0 1000M 0 part
```

-- install with `swupdate -i /mnt/cip-core-image-cip-core-buster-qemu-amd64.swu`
+- install with `swupdate -i /mnt/cip-core-image-cip-core-bullseye-qemu-amd64.swu`
- reboot
- check which partition is booted, e.g. with `lsblk`. The rootfs should have changed:
```
diff --git a/doc/README.swupdate.md b/doc/README.swupdate.md
index e28db24..1b242a2 100644
--- a/doc/README.swupdate.md
+++ b/doc/README.swupdate.md
@@ -15,7 +15,7 @@ Then build the image which will later serve as update package:
```
host$ ./kas-container build kas-cip.yml:kas/board/qemu-amd64.yml:kas/opt/ebg-swu.yml
```
-Save the generated swu `build/tmp/deploy/images/qemu-amd64/cip-core-image-cip-core-buster-qemu-amd64.swu` into a separate folder (ex: /tmp).
+Save the generated swu `build/tmp/deploy/images/qemu-amd64/cip-core-image-cip-core-bullseye-qemu-amd64.swu` into a separate folder (ex: /tmp).

Next, rebuild the image, switching to the RT kernel as modification:
```
@@ -27,9 +27,9 @@ Now start the image which will contain the RT kernel:
host$ SWUPDATE_BOOT=y ./start-qemu.sh amd64
```

-Copy `cip-core-image-cip-core-buster-qemu-amd64.swu` file from `tmp` folder into the running system:
+Copy `cip-core-image-cip-core-bullseye-qemu-amd64.swu` file from `tmp` folder into the running system:
```
-host$ scp -P 22222 /tmp/cip-core-image-cip-core-buster-qemu-amd64.swu root@localhost:
+host$ scp -P 22222 /tmp/cip-core-image-cip-core-bullseye-qemu-amd64.swu root@localhost:
```

Check which partition is booted, e.g. with lsblk:
@@ -56,7 +56,7 @@ root@demo:~# cat /sys/kernel/realtime

Now apply swupdate and reboot
```
-root@demo:~# swupdate -i cip-core-image-cip-core-buster-qemu-amd64.swu
+root@demo:~# swupdate -i cip-core-image-cip-core-bullseye-qemu-amd64.swu
root@demo:~# reboot
```

@@ -123,7 +123,7 @@ Build the image for swupdate with a service which causes kernel panic during sys
```
host$ ./kas-container build kas-cip.yml:kas/board/qemu-amd64.yml:kas/opt/ebg-swu.yml:kas/opt/kernel-panic.yml
```
-Save the generated swu `build/tmp/deploy/images/qemu-amd64/cip-core-image-cip-core-buster-qemu-amd64.swu` in a separate folder.
+Save the generated swu `build/tmp/deploy/images/qemu-amd64/cip-core-image-cip-core-bullseye-qemu-amd64.swu` in a separate folder.
Then build the image without `kernel-panic.yml` recipe using below command:
```
host$ ./kas-container build kas-cip.yml:kas/board/qemu-amd64.yml:kas/opt/ebg-swu.yml
@@ -134,14 +134,14 @@ Start the target on QEMU:
host$ SWUPDATE_BOOT=y ./start-qemu.sh amd64
```

-Copy `cip-core-image-cip-core-buster-qemu-amd64.swu` file from `tmp` folder into the running system:
+Copy `cip-core-image-cip-core-bullseye-qemu-amd64.swu` file from `tmp` folder into the running system:
```
-host$ scp -P 22222 /tmp/cip-core-image-cip-core-buster-qemu-amd64.swu root@localhost:
+host$ scp -P 22222 /tmp/cip-core-image-cip-core-bullseye-qemu-amd64.swu root@localhost:
```

Apply swupdate as below:
```
-root@demo:~# swupdate -i cip-core-image-cip-core-buster-qemu-amd64.swu
+root@demo:~# swupdate -i cip-core-image-cip-core-bullseye-qemu-amd64.swu
```

Check bootloader ustate after swupdate. If the swupdate is successful then **revision number** should be **3** and status should be changed to **INSTALLED** for Partition #1.
Thanks, applied.

Jan

--
Siemens AG, Technology
Competence Center Embedded Linux


[isar-cip-core][PATCH] doc: Update the document for bullseye image

Srinuvasan A
 


Re: [isar-cip-core] cip-core-image-security.bb:Add libpam-google-authenticator package

Jan Kiszka
 

On 17.07.22 14:49, Shreyas.Karmahe@... wrote:
From: Shreyas Karmahe <Shreyas.Karmahe@...>

Add libpam-google-authenticator package to the security image, in order
achieve the Multi-factor authentication requirement.

This package is already added as a debian dependency in the
security-customizations recipe, and also mentioning it here in the image
recipes to make sure all the packages required for the IEC requirement
is added at one place.

Signed-off-by: Shreyas Karmahe <Shreyas.Karmahe@...>
---
recipes-core/images/cip-core-image-security.bb | 1 +
1 file changed, 1 insertion(+)

diff --git a/recipes-core/images/cip-core-image-security.bb b/recipes-core/images/cip-core-image-security.bb
index 6060978..24b1f46 100644
--- a/recipes-core/images/cip-core-image-security.bb
+++ b/recipes-core/images/cip-core-image-security.bb
@@ -33,6 +33,7 @@ IMAGE_PREINSTALL += " \
uuid-runtime \
sudo \
aide-common \
+ libpam-google-authenticator \
"

OVERRIDES_append = ":${BASE_DISTRO_CODENAME}"
Thanks, applied.

Jan

--
Siemens AG, Technology
Competence Center Embedded Linux


[PATCH v2 5.10.y-cip 12/12] watchdog: rzg2l_wdt: Add set_timeout callback

Biju Das
 

commit 4055ee81009e606e830af1acd9e2e35a36249713 upstream.

This patch adds support for set_timeout callback.

Once WDT is started, the WDT cycle setting register(WDTSET) can be updated
only after issuing a module reset. Otherwise, it will ignore the writes
and will hold the previous value. This patch updates the WDTSET register
if it is active.

Signed-off-by: Biju Das <biju.das.jz@...>
Reviewed-by: Geert Uytterhoeven <geert+renesas@...>
Reviewed-by: Guenter Roeck <linux@...>
Link: https://lore.kernel.org/r/20220225175320.11041-8-biju.das.jz@bp.renesas.com
Signed-off-by: Guenter Roeck <linux@...>
Signed-off-by: Wim Van Sebroeck <wim@...>
Signed-off-by: Biju Das <biju.das.jz@...>
---
drivers/watchdog/rzg2l_wdt.c | 20 ++++++++++++++++++++
1 file changed, 20 insertions(+)

diff --git a/drivers/watchdog/rzg2l_wdt.c b/drivers/watchdog/rzg2l_wdt.c
index 4e7107655cc2..6eea0ee4af49 100644
--- a/drivers/watchdog/rzg2l_wdt.c
+++ b/drivers/watchdog/rzg2l_wdt.c
@@ -115,6 +115,25 @@ static int rzg2l_wdt_stop(struct watchdog_device *wdev)
return 0;
}

+static int rzg2l_wdt_set_timeout(struct watchdog_device *wdev, unsigned int timeout)
+{
+ struct rzg2l_wdt_priv *priv = watchdog_get_drvdata(wdev);
+
+ wdev->timeout = timeout;
+
+ /*
+ * If the watchdog is active, reset the module for updating the WDTSET
+ * register so that it is updated with new timeout values.
+ */
+ if (watchdog_active(wdev)) {
+ pm_runtime_put(wdev->parent);
+ reset_control_reset(priv->rstc);
+ rzg2l_wdt_start(wdev);
+ }
+
+ return 0;
+}
+
static int rzg2l_wdt_restart(struct watchdog_device *wdev,
unsigned long action, void *data)
{
@@ -151,6 +170,7 @@ static const struct watchdog_ops rzg2l_wdt_ops = {
.start = rzg2l_wdt_start,
.stop = rzg2l_wdt_stop,
.ping = rzg2l_wdt_ping,
+ .set_timeout = rzg2l_wdt_set_timeout,
.restart = rzg2l_wdt_restart,
};

--
2.25.1


[PATCH v2 5.10.y-cip 11/12] watchdog: rzg2l_wdt: Use force reset for WDT reset

Biju Das
 

commit f43e6ddbd7d7b63b9e71927a1f50860f8d55f9cc upstream.

This patch uses the force reset(WDTRSTB) for triggering WDT reset for
restart callback. This method(ie, Generate Reset (WDTRSTB) Signal on
parity error)is faster compared to the overflow method for triggering
watchdog reset.

Overflow method:
reboot: Restarting system
Reboot failed -- System halted
NOTICE: BL2: v2.5(release):v2.5/rzg2l-1.00-27-gf48f1440c

Parity error method:
reboot: Restarting system
NOTICE: BL2: v2.5(release):v2.5/rzg2l-1.00-27-gf48f1440c

Signed-off-by: Biju Das <biju.das.jz@...>
Reviewed-by: Geert Uytterhoeven <geert+renesas@...>
Reviewed-by: Guenter Roeck <linux@...>
Link: https://lore.kernel.org/r/20220225175320.11041-7-biju.das.jz@bp.renesas.com
Signed-off-by: Guenter Roeck <linux@...>
Signed-off-by: Wim Van Sebroeck <wim@...>
Signed-off-by: Biju Das <biju.das.jz@...>
---
drivers/watchdog/rzg2l_wdt.c | 14 +++++++-------
1 file changed, 7 insertions(+), 7 deletions(-)

diff --git a/drivers/watchdog/rzg2l_wdt.c b/drivers/watchdog/rzg2l_wdt.c
index 73b667ed3e99..4e7107655cc2 100644
--- a/drivers/watchdog/rzg2l_wdt.c
+++ b/drivers/watchdog/rzg2l_wdt.c
@@ -21,8 +21,11 @@
#define WDTSET 0x04
#define WDTTIM 0x08
#define WDTINT 0x0C
+#define PECR 0x10
+#define PEEN 0x14
#define WDTCNT_WDTEN BIT(0)
#define WDTINT_INTDISP BIT(0)
+#define PEEN_FORCE BIT(0)

#define WDT_DEFAULT_TIMEOUT 60U

@@ -117,17 +120,14 @@ static int rzg2l_wdt_restart(struct watchdog_device *wdev,
{
struct rzg2l_wdt_priv *priv = watchdog_get_drvdata(wdev);

- /* Reset the module before we modify any register */
- reset_control_reset(priv->rstc);
-
clk_prepare_enable(priv->pclk);
clk_prepare_enable(priv->osc_clk);

- /* smallest counter value to reboot soon */
- rzg2l_wdt_write(priv, WDTSET_COUNTER_VAL(1), WDTSET);
+ /* Generate Reset (WDTRSTB) Signal on parity error */
+ rzg2l_wdt_write(priv, 0, PECR);

- /* Enable watchdog timer*/
- rzg2l_wdt_write(priv, WDTCNT_WDTEN, WDTCNT);
+ /* Force parity error */
+ rzg2l_wdt_write(priv, PEEN_FORCE, PEEN);

return 0;
}
--
2.25.1


[PATCH v2 5.10.y-cip 10/12] watchdog: rzg2l_wdt: Add error check for reset_control_deassert

Biju Das
 

commit baf1aace9ad15401f08e048a7f1fdec79821bc61 upstream.

If reset_control_deassert() fails, then we won't be able to
access the device registers. Therefore check the return code of
reset_control_deassert() and bailout in case of error.

Signed-off-by: Biju Das <biju.das.jz@...>
Reviewed-by: Geert Uytterhoeven <geert+renesas@...>
Reviewed-by: Guenter Roeck <linux@...>
Link: https://lore.kernel.org/r/20220225175320.11041-6-biju.das.jz@bp.renesas.com
Signed-off-by: Guenter Roeck <linux@...>
Signed-off-by: Wim Van Sebroeck <wim@...>
Signed-off-by: Biju Das <biju.das.jz@...>
---
drivers/watchdog/rzg2l_wdt.c | 5 ++++-
1 file changed, 4 insertions(+), 1 deletion(-)

diff --git a/drivers/watchdog/rzg2l_wdt.c b/drivers/watchdog/rzg2l_wdt.c
index 88274704b260..73b667ed3e99 100644
--- a/drivers/watchdog/rzg2l_wdt.c
+++ b/drivers/watchdog/rzg2l_wdt.c
@@ -203,7 +203,10 @@ static int rzg2l_wdt_probe(struct platform_device *pdev)
return dev_err_probe(&pdev->dev, PTR_ERR(priv->rstc),
"failed to get cpg reset");

- reset_control_deassert(priv->rstc);
+ ret = reset_control_deassert(priv->rstc);
+ if (ret)
+ return dev_err_probe(dev, ret, "failed to deassert");
+
pm_runtime_enable(&pdev->dev);

priv->wdev.info = &rzg2l_wdt_ident;
--
2.25.1


[PATCH v2 5.10.y-cip 09/12] watchdog: rzg2l_wdt: Fix reset control imbalance

Biju Das
 

commit 33d04d0fdba9fae18c7d58364643d2c606a43dba upstream.

Both rzg2l_wdt_probe() and rzg2l_wdt_start() calls reset_control_
deassert() which results in a reset control imbalance.

This patch fixes reset control imbalance by removing reset_control_
deassert() from rzg2l_wdt_start() and replaces reset_control_assert with
reset_control_reset in rzg2l_wdt_stop() as watchdog module can be stopped
only by a module reset. This change will allow us to restart WDT after
stop() by configuring WDT timeout and enable registers.

Fixes: 2cbc5cd0b55fa2 ("watchdog: Add Watchdog Timer driver for RZ/G2L")
Signed-off-by: Biju Das <biju.das.jz@...>
Reviewed-by: Geert Uytterhoeven <geert+renesas@...>
Reviewed-by: Guenter Roeck <linux@...>
Link: https://lore.kernel.org/r/20220225175320.11041-5-biju.das.jz@bp.renesas.com
Signed-off-by: Guenter Roeck <linux@...>
Signed-off-by: Wim Van Sebroeck <wim@...>
Signed-off-by: Biju Das <biju.das.jz@...>
---
drivers/watchdog/rzg2l_wdt.c | 3 +--
1 file changed, 1 insertion(+), 2 deletions(-)

diff --git a/drivers/watchdog/rzg2l_wdt.c b/drivers/watchdog/rzg2l_wdt.c
index 48dfe6e5e64f..88274704b260 100644
--- a/drivers/watchdog/rzg2l_wdt.c
+++ b/drivers/watchdog/rzg2l_wdt.c
@@ -88,7 +88,6 @@ static int rzg2l_wdt_start(struct watchdog_device *wdev)
{
struct rzg2l_wdt_priv *priv = watchdog_get_drvdata(wdev);

- reset_control_deassert(priv->rstc);
pm_runtime_get_sync(wdev->parent);

/* Initialize time out */
@@ -108,7 +107,7 @@ static int rzg2l_wdt_stop(struct watchdog_device *wdev)
struct rzg2l_wdt_priv *priv = watchdog_get_drvdata(wdev);

pm_runtime_put(wdev->parent);
- reset_control_assert(priv->rstc);
+ reset_control_reset(priv->rstc);

return 0;
}
--
2.25.1


[PATCH v2 5.10.y-cip 08/12] watchdog: rzg2l_wdt: Fix 'BUG: Invalid wait context'

Biju Das
 

commit e4cf89596c1f1e33309556699f910ced4abbaf44 upstream.

This patch fixes the issue 'BUG: Invalid wait context' during restart()
callback by using clk_prepare_enable() instead of pm_runtime_get_sync()
for turning on the clocks during restart.

This issue is noticed when testing with renesas_defconfig.

[ 42.213802] reboot: Restarting system
[ 42.217860]
[ 42.219364] =============================
[ 42.223368] [ BUG: Invalid wait context ]
[ 42.227372] 5.17.0-rc5-arm64-renesas-00002-g10393723e35e #522 Not tainted
[ 42.234153] -----------------------------
[ 42.238155] systemd-shutdow/1 is trying to lock:
[ 42.242766] ffff00000a650828 (&genpd->mlock){+.+.}-{3:3}, at: genpd_lock_mtx+0x14/0x20
[ 42.250709] other info that might help us debug this:
[ 42.255753] context-{4:4}
[ 42.258368] 2 locks held by systemd-shutdow/1:
[ 42.262806] #0: ffff80000944e1c8 (system_transition_mutex#2){+.+.}-{3:3}, at: __do_sys_reboot+0xd0/0x250
[ 42.272388] #1: ffff8000094c4e40 (rcu_read_lock){....}-{1:2}, at: atomic_notifier_call_chain+0x0/0x150
[ 42.281795] stack backtrace:
[ 42.284672] CPU: 0 PID: 1 Comm: systemd-shutdow Not tainted 5.17.0-rc5-arm64-renesas-00002-g10393723e35e #522
[ 42.294577] Hardware name: Renesas SMARC EVK based on r9a07g044c2 (DT)
[ 42.301096] Call trace:
[ 42.303538] dump_backtrace+0xcc/0xd8
[ 42.307203] show_stack+0x14/0x30
[ 42.310517] dump_stack_lvl+0x88/0xb0
[ 42.314180] dump_stack+0x14/0x2c
[ 42.317492] __lock_acquire+0x1b24/0x1b50
[ 42.321502] lock_acquire+0x120/0x3a8
[ 42.325162] __mutex_lock+0x84/0x8f8
[ 42.328737] mutex_lock_nested+0x30/0x58
[ 42.332658] genpd_lock_mtx+0x14/0x20
[ 42.336319] genpd_runtime_resume+0xc4/0x228
[ 42.340587] __rpm_callback+0x44/0x170
[ 42.344337] rpm_callback+0x64/0x70
[ 42.347824] rpm_resume+0x4e0/0x6b8
[ 42.351310] __pm_runtime_resume+0x50/0x78
[ 42.355404] rzg2l_wdt_restart+0x28/0x68
[ 42.359329] watchdog_restart_notifier+0x1c/0x30
[ 42.363943] atomic_notifier_call_chain+0x94/0x150
[ 42.368732] do_kernel_restart+0x24/0x30
[ 42.372652] machine_restart+0x44/0x70
[ 42.376399] kernel_restart+0x3c/0x60
[ 42.380058] __do_sys_reboot+0x228/0x250
[ 42.383977] __arm64_sys_reboot+0x20/0x28
[ 42.387983] invoke_syscall+0x40/0xf8

Fixes: 2cbc5cd0b55fa2 ("watchdog: Add Watchdog Timer driver for RZ/G2L")
Signed-off-by: Biju Das <biju.das.jz@...>
Reviewed-by: Geert Uytterhoeven <geert+renesas@...>
Reviewed-by: Guenter Roeck <linux@...>
Link: https://lore.kernel.org/r/20220225175320.11041-4-biju.das.jz@bp.renesas.com
Signed-off-by: Guenter Roeck <linux@...>
Signed-off-by: Wim Van Sebroeck <wim@...>
Signed-off-by: Biju Das <biju.das.jz@...>
---
drivers/watchdog/rzg2l_wdt.c | 25 +++++++++++++------------
1 file changed, 13 insertions(+), 12 deletions(-)

diff --git a/drivers/watchdog/rzg2l_wdt.c b/drivers/watchdog/rzg2l_wdt.c
index 0fc73b8a9567..48dfe6e5e64f 100644
--- a/drivers/watchdog/rzg2l_wdt.c
+++ b/drivers/watchdog/rzg2l_wdt.c
@@ -43,6 +43,8 @@ struct rzg2l_wdt_priv {
struct reset_control *rstc;
unsigned long osc_clk_rate;
unsigned long delay;
+ struct clk *pclk;
+ struct clk *osc_clk;
};

static void rzg2l_wdt_wait_delay(struct rzg2l_wdt_priv *priv)
@@ -118,7 +120,9 @@ static int rzg2l_wdt_restart(struct watchdog_device *wdev,

/* Reset the module before we modify any register */
reset_control_reset(priv->rstc);
- pm_runtime_get_sync(wdev->parent);
+
+ clk_prepare_enable(priv->pclk);
+ clk_prepare_enable(priv->osc_clk);

/* smallest counter value to reboot soon */
rzg2l_wdt_write(priv, WDTSET_COUNTER_VAL(1), WDTSET);
@@ -165,7 +169,6 @@ static int rzg2l_wdt_probe(struct platform_device *pdev)
struct device *dev = &pdev->dev;
struct rzg2l_wdt_priv *priv;
unsigned long pclk_rate;
- struct clk *wdt_clk;
int ret;

priv = devm_kzalloc(dev, sizeof(*priv), GFP_KERNEL);
@@ -177,22 +180,20 @@ static int rzg2l_wdt_probe(struct platform_device *pdev)
return PTR_ERR(priv->base);

/* Get watchdog main clock */
- wdt_clk = clk_get(&pdev->dev, "oscclk");
- if (IS_ERR(wdt_clk))
- return dev_err_probe(&pdev->dev, PTR_ERR(wdt_clk), "no oscclk");
+ priv->osc_clk = devm_clk_get(&pdev->dev, "oscclk");
+ if (IS_ERR(priv->osc_clk))
+ return dev_err_probe(&pdev->dev, PTR_ERR(priv->osc_clk), "no oscclk");

- priv->osc_clk_rate = clk_get_rate(wdt_clk);
- clk_put(wdt_clk);
+ priv->osc_clk_rate = clk_get_rate(priv->osc_clk);
if (!priv->osc_clk_rate)
return dev_err_probe(&pdev->dev, -EINVAL, "oscclk rate is 0");

/* Get Peripheral clock */
- wdt_clk = clk_get(&pdev->dev, "pclk");
- if (IS_ERR(wdt_clk))
- return dev_err_probe(&pdev->dev, PTR_ERR(wdt_clk), "no pclk");
+ priv->pclk = devm_clk_get(&pdev->dev, "pclk");
+ if (IS_ERR(priv->pclk))
+ return dev_err_probe(&pdev->dev, PTR_ERR(priv->pclk), "no pclk");

- pclk_rate = clk_get_rate(wdt_clk);
- clk_put(wdt_clk);
+ pclk_rate = clk_get_rate(priv->pclk);
if (!pclk_rate)
return dev_err_probe(&pdev->dev, -EINVAL, "pclk rate is 0");

--
2.25.1


[PATCH v2 5.10.y-cip 07/12] watchdog: rzg2l_wdt: Fix Runtime PM usage

Biju Das
 

commit 95abafe76297fa057de6c3486ef844bd446bdf18 upstream.

Both rzg2l_wdt_probe() and rzg2l_wdt_start() calls pm_runtime_get() which
results in a usage counter imbalance. This patch fixes this issue by
removing pm_runtime_get() call from probe.

Fixes: 2cbc5cd0b55fa2 ("watchdog: Add Watchdog Timer driver for RZ/G2L")
Signed-off-by: Biju Das <biju.das.jz@...>
Reviewed-by: Geert Uytterhoeven <geert+renesas@...>
Reviewed-by: Guenter Roeck <linux@...>
Link: https://lore.kernel.org/r/20220225175320.11041-3-biju.das.jz@bp.renesas.com
Signed-off-by: Guenter Roeck <linux@...>
Signed-off-by: Wim Van Sebroeck <wim@...>
Signed-off-by: Biju Das <biju.das.jz@...>
---
drivers/watchdog/rzg2l_wdt.c | 16 ++--------------
1 file changed, 2 insertions(+), 14 deletions(-)

diff --git a/drivers/watchdog/rzg2l_wdt.c b/drivers/watchdog/rzg2l_wdt.c
index 96f2a018ab62..0fc73b8a9567 100644
--- a/drivers/watchdog/rzg2l_wdt.c
+++ b/drivers/watchdog/rzg2l_wdt.c
@@ -151,12 +151,11 @@ static const struct watchdog_ops rzg2l_wdt_ops = {
.restart = rzg2l_wdt_restart,
};

-static void rzg2l_wdt_reset_assert_pm_disable_put(void *data)
+static void rzg2l_wdt_reset_assert_pm_disable(void *data)
{
struct watchdog_device *wdev = data;
struct rzg2l_wdt_priv *priv = watchdog_get_drvdata(wdev);

- pm_runtime_put(wdev->parent);
pm_runtime_disable(wdev->parent);
reset_control_assert(priv->rstc);
}
@@ -206,11 +205,6 @@ static int rzg2l_wdt_probe(struct platform_device *pdev)

reset_control_deassert(priv->rstc);
pm_runtime_enable(&pdev->dev);
- ret = pm_runtime_resume_and_get(&pdev->dev);
- if (ret < 0) {
- dev_err(dev, "pm_runtime_resume_and_get failed ret=%pe", ERR_PTR(ret));
- goto out_pm_get;
- }

priv->wdev.info = &rzg2l_wdt_ident;
priv->wdev.ops = &rzg2l_wdt_ops;
@@ -222,7 +216,7 @@ static int rzg2l_wdt_probe(struct platform_device *pdev)

watchdog_set_drvdata(&priv->wdev, priv);
ret = devm_add_action_or_reset(&pdev->dev,
- rzg2l_wdt_reset_assert_pm_disable_put,
+ rzg2l_wdt_reset_assert_pm_disable,
&priv->wdev);
if (ret < 0)
return ret;
@@ -235,12 +229,6 @@ static int rzg2l_wdt_probe(struct platform_device *pdev)
dev_warn(dev, "Specified timeout invalid, using default");

return devm_watchdog_register_device(&pdev->dev, &priv->wdev);
-
-out_pm_get:
- pm_runtime_disable(dev);
- reset_control_assert(priv->rstc);
-
- return ret;
}

static const struct of_device_id rzg2l_wdt_ids[] = {
--
2.25.1


[PATCH v2 5.10.y-cip 06/12] watchdog: rzg2l_wdt: Fix 32bit overflow issue

Biju Das
 

commit ea2949df22a533cdf75e4583c00b1ce94cd5a83b upstream.

The value of timer_cycle_us can be 0 due to 32bit overflow.
For eg:- If we assign the counter value "0xfff" for computing
maxval.

This patch fixes this issue by appending ULL to 1024, so that
it is promoted to 64bit.

This patch also fixes the warning message, 'watchdog: Invalid min and
max timeout values, resetting to 0!'.

Fixes: 2cbc5cd0b55fa2 ("watchdog: Add Watchdog Timer driver for RZ/G2L")
Signed-off-by: Biju Das <biju.das.jz@...>
Reviewed-by: Guenter Roeck <linux@...>
Reviewed-by: Geert Uytterhoeven <geert+renesas@...>
Link: https://lore.kernel.org/r/20220225175320.11041-2-biju.das.jz@bp.renesas.com
Signed-off-by: Guenter Roeck <linux@...>
Signed-off-by: Wim Van Sebroeck <wim@...>
Signed-off-by: Biju Das <biju.das.jz@...>
---
drivers/watchdog/rzg2l_wdt.c | 2 +-
1 file changed, 1 insertion(+), 1 deletion(-)

diff --git a/drivers/watchdog/rzg2l_wdt.c b/drivers/watchdog/rzg2l_wdt.c
index 6b426df34fd6..96f2a018ab62 100644
--- a/drivers/watchdog/rzg2l_wdt.c
+++ b/drivers/watchdog/rzg2l_wdt.c
@@ -53,7 +53,7 @@ static void rzg2l_wdt_wait_delay(struct rzg2l_wdt_priv *priv)

static u32 rzg2l_wdt_get_cycle_usec(unsigned long cycle, u32 wdttime)
{
- u64 timer_cycle_us = 1024 * 1024 * (wdttime + 1) * MICRO;
+ u64 timer_cycle_us = 1024 * 1024ULL * (wdttime + 1) * MICRO;

return div64_ul(timer_cycle_us, cycle);
}
--
2.25.1

401 - 420 of 9269