Date   

cip-gitlab/ci/iwamatsu/linux-5.10.y-cip-rc smc: 9 runs, 2 regressions (v5.10.121-cip9-287-ge9094c8446fc) #kernelci

kernelci.org bot <bot@...>
 

cip-gitlab/ci/iwamatsu/linux-5.10.y-cip-rc smc: 9 runs, 2 regressions (v5.10.121-cip9-287-ge9094c8446fc)

Regressions Summary
-------------------

platform | arch | lab | compiler | defconfig | regressions
----------------------+-------+-------------+----------+----------------------------+------------
qemu_arm64-virt-gicv3 | arm64 | lab-broonie | gcc-10 | defconfig+arm64-chromebook | 1
qemu_arm64-virt-gicv3 | arm64 | lab-broonie | gcc-10 | defconfig | 1

Details: https://kernelci.org/test/job/cip-gitlab/branch/ci%2Fiwamatsu%2Flinux-5.10.y-cip-rc/kernel/v5.10.121-cip9-287-ge9094c8446fc/plan/smc/

Test: smc
Tree: cip-gitlab
Branch: ci/iwamatsu/linux-5.10.y-cip-rc
Describe: v5.10.121-cip9-287-ge9094c8446fc
URL: https://gitlab.com/cip-project/cip-kernel/linux-cip.git
SHA: e9094c8446fcef728d675699ced39be2dbbfb8f7


Test Regressions
----------------


platform | arch | lab | compiler | defconfig | regressions
----------------------+-------+-------------+----------+----------------------------+------------
qemu_arm64-virt-gicv3 | arm64 | lab-broonie | gcc-10 | defconfig+arm64-chromebook | 1

Details: https://kernelci.org/test/plan/id/62ba40f589487d1a60a39be4

Results: 0 PASS, 1 FAIL, 0 SKIP
Full config: defconfig+arm64-chromebook
Compiler: gcc-10 (aarch64-linux-gnu-gcc (Debian 10.2.1-6) 10.2.1 20210110)
Plain log: https://storage.kernelci.org//cip-gitlab/ci-iwamatsu-linux-5.10.y-cip-rc/v5.10.121-cip9-287-ge9094c8446fc/arm64/defconfig+arm64-chromebook/gcc-10/lab-broonie/smc-qemu_arm64-virt-gicv3.txt
HTML log: https://storage.kernelci.org//cip-gitlab/ci-iwamatsu-linux-5.10.y-cip-rc/v5.10.121-cip9-287-ge9094c8446fc/arm64/defconfig+arm64-chromebook/gcc-10/lab-broonie/smc-qemu_arm64-virt-gicv3.html
Rootfs: http://storage.kernelci.org/images/rootfs/buildroot/buildroot-baseline/20220624.0/arm64/rootfs.cpio.gz


* smc.login: https://kernelci.org/test/case/id/62ba40f589487d1a60a39be5
failing since 46 days (last pass: v5.10.112-cip6-88-gf3397cadb2dd6, first fail: v5.10.112-cip6-289-g2969e096d186)



platform | arch | lab | compiler | defconfig | regressions
----------------------+-------+-------------+----------+----------------------------+------------
qemu_arm64-virt-gicv3 | arm64 | lab-broonie | gcc-10 | defconfig | 1

Details: https://kernelci.org/test/plan/id/62ba4271027ddb65c8a39bda

Results: 0 PASS, 1 FAIL, 0 SKIP
Full config: defconfig
Compiler: gcc-10 (aarch64-linux-gnu-gcc (Debian 10.2.1-6) 10.2.1 20210110)
Plain log: https://storage.kernelci.org//cip-gitlab/ci-iwamatsu-linux-5.10.y-cip-rc/v5.10.121-cip9-287-ge9094c8446fc/arm64/defconfig/gcc-10/lab-broonie/smc-qemu_arm64-virt-gicv3.txt
HTML log: https://storage.kernelci.org//cip-gitlab/ci-iwamatsu-linux-5.10.y-cip-rc/v5.10.121-cip9-287-ge9094c8446fc/arm64/defconfig/gcc-10/lab-broonie/smc-qemu_arm64-virt-gicv3.html
Rootfs: http://storage.kernelci.org/images/rootfs/buildroot/buildroot-baseline/20220624.0/arm64/rootfs.cpio.gz


* smc.login: https://kernelci.org/test/case/id/62ba4271027ddb65c8a39bdb
failing since 49 days (last pass: v5.10.112-cip6-88-gf3397cadb2dd6, first fail: v5.10.112-cip6-218-g8253434cd56a)


cip-gitlab/ci/iwamatsu/linux-5.10.y-cip-rc kselftest-lkdtm: 5 runs, 2 regressions (v5.10.121-cip9-287-ge9094c8446fc) #kernelci

kernelci.org bot <bot@...>
 

cip-gitlab/ci/iwamatsu/linux-5.10.y-cip-rc kselftest-lkdtm: 5 runs, 2 regressions (v5.10.121-cip9-287-ge9094c8446fc)

Regressions Summary
-------------------

platform | arch | lab | compiler | defconfig | regressions
--------------------------+--------+---------------+----------+------------------------------+------------
asus-C433TA-AJ0005-rammus | x86_64 | lab-collabora | gcc-10 | x86_64_defcon...ok+kselftest | 1
hp-11A-G6-EE-grunt | x86_64 | lab-collabora | gcc-10 | x86_64_defcon...ok+kselftest | 1

Details: https://kernelci.org/test/job/cip-gitlab/branch/ci%2Fiwamatsu%2Flinux-5.10.y-cip-rc/kernel/v5.10.121-cip9-287-ge9094c8446fc/plan/kselftest-lkdtm/

Test: kselftest-lkdtm
Tree: cip-gitlab
Branch: ci/iwamatsu/linux-5.10.y-cip-rc
Describe: v5.10.121-cip9-287-ge9094c8446fc
URL: https://gitlab.com/cip-project/cip-kernel/linux-cip.git
SHA: e9094c8446fcef728d675699ced39be2dbbfb8f7


Test Regressions
----------------


platform | arch | lab | compiler | defconfig | regressions
--------------------------+--------+---------------+----------+------------------------------+------------
asus-C433TA-AJ0005-rammus | x86_64 | lab-collabora | gcc-10 | x86_64_defcon...ok+kselftest | 1

Details: https://kernelci.org/test/plan/id/62ba38d41aabb8bb99a39bd6

Results: 37 PASS, 17 FAIL, 25 SKIP
Full config: x86_64_defconfig+x86-chromebook+kselftest
Compiler: gcc-10 (gcc (Debian 10.2.1-6) 10.2.1 20210110)
Plain log: https://storage.kernelci.org//cip-gitlab/ci-iwamatsu-linux-5.10.y-cip-rc/v5.10.121-cip9-287-ge9094c8446fc/x86_64/x86_64_defconfig+x86-chromebook+kselftest/gcc-10/lab-collabora/kselftest-lkdtm-asus-C433TA-AJ0005-rammus.txt
HTML log: https://storage.kernelci.org//cip-gitlab/ci-iwamatsu-linux-5.10.y-cip-rc/v5.10.121-cip9-287-ge9094c8446fc/x86_64/x86_64_defconfig+x86-chromebook+kselftest/gcc-10/lab-collabora/kselftest-lkdtm-asus-C433TA-AJ0005-rammus.html
Rootfs: http://storage.kernelci.org/images/rootfs/debian/bullseye-kselftest/20220624.0/amd64/initrd.cpio.gz


* kselftest-lkdtm.lkdtm_USERCOPY_STACK_FRAME_FROM_sh: https://kernelci.org/test/case/id/62ba38d41aabb8bb99a39bdc
failing since 3 days (last pass: v5.10.118-465-g0af29783a3c9, first fail: v5.10.121-cip9-272-g3fb28d4c623b)



platform | arch | lab | compiler | defconfig | regressions
--------------------------+--------+---------------+----------+------------------------------+------------
hp-11A-G6-EE-grunt | x86_64 | lab-collabora | gcc-10 | x86_64_defcon...ok+kselftest | 1

Details: https://kernelci.org/test/plan/id/62ba3d6f69e8633025a39bd1

Results: 36 PASS, 18 FAIL, 25 SKIP
Full config: x86_64_defconfig+x86-chromebook+kselftest
Compiler: gcc-10 (gcc (Debian 10.2.1-6) 10.2.1 20210110)
Plain log: https://storage.kernelci.org//cip-gitlab/ci-iwamatsu-linux-5.10.y-cip-rc/v5.10.121-cip9-287-ge9094c8446fc/x86_64/x86_64_defconfig+x86-chromebook+kselftest/gcc-10/lab-collabora/kselftest-lkdtm-hp-11A-G6-EE-grunt.txt
HTML log: https://storage.kernelci.org//cip-gitlab/ci-iwamatsu-linux-5.10.y-cip-rc/v5.10.121-cip9-287-ge9094c8446fc/x86_64/x86_64_defconfig+x86-chromebook+kselftest/gcc-10/lab-collabora/kselftest-lkdtm-hp-11A-G6-EE-grunt.html
Rootfs: http://storage.kernelci.org/images/rootfs/debian/bullseye-kselftest/20220624.0/amd64/initrd.cpio.gz


* kselftest-lkdtm.lkdtm_USERCOPY_STACK_FRAME_FROM_sh: https://kernelci.org/test/case/id/62ba3d6f69e8633025a39bd7
failing since 3 days (last pass: v5.10.118-465-g0af29783a3c9, first fail: v5.10.121-cip9-272-g3fb28d4c623b)


cip-gitlab/ci/iwamatsu/linux-5.10.y-cip-rc kselftest-seccomp: 6 runs, 1 regressions (v5.10.121-cip9-287-ge9094c8446fc) #kernelci

kernelci.org bot <bot@...>
 

cip-gitlab/ci/iwamatsu/linux-5.10.y-cip-rc kselftest-seccomp: 6 runs, 1 regressions (v5.10.121-cip9-287-ge9094c8446fc)

Regressions Summary
-------------------

platform | arch | lab | compiler | defconfig | regressions
-----------------------------+-------+--------------+----------+---------------------+------------
meson-gxl-s905x-libretech-cc | arm64 | lab-baylibre | gcc-10 | defconfig+kselftest | 1

Details: https://kernelci.org/test/job/cip-gitlab/branch/ci%2Fiwamatsu%2Flinux-5.10.y-cip-rc/kernel/v5.10.121-cip9-287-ge9094c8446fc/plan/kselftest-seccomp/

Test: kselftest-seccomp
Tree: cip-gitlab
Branch: ci/iwamatsu/linux-5.10.y-cip-rc
Describe: v5.10.121-cip9-287-ge9094c8446fc
URL: https://gitlab.com/cip-project/cip-kernel/linux-cip.git
SHA: e9094c8446fcef728d675699ced39be2dbbfb8f7


Test Regressions
----------------


platform | arch | lab | compiler | defconfig | regressions
-----------------------------+-------+--------------+----------+---------------------+------------
meson-gxl-s905x-libretech-cc | arm64 | lab-baylibre | gcc-10 | defconfig+kselftest | 1

Details: https://kernelci.org/test/plan/id/62ba415a70e39709d6a39bcd

Results: 0 PASS, 1 FAIL, 0 SKIP
Full config: defconfig+kselftest
Compiler: gcc-10 (aarch64-linux-gnu-gcc (Debian 10.2.1-6) 10.2.1 20210110)
Plain log: https://storage.kernelci.org//cip-gitlab/ci-iwamatsu-linux-5.10.y-cip-rc/v5.10.121-cip9-287-ge9094c8446fc/arm64/defconfig+kselftest/gcc-10/lab-baylibre/kselftest-seccomp-meson-gxl-s905x-libretech-cc.txt
HTML log: https://storage.kernelci.org//cip-gitlab/ci-iwamatsu-linux-5.10.y-cip-rc/v5.10.121-cip9-287-ge9094c8446fc/arm64/defconfig+kselftest/gcc-10/lab-baylibre/kselftest-seccomp-meson-gxl-s905x-libretech-cc.html
Rootfs: http://storage.kernelci.org/images/rootfs/debian/bullseye-kselftest/20220624.0/arm64/initrd.cpio.gz


* kselftest-seccomp.login: https://kernelci.org/test/case/id/62ba415a70e39709d6a39bce
new failure (last pass: v5.10.118-465-g0af29783a3c9)


cip-gitlab/ci/iwamatsu/linux-5.10.y-cip-rc kselftest-futex: 10 runs, 1 regressions (v5.10.121-cip9-287-ge9094c8446fc) #kernelci

kernelci.org bot <bot@...>
 

cip-gitlab/ci/iwamatsu/linux-5.10.y-cip-rc kselftest-futex: 10 runs, 1 regressions (v5.10.121-cip9-287-ge9094c8446fc)

Regressions Summary
-------------------

platform | arch | lab | compiler | defconfig | regressions
-------------------------+-------+---------+----------+-----------+------------
r8a774a1-hihope-rzg2m-ex | arm64 | lab-cip | gcc-10 | defconfig | 1

Details: https://kernelci.org/test/job/cip-gitlab/branch/ci%2Fiwamatsu%2Flinux-5.10.y-cip-rc/kernel/v5.10.121-cip9-287-ge9094c8446fc/plan/kselftest-futex/

Test: kselftest-futex
Tree: cip-gitlab
Branch: ci/iwamatsu/linux-5.10.y-cip-rc
Describe: v5.10.121-cip9-287-ge9094c8446fc
URL: https://gitlab.com/cip-project/cip-kernel/linux-cip.git
SHA: e9094c8446fcef728d675699ced39be2dbbfb8f7


Test Regressions
----------------


platform | arch | lab | compiler | defconfig | regressions
-------------------------+-------+---------+----------+-----------+------------
r8a774a1-hihope-rzg2m-ex | arm64 | lab-cip | gcc-10 | defconfig | 1

Details: https://kernelci.org/test/plan/id/62ba417e3ec497bdc9a39c03

Results: 0 PASS, 1 FAIL, 0 SKIP
Full config: defconfig
Compiler: gcc-10 (aarch64-linux-gnu-gcc (Debian 10.2.1-6) 10.2.1 20210110)
Plain log: https://storage.kernelci.org//cip-gitlab/ci-iwamatsu-linux-5.10.y-cip-rc/v5.10.121-cip9-287-ge9094c8446fc/arm64/defconfig/gcc-10/lab-cip/kselftest-futex-r8a774a1-hihope-rzg2m-ex.txt
HTML log: https://storage.kernelci.org//cip-gitlab/ci-iwamatsu-linux-5.10.y-cip-rc/v5.10.121-cip9-287-ge9094c8446fc/arm64/defconfig/gcc-10/lab-cip/kselftest-futex-r8a774a1-hihope-rzg2m-ex.html
Rootfs: http://storage.kernelci.org/images/rootfs/debian/bullseye-kselftest/20220624.0/arm64/initrd.cpio.gz


* kselftest-futex.login: https://kernelci.org/test/case/id/62ba417e3ec497bdc9a39c04
new failure (last pass: v5.10.121-cip9-272-g3fb28d4c623b)


cip-gitlab/ci/iwamatsu/linux-5.10.y-cip-rc baseline: 142 runs, 18 regressions (v5.10.121-cip9-287-ge9094c8446fc) #kernelci

kernelci.org bot <bot@...>
 

cip-gitlab/ci/iwamatsu/linux-5.10.y-cip-rc baseline: 142 runs, 18 regressions (v5.10.121-cip9-287-ge9094c8446fc)

Regressions Summary
-------------------

platform | arch | lab | compiler | defconfig | regressions
---------------------------+--------+---------------+----------+------------------------------+------------
asus-C433TA-AJ0005-rammus | x86_64 | lab-collabora | gcc-10 | x86_64_defcon...6-chromebook | 1
qemu_arm64-virt-gicv2 | arm64 | lab-baylibre | gcc-10 | defconfig+arm64-chromebook | 1
qemu_arm64-virt-gicv2 | arm64 | lab-baylibre | gcc-10 | defconfig | 1
qemu_arm64-virt-gicv2 | arm64 | lab-broonie | gcc-10 | defconfig+arm64-chromebook | 1
qemu_arm64-virt-gicv2 | arm64 | lab-broonie | gcc-10 | defconfig | 1
qemu_arm64-virt-gicv2-uefi | arm64 | lab-baylibre | gcc-10 | defconfig+arm64-chromebook | 1
qemu_arm64-virt-gicv2-uefi | arm64 | lab-baylibre | gcc-10 | defconfig | 1
qemu_arm64-virt-gicv2-uefi | arm64 | lab-broonie | gcc-10 | defconfig+arm64-chromebook | 1
qemu_arm64-virt-gicv2-uefi | arm64 | lab-broonie | gcc-10 | defconfig | 1
qemu_arm64-virt-gicv3 | arm64 | lab-baylibre | gcc-10 | defconfig+arm64-chromebook | 1
qemu_arm64-virt-gicv3 | arm64 | lab-baylibre | gcc-10 | defconfig | 1
qemu_arm64-virt-gicv3 | arm64 | lab-broonie | gcc-10 | defconfig+arm64-chromebook | 1
qemu_arm64-virt-gicv3 | arm64 | lab-broonie | gcc-10 | defconfig | 1
qemu_arm64-virt-gicv3-uefi | arm64 | lab-baylibre | gcc-10 | defconfig+arm64-chromebook | 1
qemu_arm64-virt-gicv3-uefi | arm64 | lab-baylibre | gcc-10 | defconfig | 1
qemu_arm64-virt-gicv3-uefi | arm64 | lab-broonie | gcc-10 | defconfig+arm64-chromebook | 1
qemu_arm64-virt-gicv3-uefi | arm64 | lab-broonie | gcc-10 | defconfig | 1
rk3399-gru-kevin | arm64 | lab-collabora | gcc-10 | defconfig+arm64-chromebook | 1

Details: https://kernelci.org/test/job/cip-gitlab/branch/ci%2Fiwamatsu%2Flinux-5.10.y-cip-rc/kernel/v5.10.121-cip9-287-ge9094c8446fc/plan/baseline/

Test: baseline
Tree: cip-gitlab
Branch: ci/iwamatsu/linux-5.10.y-cip-rc
Describe: v5.10.121-cip9-287-ge9094c8446fc
URL: https://gitlab.com/cip-project/cip-kernel/linux-cip.git
SHA: e9094c8446fcef728d675699ced39be2dbbfb8f7


Test Regressions
----------------


platform | arch | lab | compiler | defconfig | regressions
---------------------------+--------+---------------+----------+------------------------------+------------
asus-C433TA-AJ0005-rammus | x86_64 | lab-collabora | gcc-10 | x86_64_defcon...6-chromebook | 1

Details: https://kernelci.org/test/plan/id/62ba378e09b2c52f9ca39bf5

Results: 0 PASS, 1 FAIL, 0 SKIP
Full config: x86_64_defconfig+x86-chromebook
Compiler: gcc-10 (gcc (Debian 10.2.1-6) 10.2.1 20210110)
Plain log: https://storage.kernelci.org//cip-gitlab/ci-iwamatsu-linux-5.10.y-cip-rc/v5.10.121-cip9-287-ge9094c8446fc/x86_64/x86_64_defconfig+x86-chromebook/gcc-10/lab-collabora/baseline-asus-C433TA-AJ0005-rammus.txt
HTML log: https://storage.kernelci.org//cip-gitlab/ci-iwamatsu-linux-5.10.y-cip-rc/v5.10.121-cip9-287-ge9094c8446fc/x86_64/x86_64_defconfig+x86-chromebook/gcc-10/lab-collabora/baseline-asus-C433TA-AJ0005-rammus.html
Rootfs: http://storage.kernelci.org/images/rootfs/buildroot/buildroot-baseline/20220624.0/x86/rootfs.cpio.gz


* baseline.login: https://kernelci.org/test/case/id/62ba378e09b2c52f9ca39bf6
new failure (last pass: v5.10.121-cip9-272-g3fb28d4c623b)



platform | arch | lab | compiler | defconfig | regressions
---------------------------+--------+---------------+----------+------------------------------+------------
qemu_arm64-virt-gicv2 | arm64 | lab-baylibre | gcc-10 | defconfig+arm64-chromebook | 1

Details: https://kernelci.org/test/plan/id/62ba3910dc75b4dd14a39bd8

Results: 0 PASS, 1 FAIL, 0 SKIP
Full config: defconfig+arm64-chromebook
Compiler: gcc-10 (aarch64-linux-gnu-gcc (Debian 10.2.1-6) 10.2.1 20210110)
Plain log: https://storage.kernelci.org//cip-gitlab/ci-iwamatsu-linux-5.10.y-cip-rc/v5.10.121-cip9-287-ge9094c8446fc/arm64/defconfig+arm64-chromebook/gcc-10/lab-baylibre/baseline-qemu_arm64-virt-gicv2.txt
HTML log: https://storage.kernelci.org//cip-gitlab/ci-iwamatsu-linux-5.10.y-cip-rc/v5.10.121-cip9-287-ge9094c8446fc/arm64/defconfig+arm64-chromebook/gcc-10/lab-baylibre/baseline-qemu_arm64-virt-gicv2.html
Rootfs: http://storage.kernelci.org/images/rootfs/buildroot/buildroot-baseline/20220624.0/arm64/rootfs.cpio.gz


* baseline.login: https://kernelci.org/test/case/id/62ba3910dc75b4dd14a39bd9
failing since 46 days (last pass: v5.10.112-cip6-88-gf3397cadb2dd6, first fail: v5.10.112-cip6-289-g2969e096d186)



platform | arch | lab | compiler | defconfig | regressions
---------------------------+--------+---------------+----------+------------------------------+------------
qemu_arm64-virt-gicv2 | arm64 | lab-baylibre | gcc-10 | defconfig | 1

Details: https://kernelci.org/test/plan/id/62ba3dc05a60f99225a39bcd

Results: 0 PASS, 1 FAIL, 0 SKIP
Full config: defconfig
Compiler: gcc-10 (aarch64-linux-gnu-gcc (Debian 10.2.1-6) 10.2.1 20210110)
Plain log: https://storage.kernelci.org//cip-gitlab/ci-iwamatsu-linux-5.10.y-cip-rc/v5.10.121-cip9-287-ge9094c8446fc/arm64/defconfig/gcc-10/lab-baylibre/baseline-qemu_arm64-virt-gicv2.txt
HTML log: https://storage.kernelci.org//cip-gitlab/ci-iwamatsu-linux-5.10.y-cip-rc/v5.10.121-cip9-287-ge9094c8446fc/arm64/defconfig/gcc-10/lab-baylibre/baseline-qemu_arm64-virt-gicv2.html
Rootfs: http://storage.kernelci.org/images/rootfs/buildroot/buildroot-baseline/20220624.0/arm64/rootfs.cpio.gz


* baseline.login: https://kernelci.org/test/case/id/62ba3dc05a60f99225a39bce
failing since 49 days (last pass: v5.10.112-cip6-88-gf3397cadb2dd6, first fail: v5.10.112-cip6-218-g8253434cd56a)



platform | arch | lab | compiler | defconfig | regressions
---------------------------+--------+---------------+----------+------------------------------+------------
qemu_arm64-virt-gicv2 | arm64 | lab-broonie | gcc-10 | defconfig+arm64-chromebook | 1

Details: https://kernelci.org/test/plan/id/62ba37f80286e0c219a39bf8

Results: 0 PASS, 1 FAIL, 0 SKIP
Full config: defconfig+arm64-chromebook
Compiler: gcc-10 (aarch64-linux-gnu-gcc (Debian 10.2.1-6) 10.2.1 20210110)
Plain log: https://storage.kernelci.org//cip-gitlab/ci-iwamatsu-linux-5.10.y-cip-rc/v5.10.121-cip9-287-ge9094c8446fc/arm64/defconfig+arm64-chromebook/gcc-10/lab-broonie/baseline-qemu_arm64-virt-gicv2.txt
HTML log: https://storage.kernelci.org//cip-gitlab/ci-iwamatsu-linux-5.10.y-cip-rc/v5.10.121-cip9-287-ge9094c8446fc/arm64/defconfig+arm64-chromebook/gcc-10/lab-broonie/baseline-qemu_arm64-virt-gicv2.html
Rootfs: http://storage.kernelci.org/images/rootfs/buildroot/buildroot-baseline/20220624.0/arm64/rootfs.cpio.gz


* baseline.login: https://kernelci.org/test/case/id/62ba37f80286e0c219a39bf9
failing since 46 days (last pass: v5.10.112-cip6-88-gf3397cadb2dd6, first fail: v5.10.112-cip6-289-g2969e096d186)



platform | arch | lab | compiler | defconfig | regressions
---------------------------+--------+---------------+----------+------------------------------+------------
qemu_arm64-virt-gicv2 | arm64 | lab-broonie | gcc-10 | defconfig | 1

Details: https://kernelci.org/test/plan/id/62ba3bcd001572cd86a39c09

Results: 0 PASS, 1 FAIL, 0 SKIP
Full config: defconfig
Compiler: gcc-10 (aarch64-linux-gnu-gcc (Debian 10.2.1-6) 10.2.1 20210110)
Plain log: https://storage.kernelci.org//cip-gitlab/ci-iwamatsu-linux-5.10.y-cip-rc/v5.10.121-cip9-287-ge9094c8446fc/arm64/defconfig/gcc-10/lab-broonie/baseline-qemu_arm64-virt-gicv2.txt
HTML log: https://storage.kernelci.org//cip-gitlab/ci-iwamatsu-linux-5.10.y-cip-rc/v5.10.121-cip9-287-ge9094c8446fc/arm64/defconfig/gcc-10/lab-broonie/baseline-qemu_arm64-virt-gicv2.html
Rootfs: http://storage.kernelci.org/images/rootfs/buildroot/buildroot-baseline/20220624.0/arm64/rootfs.cpio.gz


* baseline.login: https://kernelci.org/test/case/id/62ba3bcd001572cd86a39c0a
failing since 49 days (last pass: v5.10.112-cip6-88-gf3397cadb2dd6, first fail: v5.10.112-cip6-218-g8253434cd56a)



platform | arch | lab | compiler | defconfig | regressions
---------------------------+--------+---------------+----------+------------------------------+------------
qemu_arm64-virt-gicv2-uefi | arm64 | lab-baylibre | gcc-10 | defconfig+arm64-chromebook | 1

Details: https://kernelci.org/test/plan/id/62ba390fbf25b1808aa39bcd

Results: 0 PASS, 1 FAIL, 0 SKIP
Full config: defconfig+arm64-chromebook
Compiler: gcc-10 (aarch64-linux-gnu-gcc (Debian 10.2.1-6) 10.2.1 20210110)
Plain log: https://storage.kernelci.org//cip-gitlab/ci-iwamatsu-linux-5.10.y-cip-rc/v5.10.121-cip9-287-ge9094c8446fc/arm64/defconfig+arm64-chromebook/gcc-10/lab-baylibre/baseline-qemu_arm64-virt-gicv2-uefi.txt
HTML log: https://storage.kernelci.org//cip-gitlab/ci-iwamatsu-linux-5.10.y-cip-rc/v5.10.121-cip9-287-ge9094c8446fc/arm64/defconfig+arm64-chromebook/gcc-10/lab-baylibre/baseline-qemu_arm64-virt-gicv2-uefi.html
Rootfs: http://storage.kernelci.org/images/rootfs/buildroot/buildroot-baseline/20220624.0/arm64/rootfs.cpio.gz


* baseline.login: https://kernelci.org/test/case/id/62ba390fbf25b1808aa39bce
failing since 46 days (last pass: v5.10.112-cip6-88-gf3397cadb2dd6, first fail: v5.10.112-cip6-289-g2969e096d186)



platform | arch | lab | compiler | defconfig | regressions
---------------------------+--------+---------------+----------+------------------------------+------------
qemu_arm64-virt-gicv2-uefi | arm64 | lab-baylibre | gcc-10 | defconfig | 1

Details: https://kernelci.org/test/plan/id/62ba3e25c8e872e955a39c17

Results: 0 PASS, 1 FAIL, 0 SKIP
Full config: defconfig
Compiler: gcc-10 (aarch64-linux-gnu-gcc (Debian 10.2.1-6) 10.2.1 20210110)
Plain log: https://storage.kernelci.org//cip-gitlab/ci-iwamatsu-linux-5.10.y-cip-rc/v5.10.121-cip9-287-ge9094c8446fc/arm64/defconfig/gcc-10/lab-baylibre/baseline-qemu_arm64-virt-gicv2-uefi.txt
HTML log: https://storage.kernelci.org//cip-gitlab/ci-iwamatsu-linux-5.10.y-cip-rc/v5.10.121-cip9-287-ge9094c8446fc/arm64/defconfig/gcc-10/lab-baylibre/baseline-qemu_arm64-virt-gicv2-uefi.html
Rootfs: http://storage.kernelci.org/images/rootfs/buildroot/buildroot-baseline/20220624.0/arm64/rootfs.cpio.gz


* baseline.login: https://kernelci.org/test/case/id/62ba3e25c8e872e955a39c18
failing since 49 days (last pass: v5.10.112-cip6-88-gf3397cadb2dd6, first fail: v5.10.112-cip6-218-g8253434cd56a)



platform | arch | lab | compiler | defconfig | regressions
---------------------------+--------+---------------+----------+------------------------------+------------
qemu_arm64-virt-gicv2-uefi | arm64 | lab-broonie | gcc-10 | defconfig+arm64-chromebook | 1

Details: https://kernelci.org/test/plan/id/62ba37e34d8485f75ea39bce

Results: 0 PASS, 1 FAIL, 0 SKIP
Full config: defconfig+arm64-chromebook
Compiler: gcc-10 (aarch64-linux-gnu-gcc (Debian 10.2.1-6) 10.2.1 20210110)
Plain log: https://storage.kernelci.org//cip-gitlab/ci-iwamatsu-linux-5.10.y-cip-rc/v5.10.121-cip9-287-ge9094c8446fc/arm64/defconfig+arm64-chromebook/gcc-10/lab-broonie/baseline-qemu_arm64-virt-gicv2-uefi.txt
HTML log: https://storage.kernelci.org//cip-gitlab/ci-iwamatsu-linux-5.10.y-cip-rc/v5.10.121-cip9-287-ge9094c8446fc/arm64/defconfig+arm64-chromebook/gcc-10/lab-broonie/baseline-qemu_arm64-virt-gicv2-uefi.html
Rootfs: http://storage.kernelci.org/images/rootfs/buildroot/buildroot-baseline/20220624.0/arm64/rootfs.cpio.gz


* baseline.login: https://kernelci.org/test/case/id/62ba37e34d8485f75ea39bcf
failing since 46 days (last pass: v5.10.112-cip6-88-gf3397cadb2dd6, first fail: v5.10.112-cip6-289-g2969e096d186)



platform | arch | lab | compiler | defconfig | regressions
---------------------------+--------+---------------+----------+------------------------------+------------
qemu_arm64-virt-gicv2-uefi | arm64 | lab-broonie | gcc-10 | defconfig | 1

Details: https://kernelci.org/test/plan/id/62ba3bf49cae5e3ec6a39bcd

Results: 0 PASS, 1 FAIL, 0 SKIP
Full config: defconfig
Compiler: gcc-10 (aarch64-linux-gnu-gcc (Debian 10.2.1-6) 10.2.1 20210110)
Plain log: https://storage.kernelci.org//cip-gitlab/ci-iwamatsu-linux-5.10.y-cip-rc/v5.10.121-cip9-287-ge9094c8446fc/arm64/defconfig/gcc-10/lab-broonie/baseline-qemu_arm64-virt-gicv2-uefi.txt
HTML log: https://storage.kernelci.org//cip-gitlab/ci-iwamatsu-linux-5.10.y-cip-rc/v5.10.121-cip9-287-ge9094c8446fc/arm64/defconfig/gcc-10/lab-broonie/baseline-qemu_arm64-virt-gicv2-uefi.html
Rootfs: http://storage.kernelci.org/images/rootfs/buildroot/buildroot-baseline/20220624.0/arm64/rootfs.cpio.gz


* baseline.login: https://kernelci.org/test/case/id/62ba3bf49cae5e3ec6a39bce
failing since 49 days (last pass: v5.10.112-cip6-88-gf3397cadb2dd6, first fail: v5.10.112-cip6-218-g8253434cd56a)



platform | arch | lab | compiler | defconfig | regressions
---------------------------+--------+---------------+----------+------------------------------+------------
qemu_arm64-virt-gicv3 | arm64 | lab-baylibre | gcc-10 | defconfig+arm64-chromebook | 1

Details: https://kernelci.org/test/plan/id/62ba393af20e6eda84a39bdc

Results: 0 PASS, 1 FAIL, 0 SKIP
Full config: defconfig+arm64-chromebook
Compiler: gcc-10 (aarch64-linux-gnu-gcc (Debian 10.2.1-6) 10.2.1 20210110)
Plain log: https://storage.kernelci.org//cip-gitlab/ci-iwamatsu-linux-5.10.y-cip-rc/v5.10.121-cip9-287-ge9094c8446fc/arm64/defconfig+arm64-chromebook/gcc-10/lab-baylibre/baseline-qemu_arm64-virt-gicv3.txt
HTML log: https://storage.kernelci.org//cip-gitlab/ci-iwamatsu-linux-5.10.y-cip-rc/v5.10.121-cip9-287-ge9094c8446fc/arm64/defconfig+arm64-chromebook/gcc-10/lab-baylibre/baseline-qemu_arm64-virt-gicv3.html
Rootfs: http://storage.kernelci.org/images/rootfs/buildroot/buildroot-baseline/20220624.0/arm64/rootfs.cpio.gz


* baseline.login: https://kernelci.org/test/case/id/62ba393af20e6eda84a39bdd
failing since 46 days (last pass: v5.10.112-cip6-88-gf3397cadb2dd6, first fail: v5.10.112-cip6-289-g2969e096d186)



platform | arch | lab | compiler | defconfig | regressions
---------------------------+--------+---------------+----------+------------------------------+------------
qemu_arm64-virt-gicv3 | arm64 | lab-baylibre | gcc-10 | defconfig | 1

Details: https://kernelci.org/test/plan/id/62ba3dfd40cccd70dba39c02

Results: 0 PASS, 1 FAIL, 0 SKIP
Full config: defconfig
Compiler: gcc-10 (aarch64-linux-gnu-gcc (Debian 10.2.1-6) 10.2.1 20210110)
Plain log: https://storage.kernelci.org//cip-gitlab/ci-iwamatsu-linux-5.10.y-cip-rc/v5.10.121-cip9-287-ge9094c8446fc/arm64/defconfig/gcc-10/lab-baylibre/baseline-qemu_arm64-virt-gicv3.txt
HTML log: https://storage.kernelci.org//cip-gitlab/ci-iwamatsu-linux-5.10.y-cip-rc/v5.10.121-cip9-287-ge9094c8446fc/arm64/defconfig/gcc-10/lab-baylibre/baseline-qemu_arm64-virt-gicv3.html
Rootfs: http://storage.kernelci.org/images/rootfs/buildroot/buildroot-baseline/20220624.0/arm64/rootfs.cpio.gz


* baseline.login: https://kernelci.org/test/case/id/62ba3dfd40cccd70dba39c03
failing since 49 days (last pass: v5.10.112-cip6-88-gf3397cadb2dd6, first fail: v5.10.112-cip6-218-g8253434cd56a)



platform | arch | lab | compiler | defconfig | regressions
---------------------------+--------+---------------+----------+------------------------------+------------
qemu_arm64-virt-gicv3 | arm64 | lab-broonie | gcc-10 | defconfig+arm64-chromebook | 1

Details: https://kernelci.org/test/plan/id/62ba380cbd1e1fa764a39bdb

Results: 0 PASS, 1 FAIL, 0 SKIP
Full config: defconfig+arm64-chromebook
Compiler: gcc-10 (aarch64-linux-gnu-gcc (Debian 10.2.1-6) 10.2.1 20210110)
Plain log: https://storage.kernelci.org//cip-gitlab/ci-iwamatsu-linux-5.10.y-cip-rc/v5.10.121-cip9-287-ge9094c8446fc/arm64/defconfig+arm64-chromebook/gcc-10/lab-broonie/baseline-qemu_arm64-virt-gicv3.txt
HTML log: https://storage.kernelci.org//cip-gitlab/ci-iwamatsu-linux-5.10.y-cip-rc/v5.10.121-cip9-287-ge9094c8446fc/arm64/defconfig+arm64-chromebook/gcc-10/lab-broonie/baseline-qemu_arm64-virt-gicv3.html
Rootfs: http://storage.kernelci.org/images/rootfs/buildroot/buildroot-baseline/20220624.0/arm64/rootfs.cpio.gz


* baseline.login: https://kernelci.org/test/case/id/62ba380cbd1e1fa764a39bdc
failing since 46 days (last pass: v5.10.112-cip6-88-gf3397cadb2dd6, first fail: v5.10.112-cip6-289-g2969e096d186)



platform | arch | lab | compiler | defconfig | regressions
---------------------------+--------+---------------+----------+------------------------------+------------
qemu_arm64-virt-gicv3 | arm64 | lab-broonie | gcc-10 | defconfig | 1

Details: https://kernelci.org/test/plan/id/62ba3bce001572cd86a39c0c

Results: 0 PASS, 1 FAIL, 0 SKIP
Full config: defconfig
Compiler: gcc-10 (aarch64-linux-gnu-gcc (Debian 10.2.1-6) 10.2.1 20210110)
Plain log: https://storage.kernelci.org//cip-gitlab/ci-iwamatsu-linux-5.10.y-cip-rc/v5.10.121-cip9-287-ge9094c8446fc/arm64/defconfig/gcc-10/lab-broonie/baseline-qemu_arm64-virt-gicv3.txt
HTML log: https://storage.kernelci.org//cip-gitlab/ci-iwamatsu-linux-5.10.y-cip-rc/v5.10.121-cip9-287-ge9094c8446fc/arm64/defconfig/gcc-10/lab-broonie/baseline-qemu_arm64-virt-gicv3.html
Rootfs: http://storage.kernelci.org/images/rootfs/buildroot/buildroot-baseline/20220624.0/arm64/rootfs.cpio.gz


* baseline.login: https://kernelci.org/test/case/id/62ba3bce001572cd86a39c0d
failing since 49 days (last pass: v5.10.112-cip6-88-gf3397cadb2dd6, first fail: v5.10.112-cip6-218-g8253434cd56a)



platform | arch | lab | compiler | defconfig | regressions
---------------------------+--------+---------------+----------+------------------------------+------------
qemu_arm64-virt-gicv3-uefi | arm64 | lab-baylibre | gcc-10 | defconfig+arm64-chromebook | 1

Details: https://kernelci.org/test/plan/id/62ba39386da7246c15a39be3

Results: 0 PASS, 1 FAIL, 0 SKIP
Full config: defconfig+arm64-chromebook
Compiler: gcc-10 (aarch64-linux-gnu-gcc (Debian 10.2.1-6) 10.2.1 20210110)
Plain log: https://storage.kernelci.org//cip-gitlab/ci-iwamatsu-linux-5.10.y-cip-rc/v5.10.121-cip9-287-ge9094c8446fc/arm64/defconfig+arm64-chromebook/gcc-10/lab-baylibre/baseline-qemu_arm64-virt-gicv3-uefi.txt
HTML log: https://storage.kernelci.org//cip-gitlab/ci-iwamatsu-linux-5.10.y-cip-rc/v5.10.121-cip9-287-ge9094c8446fc/arm64/defconfig+arm64-chromebook/gcc-10/lab-baylibre/baseline-qemu_arm64-virt-gicv3-uefi.html
Rootfs: http://storage.kernelci.org/images/rootfs/buildroot/buildroot-baseline/20220624.0/arm64/rootfs.cpio.gz


* baseline.login: https://kernelci.org/test/case/id/62ba39386da7246c15a39be4
failing since 46 days (last pass: v5.10.112-cip6-88-gf3397cadb2dd6, first fail: v5.10.112-cip6-289-g2969e096d186)



platform | arch | lab | compiler | defconfig | regressions
---------------------------+--------+---------------+----------+------------------------------+------------
qemu_arm64-virt-gicv3-uefi | arm64 | lab-baylibre | gcc-10 | defconfig | 1

Details: https://kernelci.org/test/plan/id/62ba3dd46248e77ddfa39bfa

Results: 0 PASS, 1 FAIL, 0 SKIP
Full config: defconfig
Compiler: gcc-10 (aarch64-linux-gnu-gcc (Debian 10.2.1-6) 10.2.1 20210110)
Plain log: https://storage.kernelci.org//cip-gitlab/ci-iwamatsu-linux-5.10.y-cip-rc/v5.10.121-cip9-287-ge9094c8446fc/arm64/defconfig/gcc-10/lab-baylibre/baseline-qemu_arm64-virt-gicv3-uefi.txt
HTML log: https://storage.kernelci.org//cip-gitlab/ci-iwamatsu-linux-5.10.y-cip-rc/v5.10.121-cip9-287-ge9094c8446fc/arm64/defconfig/gcc-10/lab-baylibre/baseline-qemu_arm64-virt-gicv3-uefi.html
Rootfs: http://storage.kernelci.org/images/rootfs/buildroot/buildroot-baseline/20220624.0/arm64/rootfs.cpio.gz


* baseline.login: https://kernelci.org/test/case/id/62ba3dd46248e77ddfa39bfb
failing since 49 days (last pass: v5.10.112-cip6-88-gf3397cadb2dd6, first fail: v5.10.112-cip6-218-g8253434cd56a)



platform | arch | lab | compiler | defconfig | regressions
---------------------------+--------+---------------+----------+------------------------------+------------
qemu_arm64-virt-gicv3-uefi | arm64 | lab-broonie | gcc-10 | defconfig+arm64-chromebook | 1

Details: https://kernelci.org/test/plan/id/62ba37f90286e0c219a39c06

Results: 0 PASS, 1 FAIL, 0 SKIP
Full config: defconfig+arm64-chromebook
Compiler: gcc-10 (aarch64-linux-gnu-gcc (Debian 10.2.1-6) 10.2.1 20210110)
Plain log: https://storage.kernelci.org//cip-gitlab/ci-iwamatsu-linux-5.10.y-cip-rc/v5.10.121-cip9-287-ge9094c8446fc/arm64/defconfig+arm64-chromebook/gcc-10/lab-broonie/baseline-qemu_arm64-virt-gicv3-uefi.txt
HTML log: https://storage.kernelci.org//cip-gitlab/ci-iwamatsu-linux-5.10.y-cip-rc/v5.10.121-cip9-287-ge9094c8446fc/arm64/defconfig+arm64-chromebook/gcc-10/lab-broonie/baseline-qemu_arm64-virt-gicv3-uefi.html
Rootfs: http://storage.kernelci.org/images/rootfs/buildroot/buildroot-baseline/20220624.0/arm64/rootfs.cpio.gz


* baseline.login: https://kernelci.org/test/case/id/62ba37f90286e0c219a39c07
failing since 46 days (last pass: v5.10.112-cip6-88-gf3397cadb2dd6, first fail: v5.10.112-cip6-289-g2969e096d186)



platform | arch | lab | compiler | defconfig | regressions
---------------------------+--------+---------------+----------+------------------------------+------------
qemu_arm64-virt-gicv3-uefi | arm64 | lab-broonie | gcc-10 | defconfig | 1

Details: https://kernelci.org/test/plan/id/62ba3bcc001572cd86a39bf8

Results: 0 PASS, 1 FAIL, 0 SKIP
Full config: defconfig
Compiler: gcc-10 (aarch64-linux-gnu-gcc (Debian 10.2.1-6) 10.2.1 20210110)
Plain log: https://storage.kernelci.org//cip-gitlab/ci-iwamatsu-linux-5.10.y-cip-rc/v5.10.121-cip9-287-ge9094c8446fc/arm64/defconfig/gcc-10/lab-broonie/baseline-qemu_arm64-virt-gicv3-uefi.txt
HTML log: https://storage.kernelci.org//cip-gitlab/ci-iwamatsu-linux-5.10.y-cip-rc/v5.10.121-cip9-287-ge9094c8446fc/arm64/defconfig/gcc-10/lab-broonie/baseline-qemu_arm64-virt-gicv3-uefi.html
Rootfs: http://storage.kernelci.org/images/rootfs/buildroot/buildroot-baseline/20220624.0/arm64/rootfs.cpio.gz


* baseline.login: https://kernelci.org/test/case/id/62ba3bcc001572cd86a39bf9
failing since 49 days (last pass: v5.10.112-cip6-88-gf3397cadb2dd6, first fail: v5.10.112-cip6-218-g8253434cd56a)



platform | arch | lab | compiler | defconfig | regressions
---------------------------+--------+---------------+----------+------------------------------+------------
rk3399-gru-kevin | arm64 | lab-collabora | gcc-10 | defconfig+arm64-chromebook | 1

Details: https://kernelci.org/test/plan/id/62ba36dc487498fceca39c12

Results: 90 PASS, 2 FAIL, 0 SKIP
Full config: defconfig+arm64-chromebook
Compiler: gcc-10 (aarch64-linux-gnu-gcc (Debian 10.2.1-6) 10.2.1 20210110)
Plain log: https://storage.kernelci.org//cip-gitlab/ci-iwamatsu-linux-5.10.y-cip-rc/v5.10.121-cip9-287-ge9094c8446fc/arm64/defconfig+arm64-chromebook/gcc-10/lab-collabora/baseline-rk3399-gru-kevin.txt
HTML log: https://storage.kernelci.org//cip-gitlab/ci-iwamatsu-linux-5.10.y-cip-rc/v5.10.121-cip9-287-ge9094c8446fc/arm64/defconfig+arm64-chromebook/gcc-10/lab-collabora/baseline-rk3399-gru-kevin.html
Rootfs: http://storage.kernelci.org/images/rootfs/buildroot/buildroot-baseline/20220624.0/arm64/rootfs.cpio.gz


* baseline.bootrr.rockchip-i2s1-probed: https://kernelci.org/test/case/id/62ba36dc487498fceca39c38
failing since 110 days (last pass: v5.10.100-cip2-319-gcbff87047566, first fail: v5.10.100-cip2-425-g0a0d92194f39)

2022-06-27T23:01:38.086555 /lava-6691972/1/../bin/lava-test-case


cip-gitlab/ci/iwamatsu/linux-5.10.y-cip-rc baseline-nfs: 43 runs, 3 regressions (v5.10.121-cip9-287-ge9094c8446fc) #kernelci

kernelci.org bot <bot@...>
 

cip-gitlab/ci/iwamatsu/linux-5.10.y-cip-rc baseline-nfs: 43 runs, 3 regressions (v5.10.121-cip9-287-ge9094c8446fc)

Regressions Summary
-------------------

platform | arch | lab | compiler | defconfig | regressions
-----------------------------+-------+---------------+----------+----------------------------+------------
bcm2711-rpi-4-b | arm64 | lab-collabora | gcc-10 | defconfig | 1
meson-gxl-s905x-libretech-cc | arm64 | lab-baylibre | gcc-10 | defconfig | 1
rk3399-gru-kevin | arm64 | lab-collabora | gcc-10 | defconfig+arm64-chromebook | 1

Details: https://kernelci.org/test/job/cip-gitlab/branch/ci%2Fiwamatsu%2Flinux-5.10.y-cip-rc/kernel/v5.10.121-cip9-287-ge9094c8446fc/plan/baseline-nfs/

Test: baseline-nfs
Tree: cip-gitlab
Branch: ci/iwamatsu/linux-5.10.y-cip-rc
Describe: v5.10.121-cip9-287-ge9094c8446fc
URL: https://gitlab.com/cip-project/cip-kernel/linux-cip.git
SHA: e9094c8446fcef728d675699ced39be2dbbfb8f7


Test Regressions
----------------


platform | arch | lab | compiler | defconfig | regressions
-----------------------------+-------+---------------+----------+----------------------------+------------
bcm2711-rpi-4-b | arm64 | lab-collabora | gcc-10 | defconfig | 1

Details: https://kernelci.org/test/plan/id/62ba3b8c9840faa6f8a39bcd

Results: 0 PASS, 1 FAIL, 0 SKIP
Full config: defconfig
Compiler: gcc-10 (aarch64-linux-gnu-gcc (Debian 10.2.1-6) 10.2.1 20210110)
Plain log: https://storage.kernelci.org//cip-gitlab/ci-iwamatsu-linux-5.10.y-cip-rc/v5.10.121-cip9-287-ge9094c8446fc/arm64/defconfig/gcc-10/lab-collabora/baseline-nfs-bcm2711-rpi-4-b.txt
HTML log: https://storage.kernelci.org//cip-gitlab/ci-iwamatsu-linux-5.10.y-cip-rc/v5.10.121-cip9-287-ge9094c8446fc/arm64/defconfig/gcc-10/lab-collabora/baseline-nfs-bcm2711-rpi-4-b.html
Rootfs: http://storage.kernelci.org/images/rootfs/debian/bullseye/20220624.0/arm64/initrd.cpio.gz


* baseline-nfs.login: https://kernelci.org/test/case/id/62ba3b8c9840faa6f8a39bce
failing since 3 days (last pass: v5.10.118-465-g0af29783a3c9, first fail: v5.10.121-cip9-272-g3fb28d4c623b)



platform | arch | lab | compiler | defconfig | regressions
-----------------------------+-------+---------------+----------+----------------------------+------------
meson-gxl-s905x-libretech-cc | arm64 | lab-baylibre | gcc-10 | defconfig | 1

Details: https://kernelci.org/test/plan/id/62ba3d851fd544cc74a39c40

Results: 0 PASS, 1 FAIL, 0 SKIP
Full config: defconfig
Compiler: gcc-10 (aarch64-linux-gnu-gcc (Debian 10.2.1-6) 10.2.1 20210110)
Plain log: https://storage.kernelci.org//cip-gitlab/ci-iwamatsu-linux-5.10.y-cip-rc/v5.10.121-cip9-287-ge9094c8446fc/arm64/defconfig/gcc-10/lab-baylibre/baseline-nfs-meson-gxl-s905x-libretech-cc.txt
HTML log: https://storage.kernelci.org//cip-gitlab/ci-iwamatsu-linux-5.10.y-cip-rc/v5.10.121-cip9-287-ge9094c8446fc/arm64/defconfig/gcc-10/lab-baylibre/baseline-nfs-meson-gxl-s905x-libretech-cc.html
Rootfs: http://storage.kernelci.org/images/rootfs/debian/bullseye/20220624.0/arm64/initrd.cpio.gz


* baseline-nfs.login: https://kernelci.org/test/case/id/62ba3d851fd544cc74a39c41
new failure (last pass: v5.10.121-cip9-272-g3fb28d4c623b)



platform | arch | lab | compiler | defconfig | regressions
-----------------------------+-------+---------------+----------+----------------------------+------------
rk3399-gru-kevin | arm64 | lab-collabora | gcc-10 | defconfig+arm64-chromebook | 1

Details: https://kernelci.org/test/plan/id/62ba35feecf8fd8d83a39bcd

Results: 84 PASS, 4 FAIL, 0 SKIP
Full config: defconfig+arm64-chromebook
Compiler: gcc-10 (aarch64-linux-gnu-gcc (Debian 10.2.1-6) 10.2.1 20210110)
Plain log: https://storage.kernelci.org//cip-gitlab/ci-iwamatsu-linux-5.10.y-cip-rc/v5.10.121-cip9-287-ge9094c8446fc/arm64/defconfig+arm64-chromebook/gcc-10/lab-collabora/baseline-nfs-rk3399-gru-kevin.txt
HTML log: https://storage.kernelci.org//cip-gitlab/ci-iwamatsu-linux-5.10.y-cip-rc/v5.10.121-cip9-287-ge9094c8446fc/arm64/defconfig+arm64-chromebook/gcc-10/lab-collabora/baseline-nfs-rk3399-gru-kevin.html
Rootfs: http://storage.kernelci.org/images/rootfs/debian/bullseye/20220624.0/arm64/initrd.cpio.gz


* baseline-nfs.bootrr.rockchip-i2s1-probed: https://kernelci.org/test/case/id/62ba35feecf8fd8d83a39bf3
failing since 110 days (last pass: v5.10.100-cip2-319-gcbff87047566, first fail: v5.10.100-cip2-425-g0a0d92194f39)

2022-06-27T22:57:46.370406 /lava-6691960/1/../bin/lava-test-case


cip-gitlab/ci/iwamatsu/linux-5.10.y-cip-rc build: 172 builds: 3 failed, 169 passed, 4 errors, 10 warnings (v5.10.121-cip9-287-ge9094c8446fc) #kernelci

kernelci.org bot <bot@...>
 

cip-gitlab/ci/iwamatsu/linux-5.10.y-cip-rc build: 172 builds: 3 failed, 169 passed, 4 errors, 10 warnings (v5.10.121-cip9-287-ge9094c8446fc)

Full Build Summary: https://kernelci.org/build/cip-gitlab/branch/ci%2Fiwamatsu%2Flinux-5.10.y-cip-rc/kernel/v5.10.121-cip9-287-ge9094c8446fc/

Tree: cip-gitlab
Branch: ci/iwamatsu/linux-5.10.y-cip-rc
Git Describe: v5.10.121-cip9-287-ge9094c8446fc
Git Commit: e9094c8446fcef728d675699ced39be2dbbfb8f7
Git URL: https://gitlab.com/cip-project/cip-kernel/linux-cip.git
Built: 7 unique architectures

Build Failures Detected:

arm:
rpc_defconfig: (gcc-10) FAIL

mips:
ip27_defconfig: (gcc-10) FAIL
ip28_defconfig: (gcc-10) FAIL

Errors and Warnings Detected:

arc:

arm64:

arm:
rpc_defconfig (gcc-10): 4 errors

i386:

mips:
32r2el_defconfig (gcc-10): 1 warning
decstation_64_defconfig (gcc-10): 1 warning
decstation_defconfig (gcc-10): 1 warning
decstation_r4k_defconfig (gcc-10): 1 warning
lemote2f_defconfig (gcc-10): 1 warning
rm200_defconfig (gcc-10): 1 warning

riscv:
rv32_defconfig (gcc-10): 4 warnings

x86_64:

Errors summary:

2 arm-linux-gnueabihf-gcc: error: unrecognized -march target: armv3m
2 arm-linux-gnueabihf-gcc: error: missing argument to ‘-march=’

Warnings summary:

3 kernel/rcu/tasks.h:710:13: warning: ‘show_rcu_tasks_rude_gp_kthread’ defined but not used [-Wunused-function]
2 <stdin>:830:2: warning: #warning syscall fstat64 not implemented [-Wcpp]
2 <stdin>:1127:2: warning: #warning syscall fstatat64 not implemented [-Wcpp]
1 net/mac80211/mlme.c:4349:1: warning: the frame size of 1040 bytes is larger than 1024 bytes [-Wframe-larger-than=]
1 drivers/block/paride/bpck.c:32: warning: "PC" redefined
1 WARNING: modpost: Symbol info of vmlinux is missing. Unresolved symbol check will be entirely skipped.

================================================================================

Detailed per-defconfig build reports:

--------------------------------------------------------------------------------
32r2el_defconfig (mips, gcc-10) — PASS, 0 errors, 1 warning, 0 section mismatches

Warnings:
WARNING: modpost: Symbol info of vmlinux is missing. Unresolved symbol check will be entirely skipped.

--------------------------------------------------------------------------------
allnoconfig (x86_64, gcc-10) — PASS, 0 errors, 0 warnings, 0 section mismatches

--------------------------------------------------------------------------------
allnoconfig (arc, gcc-10) — PASS, 0 errors, 0 warnings, 0 section mismatches

--------------------------------------------------------------------------------
allnoconfig (i386, gcc-10) — PASS, 0 errors, 0 warnings, 0 section mismatches

--------------------------------------------------------------------------------
am200epdkit_defconfig (arm, gcc-10) — PASS, 0 errors, 0 warnings, 0 section mismatches

--------------------------------------------------------------------------------
ar7_defconfig (mips, gcc-10) — PASS, 0 errors, 0 warnings, 0 section mismatches

--------------------------------------------------------------------------------
aspeed_g5_defconfig (arm, gcc-10) — PASS, 0 errors, 0 warnings, 0 section mismatches

--------------------------------------------------------------------------------
assabet_defconfig (arm, gcc-10) — PASS, 0 errors, 0 warnings, 0 section mismatches

--------------------------------------------------------------------------------
at91_dt_defconfig (arm, gcc-10) — PASS, 0 errors, 0 warnings, 0 section mismatches

--------------------------------------------------------------------------------
ath25_defconfig (mips, gcc-10) — PASS, 0 errors, 0 warnings, 0 section mismatches

--------------------------------------------------------------------------------
axm55xx_defconfig (arm, gcc-10) — PASS, 0 errors, 0 warnings, 0 section mismatches

--------------------------------------------------------------------------------
axs103_defconfig (arc, gcc-10) — PASS, 0 errors, 0 warnings, 0 section mismatches

--------------------------------------------------------------------------------
axs103_smp_defconfig (arc, gcc-10) — PASS, 0 errors, 0 warnings, 0 section mismatches

--------------------------------------------------------------------------------
badge4_defconfig (arm, gcc-10) — PASS, 0 errors, 0 warnings, 0 section mismatches

--------------------------------------------------------------------------------
bcm2835_defconfig (arm, gcc-10) — PASS, 0 errors, 0 warnings, 0 section mismatches

--------------------------------------------------------------------------------
bcm47xx_defconfig (mips, gcc-10) — PASS, 0 errors, 0 warnings, 0 section mismatches

--------------------------------------------------------------------------------
bcm63xx_defconfig (mips, gcc-10) — PASS, 0 errors, 0 warnings, 0 section mismatches

--------------------------------------------------------------------------------
bigsur_defconfig (mips, gcc-10) — PASS, 0 errors, 0 warnings, 0 section mismatches

--------------------------------------------------------------------------------
bmips_be_defconfig (mips, gcc-10) — PASS, 0 errors, 0 warnings, 0 section mismatches

--------------------------------------------------------------------------------
bmips_stb_defconfig (mips, gcc-10) — PASS, 0 errors, 0 warnings, 0 section mismatches

--------------------------------------------------------------------------------
capcella_defconfig (mips, gcc-10) — PASS, 0 errors, 0 warnings, 0 section mismatches

--------------------------------------------------------------------------------
cerfcube_defconfig (arm, gcc-10) — PASS, 0 errors, 0 warnings, 0 section mismatches

--------------------------------------------------------------------------------
cobalt_defconfig (mips, gcc-10) — PASS, 0 errors, 0 warnings, 0 section mismatches

--------------------------------------------------------------------------------
colibri_pxa300_defconfig (arm, gcc-10) — PASS, 0 errors, 0 warnings, 0 section mismatches

--------------------------------------------------------------------------------
collie_defconfig (arm, gcc-10) — PASS, 0 errors, 0 warnings, 0 section mismatches

--------------------------------------------------------------------------------
corgi_defconfig (arm, gcc-10) — PASS, 0 errors, 0 warnings, 0 section mismatches

--------------------------------------------------------------------------------
cu1000-neo_defconfig (mips, gcc-10) — PASS, 0 errors, 0 warnings, 0 section mismatches

--------------------------------------------------------------------------------
cu1830-neo_defconfig (mips, gcc-10) — PASS, 0 errors, 0 warnings, 0 section mismatches

--------------------------------------------------------------------------------
db1xxx_defconfig (mips, gcc-10) — PASS, 0 errors, 0 warnings, 0 section mismatches

--------------------------------------------------------------------------------
decstation_64_defconfig (mips, gcc-10) — PASS, 0 errors, 1 warning, 0 section mismatches

Warnings:
kernel/rcu/tasks.h:710:13: warning: ‘show_rcu_tasks_rude_gp_kthread’ defined but not used [-Wunused-function]

--------------------------------------------------------------------------------
decstation_defconfig (mips, gcc-10) — PASS, 0 errors, 1 warning, 0 section mismatches

Warnings:
kernel/rcu/tasks.h:710:13: warning: ‘show_rcu_tasks_rude_gp_kthread’ defined but not used [-Wunused-function]

--------------------------------------------------------------------------------
decstation_r4k_defconfig (mips, gcc-10) — PASS, 0 errors, 1 warning, 0 section mismatches

Warnings:
kernel/rcu/tasks.h:710:13: warning: ‘show_rcu_tasks_rude_gp_kthread’ defined but not used [-Wunused-function]

--------------------------------------------------------------------------------
defconfig (riscv, gcc-10) — PASS, 0 errors, 0 warnings, 0 section mismatches

--------------------------------------------------------------------------------
defconfig (arm64, gcc-10) — PASS, 0 errors, 0 warnings, 0 section mismatches

--------------------------------------------------------------------------------
defconfig+arm64-chromebook (arm64, gcc-10) — PASS, 0 errors, 0 warnings, 0 section mismatches

--------------------------------------------------------------------------------
defconfig+arm64-chromebook+kselftest (arm64, gcc-10) — PASS, 0 errors, 0 warnings, 0 section mismatches

--------------------------------------------------------------------------------
defconfig+kselftest (arm64, gcc-10) — PASS, 0 errors, 0 warnings, 0 section mismatches

--------------------------------------------------------------------------------
dove_defconfig (arm, gcc-10) — PASS, 0 errors, 0 warnings, 0 section mismatches

--------------------------------------------------------------------------------
e55_defconfig (mips, gcc-10) — PASS, 0 errors, 0 warnings, 0 section mismatches

--------------------------------------------------------------------------------
ebsa110_defconfig (arm, gcc-10) — PASS, 0 errors, 0 warnings, 0 section mismatches

--------------------------------------------------------------------------------
efm32_defconfig (arm, gcc-10) — PASS, 0 errors, 0 warnings, 0 section mismatches

--------------------------------------------------------------------------------
ep93xx_defconfig (arm, gcc-10) — PASS, 0 errors, 0 warnings, 0 section mismatches

--------------------------------------------------------------------------------
eseries_pxa_defconfig (arm, gcc-10) — PASS, 0 errors, 0 warnings, 0 section mismatches

--------------------------------------------------------------------------------
exynos_defconfig (arm, gcc-10) — PASS, 0 errors, 0 warnings, 0 section mismatches

--------------------------------------------------------------------------------
ezx_defconfig (arm, gcc-10) — PASS, 0 errors, 0 warnings, 0 section mismatches

--------------------------------------------------------------------------------
footbridge_defconfig (arm, gcc-10) — PASS, 0 errors, 0 warnings, 0 section mismatches

--------------------------------------------------------------------------------
fuloong2e_defconfig (mips, gcc-10) — PASS, 0 errors, 0 warnings, 0 section mismatches

--------------------------------------------------------------------------------
gcw0_defconfig (mips, gcc-10) — PASS, 0 errors, 0 warnings, 0 section mismatches

--------------------------------------------------------------------------------
gemini_defconfig (arm, gcc-10) — PASS, 0 errors, 0 warnings, 0 section mismatches

--------------------------------------------------------------------------------
gpr_defconfig (mips, gcc-10) — PASS, 0 errors, 0 warnings, 0 section mismatches

--------------------------------------------------------------------------------
h3600_defconfig (arm, gcc-10) — PASS, 0 errors, 0 warnings, 0 section mismatches

--------------------------------------------------------------------------------
h5000_defconfig (arm, gcc-10) — PASS, 0 errors, 0 warnings, 0 section mismatches

--------------------------------------------------------------------------------
hackkit_defconfig (arm, gcc-10) — PASS, 0 errors, 0 warnings, 0 section mismatches

--------------------------------------------------------------------------------
haps_hs_defconfig (arc, gcc-10) — PASS, 0 errors, 0 warnings, 0 section mismatches

--------------------------------------------------------------------------------
haps_hs_smp_defconfig (arc, gcc-10) — PASS, 0 errors, 0 warnings, 0 section mismatches

--------------------------------------------------------------------------------
hisi_defconfig (arm, gcc-10) — PASS, 0 errors, 0 warnings, 0 section mismatches

--------------------------------------------------------------------------------
i386_defconfig (i386, gcc-10) — PASS, 0 errors, 0 warnings, 0 section mismatches

--------------------------------------------------------------------------------
imote2_defconfig (arm, gcc-10) — PASS, 0 errors, 0 warnings, 0 section mismatches

--------------------------------------------------------------------------------
imx_v4_v5_defconfig (arm, gcc-10) — PASS, 0 errors, 0 warnings, 0 section mismatches

--------------------------------------------------------------------------------
integrator_defconfig (arm, gcc-10) — PASS, 0 errors, 0 warnings, 0 section mismatches

--------------------------------------------------------------------------------
iop32x_defconfig (arm, gcc-10) — PASS, 0 errors, 0 warnings, 0 section mismatches

--------------------------------------------------------------------------------
ip22_defconfig (mips, gcc-10) — PASS, 0 errors, 0 warnings, 0 section mismatches

--------------------------------------------------------------------------------
ip27_defconfig (mips, gcc-10) — FAIL, 0 errors, 0 warnings, 0 section mismatches

--------------------------------------------------------------------------------
ip28_defconfig (mips, gcc-10) — FAIL, 0 errors, 0 warnings, 0 section mismatches

--------------------------------------------------------------------------------
ixp4xx_defconfig (arm, gcc-10) — PASS, 0 errors, 0 warnings, 0 section mismatches

--------------------------------------------------------------------------------
jazz_defconfig (mips, gcc-10) — PASS, 0 errors, 0 warnings, 0 section mismatches

--------------------------------------------------------------------------------
jmr3927_defconfig (mips, gcc-10) — PASS, 0 errors, 0 warnings, 0 section mismatches

--------------------------------------------------------------------------------
jornada720_defconfig (arm, gcc-10) — PASS, 0 errors, 0 warnings, 0 section mismatches

--------------------------------------------------------------------------------
keystone_defconfig (arm, gcc-10) — PASS, 0 errors, 0 warnings, 0 section mismatches

--------------------------------------------------------------------------------
lart_defconfig (arm, gcc-10) — PASS, 0 errors, 0 warnings, 0 section mismatches

--------------------------------------------------------------------------------
lemote2f_defconfig (mips, gcc-10) — PASS, 0 errors, 1 warning, 0 section mismatches

Warnings:
net/mac80211/mlme.c:4349:1: warning: the frame size of 1040 bytes is larger than 1024 bytes [-Wframe-larger-than=]

--------------------------------------------------------------------------------
loongson1b_defconfig (mips, gcc-10) — PASS, 0 errors, 0 warnings, 0 section mismatches

--------------------------------------------------------------------------------
loongson1c_defconfig (mips, gcc-10) — PASS, 0 errors, 0 warnings, 0 section mismatches

--------------------------------------------------------------------------------
loongson3_defconfig (mips, gcc-10) — PASS, 0 errors, 0 warnings, 0 section mismatches

--------------------------------------------------------------------------------
lpc18xx_defconfig (arm, gcc-10) — PASS, 0 errors, 0 warnings, 0 section mismatches

--------------------------------------------------------------------------------
lpc32xx_defconfig (arm, gcc-10) — PASS, 0 errors, 0 warnings, 0 section mismatches

--------------------------------------------------------------------------------
lpd270_defconfig (arm, gcc-10) — PASS, 0 errors, 0 warnings, 0 section mismatches

--------------------------------------------------------------------------------
lubbock_defconfig (arm, gcc-10) — PASS, 0 errors, 0 warnings, 0 section mismatches

--------------------------------------------------------------------------------
magician_defconfig (arm, gcc-10) — PASS, 0 errors, 0 warnings, 0 section mismatches

--------------------------------------------------------------------------------
mainstone_defconfig (arm, gcc-10) — PASS, 0 errors, 0 warnings, 0 section mismatches

--------------------------------------------------------------------------------
malta_kvm_defconfig (mips, gcc-10) — PASS, 0 errors, 0 warnings, 0 section mismatches

--------------------------------------------------------------------------------
malta_kvm_guest_defconfig (mips, gcc-10) — PASS, 0 errors, 0 warnings, 0 section mismatches

--------------------------------------------------------------------------------
malta_qemu_32r6_defconfig (mips, gcc-10) — PASS, 0 errors, 0 warnings, 0 section mismatches

--------------------------------------------------------------------------------
maltaaprp_defconfig (mips, gcc-10) — PASS, 0 errors, 0 warnings, 0 section mismatches

--------------------------------------------------------------------------------
maltasmvp_defconfig (mips, gcc-10) — PASS, 0 errors, 0 warnings, 0 section mismatches

--------------------------------------------------------------------------------
maltasmvp_eva_defconfig (mips, gcc-10) — PASS, 0 errors, 0 warnings, 0 section mismatches

--------------------------------------------------------------------------------
maltaup_defconfig (mips, gcc-10) — PASS, 0 errors, 0 warnings, 0 section mismatches

--------------------------------------------------------------------------------
maltaup_xpa_defconfig (mips, gcc-10) — PASS, 0 errors, 0 warnings, 0 section mismatches

--------------------------------------------------------------------------------
milbeaut_m10v_defconfig (arm, gcc-10) — PASS, 0 errors, 0 warnings, 0 section mismatches

--------------------------------------------------------------------------------
mini2440_defconfig (arm, gcc-10) — PASS, 0 errors, 0 warnings, 0 section mismatches

--------------------------------------------------------------------------------
mpc30x_defconfig (mips, gcc-10) — PASS, 0 errors, 0 warnings, 0 section mismatches

--------------------------------------------------------------------------------
mps2_defconfig (arm, gcc-10) — PASS, 0 errors, 0 warnings, 0 section mismatches

--------------------------------------------------------------------------------
mtx1_defconfig (mips, gcc-10) — PASS, 0 errors, 0 warnings, 0 section mismatches

--------------------------------------------------------------------------------
multi_v4t_defconfig (arm, gcc-10) — PASS, 0 errors, 0 warnings, 0 section mismatches

--------------------------------------------------------------------------------
multi_v5_defconfig (arm, gcc-10) — PASS, 0 errors, 0 warnings, 0 section mismatches

--------------------------------------------------------------------------------
multi_v7_defconfig (arm, gcc-10) — PASS, 0 errors, 0 warnings, 0 section mismatches

--------------------------------------------------------------------------------
multi_v7_defconfig+kselftest (arm, gcc-10) — PASS, 0 errors, 0 warnings, 0 section mismatches

--------------------------------------------------------------------------------
mvebu_v7_defconfig (arm, gcc-10) — PASS, 0 errors, 0 warnings, 0 section mismatches

--------------------------------------------------------------------------------
mxs_defconfig (arm, gcc-10) — PASS, 0 errors, 0 warnings, 0 section mismatches

--------------------------------------------------------------------------------
neponset_defconfig (arm, gcc-10) — PASS, 0 errors, 0 warnings, 0 section mismatches

--------------------------------------------------------------------------------
netwinder_defconfig (arm, gcc-10) — PASS, 0 errors, 0 warnings, 0 section mismatches

--------------------------------------------------------------------------------
nhk8815_defconfig (arm, gcc-10) — PASS, 0 errors, 0 warnings, 0 section mismatches

--------------------------------------------------------------------------------
nlm_xlp_defconfig (mips, gcc-10) — PASS, 0 errors, 0 warnings, 0 section mismatches

--------------------------------------------------------------------------------
nlm_xlr_defconfig (mips, gcc-10) — PASS, 0 errors, 0 warnings, 0 section mismatches

--------------------------------------------------------------------------------
nommu_k210_defconfig (riscv, gcc-10) — PASS, 0 errors, 0 warnings, 0 section mismatches

--------------------------------------------------------------------------------
nsimosci_hs_defconfig (arc, gcc-10) — PASS, 0 errors, 0 warnings, 0 section mismatches

--------------------------------------------------------------------------------
nsimosci_hs_smp_defconfig (arc, gcc-10) — PASS, 0 errors, 0 warnings, 0 section mismatches

--------------------------------------------------------------------------------
omap1_defconfig (arm, gcc-10) — PASS, 0 errors, 0 warnings, 0 section mismatches

--------------------------------------------------------------------------------
omap2plus_defconfig (arm, gcc-10) — PASS, 0 errors, 0 warnings, 0 section mismatches

--------------------------------------------------------------------------------
omega2p_defconfig (mips, gcc-10) — PASS, 0 errors, 0 warnings, 0 section mismatches

--------------------------------------------------------------------------------
orion5x_defconfig (arm, gcc-10) — PASS, 0 errors, 0 warnings, 0 section mismatches

--------------------------------------------------------------------------------
oxnas_v6_defconfig (arm, gcc-10) — PASS, 0 errors, 0 warnings, 0 section mismatches

--------------------------------------------------------------------------------
palmz72_defconfig (arm, gcc-10) — PASS, 0 errors, 0 warnings, 0 section mismatches

--------------------------------------------------------------------------------
pcm027_defconfig (arm, gcc-10) — PASS, 0 errors, 0 warnings, 0 section mismatches

--------------------------------------------------------------------------------
pic32mzda_defconfig (mips, gcc-10) — PASS, 0 errors, 0 warnings, 0 section mismatches

--------------------------------------------------------------------------------
pistachio_defconfig (mips, gcc-10) — PASS, 0 errors, 0 warnings, 0 section mismatches

--------------------------------------------------------------------------------
pleb_defconfig (arm, gcc-10) — PASS, 0 errors, 0 warnings, 0 section mismatches

--------------------------------------------------------------------------------
prima2_defconfig (arm, gcc-10) — PASS, 0 errors, 0 warnings, 0 section mismatches

--------------------------------------------------------------------------------
pxa168_defconfig (arm, gcc-10) — PASS, 0 errors, 0 warnings, 0 section mismatches

--------------------------------------------------------------------------------
pxa255-idp_defconfig (arm, gcc-10) — PASS, 0 errors, 0 warnings, 0 section mismatches

--------------------------------------------------------------------------------
pxa3xx_defconfig (arm, gcc-10) — PASS, 0 errors, 0 warnings, 0 section mismatches

--------------------------------------------------------------------------------
pxa910_defconfig (arm, gcc-10) — PASS, 0 errors, 0 warnings, 0 section mismatches

--------------------------------------------------------------------------------
pxa_defconfig (arm, gcc-10) — PASS, 0 errors, 0 warnings, 0 section mismatches

--------------------------------------------------------------------------------
qcom_defconfig (arm, gcc-10) — PASS, 0 errors, 0 warnings, 0 section mismatches

--------------------------------------------------------------------------------
qi_lb60_defconfig (mips, gcc-10) — PASS, 0 errors, 0 warnings, 0 section mismatches

--------------------------------------------------------------------------------
rb532_defconfig (mips, gcc-10) — PASS, 0 errors, 0 warnings, 0 section mismatches

--------------------------------------------------------------------------------
rbtx49xx_defconfig (mips, gcc-10) — PASS, 0 errors, 0 warnings, 0 section mismatches

--------------------------------------------------------------------------------
realview_defconfig (arm, gcc-10) — PASS, 0 errors, 0 warnings, 0 section mismatches

--------------------------------------------------------------------------------
rm200_defconfig (mips, gcc-10) — PASS, 0 errors, 1 warning, 0 section mismatches

Warnings:
drivers/block/paride/bpck.c:32: warning: "PC" redefined

--------------------------------------------------------------------------------
rpc_defconfig (arm, gcc-10) — FAIL, 4 errors, 0 warnings, 0 section mismatches

Errors:
arm-linux-gnueabihf-gcc: error: unrecognized -march target: armv3m
arm-linux-gnueabihf-gcc: error: missing argument to ‘-march=’
arm-linux-gnueabihf-gcc: error: unrecognized -march target: armv3m
arm-linux-gnueabihf-gcc: error: missing argument to ‘-march=’

--------------------------------------------------------------------------------
rs90_defconfig (mips, gcc-10) — PASS, 0 errors, 0 warnings, 0 section mismatches

--------------------------------------------------------------------------------
rt305x_defconfig (mips, gcc-10) — PASS, 0 errors, 0 warnings, 0 section mismatches

--------------------------------------------------------------------------------
rv32_defconfig (riscv, gcc-10) — PASS, 0 errors, 4 warnings, 0 section mismatches

Warnings:
<stdin>:830:2: warning: #warning syscall fstat64 not implemented [-Wcpp]
<stdin>:1127:2: warning: #warning syscall fstatat64 not implemented [-Wcpp]
<stdin>:830:2: warning: #warning syscall fstat64 not implemented [-Wcpp]
<stdin>:1127:2: warning: #warning syscall fstatat64 not implemented [-Wcpp]

--------------------------------------------------------------------------------
s3c2410_defconfig (arm, gcc-10) — PASS, 0 errors, 0 warnings, 0 section mismatches

--------------------------------------------------------------------------------
s3c6400_defconfig (arm, gcc-10) — PASS, 0 errors, 0 warnings, 0 section mismatches

--------------------------------------------------------------------------------
s5pv210_defconfig (arm, gcc-10) — PASS, 0 errors, 0 warnings, 0 section mismatches

--------------------------------------------------------------------------------
sb1250_swarm_defconfig (mips, gcc-10) — PASS, 0 errors, 0 warnings, 0 section mismatches

--------------------------------------------------------------------------------
shannon_defconfig (arm, gcc-10) — PASS, 0 errors, 0 warnings, 0 section mismatches

--------------------------------------------------------------------------------
shmobile_defconfig (arm, gcc-10) — PASS, 0 errors, 0 warnings, 0 section mismatches

--------------------------------------------------------------------------------
simpad_defconfig (arm, gcc-10) — PASS, 0 errors, 0 warnings, 0 section mismatches

--------------------------------------------------------------------------------
socfpga_defconfig (arm, gcc-10) — PASS, 0 errors, 0 warnings, 0 section mismatches

--------------------------------------------------------------------------------
spear13xx_defconfig (arm, gcc-10) — PASS, 0 errors, 0 warnings, 0 section mismatches

--------------------------------------------------------------------------------
spear3xx_defconfig (arm, gcc-10) — PASS, 0 errors, 0 warnings, 0 section mismatches

--------------------------------------------------------------------------------
spear6xx_defconfig (arm, gcc-10) — PASS, 0 errors, 0 warnings, 0 section mismatches

--------------------------------------------------------------------------------
spitz_defconfig (arm, gcc-10) — PASS, 0 errors, 0 warnings, 0 section mismatches

--------------------------------------------------------------------------------
stm32_defconfig (arm, gcc-10) — PASS, 0 errors, 0 warnings, 0 section mismatches

--------------------------------------------------------------------------------
sunxi_defconfig (arm, gcc-10) — PASS, 0 errors, 0 warnings, 0 section mismatches

--------------------------------------------------------------------------------
tango4_defconfig (arm, gcc-10) — PASS, 0 errors, 0 warnings, 0 section mismatches

--------------------------------------------------------------------------------
tb0219_defconfig (mips, gcc-10) — PASS, 0 errors, 0 warnings, 0 section mismatches

--------------------------------------------------------------------------------
tb0226_defconfig (mips, gcc-10) — PASS, 0 errors, 0 warnings, 0 section mismatches

--------------------------------------------------------------------------------
tb0287_defconfig (mips, gcc-10) — PASS, 0 errors, 0 warnings, 0 section mismatches

--------------------------------------------------------------------------------
tct_hammer_defconfig (arm, gcc-10) — PASS, 0 errors, 0 warnings, 0 section mismatches

--------------------------------------------------------------------------------
tegra_defconfig (arm, gcc-10) — PASS, 0 errors, 0 warnings, 0 section mismatches

--------------------------------------------------------------------------------
tinyconfig (x86_64, gcc-10) — PASS, 0 errors, 0 warnings, 0 section mismatches

--------------------------------------------------------------------------------
tinyconfig (arc, gcc-10) — PASS, 0 errors, 0 warnings, 0 section mismatches

--------------------------------------------------------------------------------
tinyconfig (i386, gcc-10) — PASS, 0 errors, 0 warnings, 0 section mismatches

--------------------------------------------------------------------------------
u300_defconfig (arm, gcc-10) — PASS, 0 errors, 0 warnings, 0 section mismatches

--------------------------------------------------------------------------------
u8500_defconfig (arm, gcc-10) — PASS, 0 errors, 0 warnings, 0 section mismatches

--------------------------------------------------------------------------------
vdk_hs38_defconfig (arc, gcc-10) — PASS, 0 errors, 0 warnings, 0 section mismatches

--------------------------------------------------------------------------------
vdk_hs38_smp_defconfig (arc, gcc-10) — PASS, 0 errors, 0 warnings, 0 section mismatches

--------------------------------------------------------------------------------
versatile_defconfig (arm, gcc-10) — PASS, 0 errors, 0 warnings, 0 section mismatches

--------------------------------------------------------------------------------
vexpress_defconfig (arm, gcc-10) — PASS, 0 errors, 0 warnings, 0 section mismatches

--------------------------------------------------------------------------------
vf610m4_defconfig (arm, gcc-10) — PASS, 0 errors, 0 warnings, 0 section mismatches

--------------------------------------------------------------------------------
viper_defconfig (arm, gcc-10) — PASS, 0 errors, 0 warnings, 0 section mismatches

--------------------------------------------------------------------------------
vt8500_v6_v7_defconfig (arm, gcc-10) — PASS, 0 errors, 0 warnings, 0 section mismatches

--------------------------------------------------------------------------------
x86_64_defconfig (x86_64, gcc-10) — PASS, 0 errors, 0 warnings, 0 section mismatches

--------------------------------------------------------------------------------
x86_64_defconfig+kselftest (x86_64, gcc-10) — PASS, 0 errors, 0 warnings, 0 section mismatches

--------------------------------------------------------------------------------
x86_64_defconfig+x86-chromebook (x86_64, gcc-10) — PASS, 0 errors, 0 warnings, 0 section mismatches

--------------------------------------------------------------------------------
x86_64_defconfig+x86-chromebook+kselftest (x86_64, gcc-10) — PASS, 0 errors, 0 warnings, 0 section mismatches

--------------------------------------------------------------------------------
xcep_defconfig (arm, gcc-10) — PASS, 0 errors, 0 warnings, 0 section mismatches

--------------------------------------------------------------------------------
zeus_defconfig (arm, gcc-10) — PASS, 0 errors, 0 warnings, 0 section mismatches

--------------------------------------------------------------------------------
zx_defconfig (arm, gcc-10) — PASS, 0 errors, 0 warnings, 0 section mismatches

---
For more info write to <info@...>


Re: gitlab testing down?

Chris Paterson
 

Hello Pavel,

From: Pavel Machek <pavel@...>
Sent: 27 June 2022 13:55

Hi!

5.10.127-rc1 is out, but there's something wrong with the testing.
Thank you forgetting in touch.
Sorry for the delay, I'm on hols today.


https://gitlab.com/cip-project/cip-testing/linux-stable-rc-ci/-
/pipelines/573859895


56There are currently 0 "qemu" devices online.
57Refusing to submit test job as there are no suitable devices available.
58There are currently 0 "qemu" devices online.
59Refusing to submit test job as there are no suitable devices available.
60

(and similar for all the targets and other trees).
The whole https://lava.ciplatform.org/ domain is offline at the moment.
It looks like the EC2 instance rebooted a few hours ago, but there are still some issues.
LF have said they are looking into it. I'll let you know if they get back with more info and/or the server starts working again.

Kind regards, Chris


Best regards,
Pavel

--
DENX Software Engineering GmbH, Managing Director: Wolfgang Denk
HRB 165235 Munich, Office: Kirchenstr.5, D-82194 Groebenzell, Germany


Re: [isar-cip-core] [PATCH] scripts/start-efishell.sh: Add -nographic option

Jan Kiszka
 

On 27.06.22 14:57, Kanagarajan, Vijaikumar wrote:


-----Original Message-----
From: cip-dev@... <cip-dev@...> On
Behalf Of Jan Kiszka
Sent: 27 June 2022 18:22
To: Gylstorff Quirin <quirin.gylstorff@...>; cip-dev@...
project.org; P T, Sarath <Sarath_PT@...>
Subject: Re: [cip-dev] [isar-cip-core] [PATCH] scripts/start-efishell.sh: Add -
nographic option

On 27.06.22 10:23, Gylstorff Quirin wrote:


On 6/27/22 10:14, Jan Kiszka via lists.cip-project.org wrote:
On 27.06.22 09:12, Sarath P T wrote:
From: sarath P T <Sarath_PT@...>

When we launch the start-efishell.sh script for adding the keys into
OVMF firmware we faced gtk initialization failed error. So it seems
we need to open the OVMF in nographic mode, hence we added the
required option to the script.
Which QEMU-Version? Which OVMF version (buster/bullseye/something
else)?
I'm not seeing this, but I'm facing other issues with that firmware
provided by bullseye (a crash).
 >> Signed-off-by: sarath P T <Sarath_PT@...>
---
  scripts/start-efishell.sh | 2 +-
  1 file changed, 1 insertion(+), 1 deletion(-)

diff --git a/scripts/start-efishell.sh b/scripts/start-efishell.sh
index d451f43..0831f83 100755
--- a/scripts/start-efishell.sh
+++ b/scripts/start-efishell.sh
@@ -2,7 +2,7 @@
  ovmf_code=${OVMF_CODE:-
/usr/share/OVMF/OVMF_CODE.secboot.fd}

This should be changed to the 4M version.

@jan
The 4M version does also trigger a crash?
Yes, it does.
We have not seen such errors. If you share the setup details (Qemu version/host distro/OVMF version) we can give it a try.
Resolved - my OVMF_VARS file was broken, and that was simply causing a
crash. Doesn't leave a good feeling about EDK2 now...

Jan

--
Siemens AG, Technology
Competence Center Embedded Linux


Re: [isar-cip-core] [PATCH] scripts/start-efishell.sh: Add -nographic option

Kanagarajan, Vijaikumar
 

-----Original Message-----
From: cip-dev@... <cip-dev@...> On
Behalf Of Jan Kiszka
Sent: 27 June 2022 18:22
To: Gylstorff Quirin <quirin.gylstorff@...>; cip-dev@...
project.org; P T, Sarath <Sarath_PT@...>
Subject: Re: [cip-dev] [isar-cip-core] [PATCH] scripts/start-efishell.sh: Add -
nographic option

On 27.06.22 10:23, Gylstorff Quirin wrote:


On 6/27/22 10:14, Jan Kiszka via lists.cip-project.org wrote:
On 27.06.22 09:12, Sarath P T wrote:
From: sarath P T <Sarath_PT@...>

When we launch the start-efishell.sh script for adding the keys into
OVMF firmware we faced gtk initialization failed error. So it seems
we need to open the OVMF in nographic mode, hence we added the
required option to the script.
Which QEMU-Version? Which OVMF version (buster/bullseye/something
else)?
I'm not seeing this, but I'm facing other issues with that firmware
provided by bullseye (a crash).
 >> Signed-off-by: sarath P T <Sarath_PT@...>
---
  scripts/start-efishell.sh | 2 +-
  1 file changed, 1 insertion(+), 1 deletion(-)

diff --git a/scripts/start-efishell.sh b/scripts/start-efishell.sh
index d451f43..0831f83 100755
--- a/scripts/start-efishell.sh
+++ b/scripts/start-efishell.sh
@@ -2,7 +2,7 @@
  ovmf_code=${OVMF_CODE:-
/usr/share/OVMF/OVMF_CODE.secboot.fd}

This should be changed to the 4M version.

@jan
The 4M version does also trigger a crash?
Yes, it does.
We have not seen such errors. If you share the setup details (Qemu version/host distro/OVMF version) we can give it a try.

Thanks,
Vijai Kumar K


Jan

--
Siemens AG, Technology
Competence Center Embedded Linux


gitlab testing down?

Pavel Machek
 

Hi!

5.10.127-rc1 is out, but there's something wrong with the testing.

https://gitlab.com/cip-project/cip-testing/linux-stable-rc-ci/-/pipelines/573859895


56There are currently 0 "qemu" devices online.
57Refusing to submit test job as there are no suitable devices available.
58There are currently 0 "qemu" devices online.
59Refusing to submit test job as there are no suitable devices available.
60

(and similar for all the targets and other trees).

Best regards,
Pavel

--
DENX Software Engineering GmbH, Managing Director: Wolfgang Denk
HRB 165235 Munich, Office: Kirchenstr.5, D-82194 Groebenzell, Germany


Re: [isar-cip-core] [PATCH v2] scripts/start-efishell.sh: Add -nographic option

Jan Kiszka
 

On 27.06.22 11:31, Sarath P T wrote:
From: sarath P T <Sarath_PT@...>

Add -nographic option to support running the
script over ssh.
That doesn't answer my other questions, but it's a valid reason.


Signed-off-by: sarath P T <Sarath_PT@...>
---
scripts/start-efishell.sh | 2 +-
1 file changed, 1 insertion(+), 1 deletion(-)

diff --git a/scripts/start-efishell.sh b/scripts/start-efishell.sh
index d451f43..0831f83 100755
--- a/scripts/start-efishell.sh
+++ b/scripts/start-efishell.sh
@@ -2,7 +2,7 @@
ovmf_code=${OVMF_CODE:-/usr/share/OVMF/OVMF_CODE.secboot.fd}
ovmf_vars=${OVMF_VARS:-./OVMF_VARS.fd}
DISK=$1
-qemu-system-x86_64 -enable-kvm -M q35 \
+qemu-system-x86_64 -enable-kvm -M q35 -nographic \
-cpu host,hv_relaxed,hv_vapic,hv-spinlocks=0xfff -smp 2 -m 2G -no-hpet \
-global ICH9-LPC.disable_s3=1 \
-global isa-fdc.driveA= \
Applied, thanks.

Jan

--
Siemens AG, Technology
Competence Center Embedded Linux


Re: [isar-cip-core] [PATCH] scripts/start-efishell.sh: Add -nographic option

Jan Kiszka
 

On 27.06.22 10:23, Gylstorff Quirin wrote:


On 6/27/22 10:14, Jan Kiszka via lists.cip-project.org wrote:
On 27.06.22 09:12, Sarath P T wrote:
From: sarath P T <Sarath_PT@...>

When we launch the start-efishell.sh script for
adding the keys into OVMF firmware we faced
gtk initialization failed error. So it seems
we need to open the OVMF in nographic mode, hence
we added the required option to the script.
Which QEMU-Version? Which OVMF version (buster/bullseye/something else)?
I'm not seeing this, but I'm facing other issues with that firmware
provided by bullseye (a crash).
 >> Signed-off-by: sarath P T <Sarath_PT@...>
---
  scripts/start-efishell.sh | 2 +-
  1 file changed, 1 insertion(+), 1 deletion(-)

diff --git a/scripts/start-efishell.sh b/scripts/start-efishell.sh
index d451f43..0831f83 100755
--- a/scripts/start-efishell.sh
+++ b/scripts/start-efishell.sh
@@ -2,7 +2,7 @@
  ovmf_code=${OVMF_CODE:-/usr/share/OVMF/OVMF_CODE.secboot.fd}
This should be changed to the 4M version.

@jan
The 4M version does also trigger a crash?
Yes, it does.

Jan

--
Siemens AG, Technology
Competence Center Embedded Linux


Re: [isar-cip-core] [PATCH] scripts/start-efishell.sh: Add -nographic option

Kanagarajan, Vijaikumar
 

-----Original Message-----
From: cip-dev@... <cip-dev@...> On
Behalf Of Jan Kiszka
Sent: 27 June 2022 13:44
To: P T, Sarath <Sarath_PT@...>; cip-dev@...
Subject: Re: [cip-dev] [isar-cip-core] [PATCH] scripts/start-efishell.sh: Add -
nographic option

On 27.06.22 09:12, Sarath P T wrote:
From: sarath P T <Sarath_PT@...>

When we launch the start-efishell.sh script for adding the keys into
OVMF firmware we faced gtk initialization failed error. So it seems we
need to open the OVMF in nographic mode, hence we added the required
option to the script.
Which QEMU-Version? Which OVMF version (buster/bullseye/something
else)?
I'm not seeing this, but I'm facing other issues with that firmware provided by
bullseye (a crash).
Nope. Not related to OVMF crashes. This is just to make the script work on headless systems/over ssh.

Sarath,
Can you send a V2 with a modified commit message. The latter half is a bit misleading. Probably you meant
"open QEMU" and not OVMF.

Thanks,
Vijai Kumar K



Signed-off-by: sarath P T <Sarath_PT@...>
---
scripts/start-efishell.sh | 2 +-
1 file changed, 1 insertion(+), 1 deletion(-)

diff --git a/scripts/start-efishell.sh b/scripts/start-efishell.sh
index d451f43..0831f83 100755
--- a/scripts/start-efishell.sh
+++ b/scripts/start-efishell.sh
@@ -2,7 +2,7 @@
ovmf_code=${OVMF_CODE:-/usr/share/OVMF/OVMF_CODE.secboot.fd}
ovmf_vars=${OVMF_VARS:-./OVMF_VARS.fd}
DISK=$1
-qemu-system-x86_64 -enable-kvm -M q35 \
+qemu-system-x86_64 -enable-kvm -M q35 -nographic \
-cpu host,hv_relaxed,hv_vapic,hv-spinlocks=0xfff -smp 2 -m 2G -
no-hpet \
-global ICH9-LPC.disable_s3=1 \
-global isa-fdc.driveA= \
Jan

--
Siemens AG, Technology
Competence Center Embedded Linux


Re: [isar-cip-core] [PATCH] scripts/start-efishell.sh: Add -nographic option

Quirin Gylstorff
 

On 6/27/22 10:14, Jan Kiszka via lists.cip-project.org wrote:
On 27.06.22 09:12, Sarath P T wrote:
From: sarath P T <Sarath_PT@...>

When we launch the start-efishell.sh script for
adding the keys into OVMF firmware we faced
gtk initialization failed error. So it seems
we need to open the OVMF in nographic mode, hence
we added the required option to the script.
Which QEMU-Version? Which OVMF version (buster/bullseye/something else)?
I'm not seeing this, but I'm facing other issues with that firmware
provided by bullseye (a crash).
>> Signed-off-by: sarath P T <Sarath_PT@...>
---
scripts/start-efishell.sh | 2 +-
1 file changed, 1 insertion(+), 1 deletion(-)

diff --git a/scripts/start-efishell.sh b/scripts/start-efishell.sh
index d451f43..0831f83 100755
--- a/scripts/start-efishell.sh
+++ b/scripts/start-efishell.sh
@@ -2,7 +2,7 @@
ovmf_code=${OVMF_CODE:-/usr/share/OVMF/OVMF_CODE.secboot.fd}
This should be changed to the 4M version.

@jan
The 4M version does also trigger a crash?

Quirin

ovmf_vars=${OVMF_VARS:-./OVMF_VARS.fd}
DISK=$1
-qemu-system-x86_64 -enable-kvm -M q35 \
+qemu-system-x86_64 -enable-kvm -M q35 -nographic \
-cpu host,hv_relaxed,hv_vapic,hv-spinlocks=0xfff -smp 2 -m 2G -no-hpet \
-global ICH9-LPC.disable_s3=1 \
-global isa-fdc.driveA= \
Jan


Re: [isar-cip-core] [PATCH] scripts/start-efishell.sh: Add -nographic option

Jan Kiszka
 

On 27.06.22 09:12, Sarath P T wrote:
From: sarath P T <Sarath_PT@...>

When we launch the start-efishell.sh script for
adding the keys into OVMF firmware we faced
gtk initialization failed error. So it seems
we need to open the OVMF in nographic mode, hence
we added the required option to the script.
Which QEMU-Version? Which OVMF version (buster/bullseye/something else)?
I'm not seeing this, but I'm facing other issues with that firmware
provided by bullseye (a crash).

Signed-off-by: sarath P T <Sarath_PT@...>
---
scripts/start-efishell.sh | 2 +-
1 file changed, 1 insertion(+), 1 deletion(-)

diff --git a/scripts/start-efishell.sh b/scripts/start-efishell.sh
index d451f43..0831f83 100755
--- a/scripts/start-efishell.sh
+++ b/scripts/start-efishell.sh
@@ -2,7 +2,7 @@
ovmf_code=${OVMF_CODE:-/usr/share/OVMF/OVMF_CODE.secboot.fd}
ovmf_vars=${OVMF_VARS:-./OVMF_VARS.fd}
DISK=$1
-qemu-system-x86_64 -enable-kvm -M q35 \
+qemu-system-x86_64 -enable-kvm -M q35 -nographic \
-cpu host,hv_relaxed,hv_vapic,hv-spinlocks=0xfff -smp 2 -m 2G -no-hpet \
-global ICH9-LPC.disable_s3=1 \
-global isa-fdc.driveA= \
Jan

--
Siemens AG, Technology
Competence Center Embedded Linux


cip-gitlab/ci/iwamatsu/linux-5.10.y-cip-rc smc: 10 runs, 2 regressions (v5.10.121-cip9-272-g3fb28d4c623b) #kernelci

kernelci.org bot <bot@...>
 

cip-gitlab/ci/iwamatsu/linux-5.10.y-cip-rc smc: 10 runs, 2 regressions (v5.10.121-cip9-272-g3fb28d4c623b)

Regressions Summary
-------------------

platform | arch | lab | compiler | defconfig | regressions
----------------------+-------+-------------+----------+----------------------------+------------
qemu_arm64-virt-gicv3 | arm64 | lab-broonie | gcc-10 | defconfig | 1
qemu_arm64-virt-gicv3 | arm64 | lab-broonie | gcc-10 | defconfig+arm64-chromebook | 1

Details: https://kernelci.org/test/job/cip-gitlab/branch/ci%2Fiwamatsu%2Flinux-5.10.y-cip-rc/kernel/v5.10.121-cip9-272-g3fb28d4c623b/plan/smc/

Test: smc
Tree: cip-gitlab
Branch: ci/iwamatsu/linux-5.10.y-cip-rc
Describe: v5.10.121-cip9-272-g3fb28d4c623b
URL: https://gitlab.com/cip-project/cip-kernel/linux-cip.git
SHA: 3fb28d4c623b354373a844dd48f16cb4f005388e


Test Regressions
----------------


platform | arch | lab | compiler | defconfig | regressions
----------------------+-------+-------------+----------+----------------------------+------------
qemu_arm64-virt-gicv3 | arm64 | lab-broonie | gcc-10 | defconfig | 1

Details: https://kernelci.org/test/plan/id/62b5dfb8affe897e93a39bd0

Results: 0 PASS, 1 FAIL, 0 SKIP
Full config: defconfig
Compiler: gcc-10 (aarch64-linux-gnu-gcc (Debian 10.2.1-6) 10.2.1 20210110)
Plain log: https://storage.kernelci.org//cip-gitlab/ci-iwamatsu-linux-5.10.y-cip-rc/v5.10.121-cip9-272-g3fb28d4c623b/arm64/defconfig/gcc-10/lab-broonie/smc-qemu_arm64-virt-gicv3.txt
HTML log: https://storage.kernelci.org//cip-gitlab/ci-iwamatsu-linux-5.10.y-cip-rc/v5.10.121-cip9-272-g3fb28d4c623b/arm64/defconfig/gcc-10/lab-broonie/smc-qemu_arm64-virt-gicv3.html
Rootfs: http://storage.kernelci.org/images/rootfs/buildroot/buildroot-baseline/20220610.1/arm64/rootfs.cpio.gz


* smc.login: https://kernelci.org/test/case/id/62b5dfb8affe897e93a39bd1
failing since 45 days (last pass: v5.10.112-cip6-88-gf3397cadb2dd6, first fail: v5.10.112-cip6-218-g8253434cd56a)



platform | arch | lab | compiler | defconfig | regressions
----------------------+-------+-------------+----------+----------------------------+------------
qemu_arm64-virt-gicv3 | arm64 | lab-broonie | gcc-10 | defconfig+arm64-chromebook | 1

Details: https://kernelci.org/test/plan/id/62b5e1300833dfdc5fa39bea

Results: 0 PASS, 1 FAIL, 0 SKIP
Full config: defconfig+arm64-chromebook
Compiler: gcc-10 (aarch64-linux-gnu-gcc (Debian 10.2.1-6) 10.2.1 20210110)
Plain log: https://storage.kernelci.org//cip-gitlab/ci-iwamatsu-linux-5.10.y-cip-rc/v5.10.121-cip9-272-g3fb28d4c623b/arm64/defconfig+arm64-chromebook/gcc-10/lab-broonie/smc-qemu_arm64-virt-gicv3.txt
HTML log: https://storage.kernelci.org//cip-gitlab/ci-iwamatsu-linux-5.10.y-cip-rc/v5.10.121-cip9-272-g3fb28d4c623b/arm64/defconfig+arm64-chromebook/gcc-10/lab-broonie/smc-qemu_arm64-virt-gicv3.html
Rootfs: http://storage.kernelci.org/images/rootfs/buildroot/buildroot-baseline/20220610.1/arm64/rootfs.cpio.gz


* smc.login: https://kernelci.org/test/case/id/62b5e1300833dfdc5fa39beb
failing since 42 days (last pass: v5.10.112-cip6-88-gf3397cadb2dd6, first fail: v5.10.112-cip6-289-g2969e096d186)


cip-gitlab/ci/iwamatsu/linux-5.10.y-cip-rc ltp-timers: 10 runs, 1 regressions (v5.10.121-cip9-272-g3fb28d4c623b) #kernelci

kernelci.org bot <bot@...>
 

cip-gitlab/ci/iwamatsu/linux-5.10.y-cip-rc ltp-timers: 10 runs, 1 regressions (v5.10.121-cip9-272-g3fb28d4c623b)

Regressions Summary
-------------------

platform | arch | lab | compiler | defconfig | regressions
-------------------------+-------+---------+----------+-----------+------------
r8a774a1-hihope-rzg2m-ex | arm64 | lab-cip | gcc-10 | defconfig | 1

Details: https://kernelci.org/test/job/cip-gitlab/branch/ci%2Fiwamatsu%2Flinux-5.10.y-cip-rc/kernel/v5.10.121-cip9-272-g3fb28d4c623b/plan/ltp-timers/

Test: ltp-timers
Tree: cip-gitlab
Branch: ci/iwamatsu/linux-5.10.y-cip-rc
Describe: v5.10.121-cip9-272-g3fb28d4c623b
URL: https://gitlab.com/cip-project/cip-kernel/linux-cip.git
SHA: 3fb28d4c623b354373a844dd48f16cb4f005388e

Test suite revisions:
ltp-tests
URL: https://github.com/linux-test-project/ltp.git
SHA: e98f9465925434349d0aa6eb71e81b5464e76df4


Test Regressions
----------------


platform | arch | lab | compiler | defconfig | regressions
-------------------------+-------+---------+----------+-----------+------------
r8a774a1-hihope-rzg2m-ex | arm64 | lab-cip | gcc-10 | defconfig | 1

Details: https://kernelci.org/test/plan/id/62b5e202dcd1300db4a39be2

Results: 0 PASS, 1 FAIL, 0 SKIP
Full config: defconfig
Compiler: gcc-10 (aarch64-linux-gnu-gcc (Debian 10.2.1-6) 10.2.1 20210110)
Plain log: https://storage.kernelci.org//cip-gitlab/ci-iwamatsu-linux-5.10.y-cip-rc/v5.10.121-cip9-272-g3fb28d4c623b/arm64/defconfig/gcc-10/lab-cip/ltp-timers-r8a774a1-hihope-rzg2m-ex.txt
HTML log: https://storage.kernelci.org//cip-gitlab/ci-iwamatsu-linux-5.10.y-cip-rc/v5.10.121-cip9-272-g3fb28d4c623b/arm64/defconfig/gcc-10/lab-cip/ltp-timers-r8a774a1-hihope-rzg2m-ex.html
Rootfs: http://storage.kernelci.org/images/rootfs/debian/bullseye-ltp/20220610.0/arm64/initrd.cpio.gz


* ltp-timers.login: https://kernelci.org/test/case/id/62b5e202dcd1300db4a39be3
new failure (last pass: v5.10.118-465-g0af29783a3c9)


cip-gitlab/ci/iwamatsu/linux-5.10.y-cip-rc kselftest-lkdtm: 7 runs, 2 regressions (v5.10.121-cip9-272-g3fb28d4c623b) #kernelci

kernelci.org bot <bot@...>
 

cip-gitlab/ci/iwamatsu/linux-5.10.y-cip-rc kselftest-lkdtm: 7 runs, 2 regressions (v5.10.121-cip9-272-g3fb28d4c623b)

Regressions Summary
-------------------

platform | arch | lab | compiler | defconfig | regressions
--------------------------+--------+---------------+----------+------------------------------+------------
asus-C433TA-AJ0005-rammus | x86_64 | lab-collabora | gcc-10 | x86_64_defcon...ok+kselftest | 1
hp-11A-G6-EE-grunt | x86_64 | lab-collabora | gcc-10 | x86_64_defcon...ok+kselftest | 1

Details: https://kernelci.org/test/job/cip-gitlab/branch/ci%2Fiwamatsu%2Flinux-5.10.y-cip-rc/kernel/v5.10.121-cip9-272-g3fb28d4c623b/plan/kselftest-lkdtm/

Test: kselftest-lkdtm
Tree: cip-gitlab
Branch: ci/iwamatsu/linux-5.10.y-cip-rc
Describe: v5.10.121-cip9-272-g3fb28d4c623b
URL: https://gitlab.com/cip-project/cip-kernel/linux-cip.git
SHA: 3fb28d4c623b354373a844dd48f16cb4f005388e


Test Regressions
----------------


platform | arch | lab | compiler | defconfig | regressions
--------------------------+--------+---------------+----------+------------------------------+------------
asus-C433TA-AJ0005-rammus | x86_64 | lab-collabora | gcc-10 | x86_64_defcon...ok+kselftest | 1

Details: https://kernelci.org/test/plan/id/62b5dd35ce7a5befe0a39bcd

Results: 37 PASS, 17 FAIL, 25 SKIP
Full config: x86_64_defconfig+x86-chromebook+kselftest
Compiler: gcc-10 (gcc (Debian 10.2.1-6) 10.2.1 20210110)
Plain log: https://storage.kernelci.org//cip-gitlab/ci-iwamatsu-linux-5.10.y-cip-rc/v5.10.121-cip9-272-g3fb28d4c623b/x86_64/x86_64_defconfig+x86-chromebook+kselftest/gcc-10/lab-collabora/kselftest-lkdtm-asus-C433TA-AJ0005-rammus.txt
HTML log: https://storage.kernelci.org//cip-gitlab/ci-iwamatsu-linux-5.10.y-cip-rc/v5.10.121-cip9-272-g3fb28d4c623b/x86_64/x86_64_defconfig+x86-chromebook+kselftest/gcc-10/lab-collabora/kselftest-lkdtm-asus-C433TA-AJ0005-rammus.html
Rootfs: http://storage.kernelci.org/images/rootfs/debian/bullseye-kselftest/20220610.0/amd64/initrd.cpio.gz


* kselftest-lkdtm.lkdtm_USERCOPY_STACK_FRAME_FROM_sh: https://kernelci.org/test/case/id/62b5dd35ce7a5befe0a39bd3
new failure (last pass: v5.10.118-465-g0af29783a3c9)



platform | arch | lab | compiler | defconfig | regressions
--------------------------+--------+---------------+----------+------------------------------+------------
hp-11A-G6-EE-grunt | x86_64 | lab-collabora | gcc-10 | x86_64_defcon...ok+kselftest | 1

Details: https://kernelci.org/test/plan/id/62b5dd330cbb9f056aa39bfd

Results: 36 PASS, 18 FAIL, 25 SKIP
Full config: x86_64_defconfig+x86-chromebook+kselftest
Compiler: gcc-10 (gcc (Debian 10.2.1-6) 10.2.1 20210110)
Plain log: https://storage.kernelci.org//cip-gitlab/ci-iwamatsu-linux-5.10.y-cip-rc/v5.10.121-cip9-272-g3fb28d4c623b/x86_64/x86_64_defconfig+x86-chromebook+kselftest/gcc-10/lab-collabora/kselftest-lkdtm-hp-11A-G6-EE-grunt.txt
HTML log: https://storage.kernelci.org//cip-gitlab/ci-iwamatsu-linux-5.10.y-cip-rc/v5.10.121-cip9-272-g3fb28d4c623b/x86_64/x86_64_defconfig+x86-chromebook+kselftest/gcc-10/lab-collabora/kselftest-lkdtm-hp-11A-G6-EE-grunt.html
Rootfs: http://storage.kernelci.org/images/rootfs/debian/bullseye-kselftest/20220610.0/amd64/initrd.cpio.gz


* kselftest-lkdtm.lkdtm_USERCOPY_STACK_FRAME_FROM_sh: https://kernelci.org/test/case/id/62b5dd330cbb9f056aa39c03
new failure (last pass: v5.10.118-465-g0af29783a3c9)


cip-gitlab/ci/iwamatsu/linux-5.10.y-cip-rc kselftest-lib: 10 runs, 1 regressions (v5.10.121-cip9-272-g3fb28d4c623b) #kernelci

kernelci.org bot <bot@...>
 

cip-gitlab/ci/iwamatsu/linux-5.10.y-cip-rc kselftest-lib: 10 runs, 1 regressions (v5.10.121-cip9-272-g3fb28d4c623b)

Regressions Summary
-------------------

platform | arch | lab | compiler | defconfig | regressions
-------------------------+-------+---------+----------+---------------------+------------
r8a774a1-hihope-rzg2m-ex | arm64 | lab-cip | gcc-10 | defconfig+kselftest | 1

Details: https://kernelci.org/test/job/cip-gitlab/branch/ci%2Fiwamatsu%2Flinux-5.10.y-cip-rc/kernel/v5.10.121-cip9-272-g3fb28d4c623b/plan/kselftest-lib/

Test: kselftest-lib
Tree: cip-gitlab
Branch: ci/iwamatsu/linux-5.10.y-cip-rc
Describe: v5.10.121-cip9-272-g3fb28d4c623b
URL: https://gitlab.com/cip-project/cip-kernel/linux-cip.git
SHA: 3fb28d4c623b354373a844dd48f16cb4f005388e


Test Regressions
----------------


platform | arch | lab | compiler | defconfig | regressions
-------------------------+-------+---------+----------+---------------------+------------
r8a774a1-hihope-rzg2m-ex | arm64 | lab-cip | gcc-10 | defconfig+kselftest | 1

Details: https://kernelci.org/test/plan/id/62b5deb1648d50c65ca39c77

Results: 0 PASS, 1 FAIL, 0 SKIP
Full config: defconfig+kselftest
Compiler: gcc-10 (aarch64-linux-gnu-gcc (Debian 10.2.1-6) 10.2.1 20210110)
Plain log: https://storage.kernelci.org//cip-gitlab/ci-iwamatsu-linux-5.10.y-cip-rc/v5.10.121-cip9-272-g3fb28d4c623b/arm64/defconfig+kselftest/gcc-10/lab-cip/kselftest-lib-r8a774a1-hihope-rzg2m-ex.txt
HTML log: https://storage.kernelci.org//cip-gitlab/ci-iwamatsu-linux-5.10.y-cip-rc/v5.10.121-cip9-272-g3fb28d4c623b/arm64/defconfig+kselftest/gcc-10/lab-cip/kselftest-lib-r8a774a1-hihope-rzg2m-ex.html
Rootfs: http://storage.kernelci.org/images/rootfs/debian/bullseye-kselftest/20220610.0/arm64/initrd.cpio.gz


* kselftest-lib.login: https://kernelci.org/test/case/id/62b5deb1648d50c65ca39c78
new failure (last pass: v5.10.118-465-g0af29783a3c9)

541 - 560 of 9152