Date   

CIP IRC weekly meeting today on libera.chat External

Jan Kiszka
 

Hi all,

Kindly be reminded to attend the weekly meeting through IRC to discuss
technical topics with CIP kernel today. Our channel is the following:

irc:irc.libera.chat:6667/cip

The IRC meeting is scheduled to UTC (GMT) 13:00:

https://www.timeanddate.com/worldclock/meetingdetails.html?year=2022&month=1&day=13&hour=13&min=0&sec=0&p1=224&p2=179&p3=136&p4=37&p5=241&p6=248

USWest USEast UK DE TW JP
06:00 09:00 13:00 14:00 21:00 22:00

Last meeting minutes:
https://irclogs.baserock.org/meetings/cip/2022/01/cip.2022-01-06-13.08.log.html

* Action items
1. Provide v3 of kernelci patches for isar-cip-core - alicef
2. Propose tweet on KernelCI-CIP collaboration progress - alicef
3. Clarify with KernelCI whether CIP maintainers can get accounts - alicef
* Kernel maintenance updates
* Kernel testing
* AOB

Jan


New CVE entries in this week

Masami Ichikawa
 

Hi !

It's this week's CVE report.

This week reported 7 new CVEs.

* New CVEs

CVE-2021-39633: ip_gre: add validation for csum_start

CVSS v3 score is not provided

An information leak bug was found in gre_handle_offloads() which is in
net/ipv4/ip_gre.c.
This fix uses skb_checksum_start() to check data but this function was
introduced at 4.6-rc1 commit 08b64fc ("net: Store checksum result for
offloaded GSO checksums") so applying this patch requires commit
08b64fc too.

Fixed status

mainline: [1d011c4803c72f3907eccfc1ec63caefb852fcbf]
stable/4.14: [99279223a37b46dc7716ec4e0ed4b3e03f1cfa4c]
stable/4.19: [c33471daf2763c5aee2b7926202c74b75c365119]
stable/4.9: [41d5dfa408130433cc5f037ad89bed854bf936f7]
stable/5.10: [fb45459d9ddb1edd4a8b087bafe875707753cb10]
stable/5.4: [53b480e68c1c2c778b620cc7f45a2ba5dff518ca]

CVE-2021-39634: epoll: do not insert into poll queues until all sanity
checks are done

CVSS v3 score is not provided

A local attacker could gain his privilege by abusing this bug. All
stable kernels and the mainline kernels have already been fixed.

Fixed status

mainline: [f8d4f44df056c5b504b0d49683fb7279218fd207]
stable/4.14: [23fb662b13e4f75688123e1d16aa7116f602db32]
stable/4.19: [3e3bbc4d23eeb90bf282e98c7dfeca7702df3169]
stable/4.4: [ea984dfe0e7978cd294eb6a640ac27fa1834ac8d]
stable/4.9: [a16d314ccda2efa6173f2ae7d386f99c61d273a4]
stable/5.4: [8993da3d4d3a7ae721e9dafa140ba64c0e632a50]

CVE-2021-4155: xfs: map unwritten blocks in XFS_IOC_{ALLOC,FREE}SP
just like fallocate

CVSS v3 score is not provided

An information leak bug was found in xfs by using XFS_IOC_ALLOCSP
operation via ioctl.
All stable kernels and the mainline kernel have been fixed.

Fixed status

mainline: [983d8e60f50806f90534cc5373d0ce867e5aaf79]
stable/4.14: [2af625c89bf4a41c8a0bc818d8cf30a291f216ca]
stable/4.19: [1c3564fca0e7b8c9e96245a2cb35e198b036ee9a]
stable/4.4: [56adcda55aa213e106224ff3d18ef4625e25f52b]
stable/4.9: [19e3d9a26f28f432ae89acec22ec47b2a72a502c]
stable/5.10: [16d8568378f9ee2d1e69216d39961aa72710209f]
stable/5.15: [b0e72ba9e520b95346e68800afff0db65e766ca8]
stable/5.4: [102af6edfd3a372db6e229177762a91f552e5f5e]

CVE-2021-4202: Race condition in nci_request() leads to use after free
while the device is getting removed

CVSS v3 score is not provided

Race condition bug in NFC device. A local attacker could do privilege
escalation via this bug. However, no CIP member enabled
CONFIG_NFC_NCI. All stable kernels and the mainline kernel have been
fixed.

Fixed status

mainline: [86cdf8e38792545161dbe3350a7eced558ba4d15,
48b71a9e66c2eab60564b1b1c85f4928ed04e406]
stable/4.14: [6e2944d8bbc58682691438b57620491b5a4b7cfb,
8937bfa226d4001875d8539ae811fce6d3df4c96]
stable/4.19: [62be2b1e7914b7340281f09412a7bbb62e6c8b67,
2350cffd71e74bf81dedc989fdec12aebe89a4a5]
stable/4.4: [6dc051117ba0e1dac9324593ff2c1c520f67ad21,
6f195c7691089c56cd1553a9ca3ca22790c0fe07]
stable/4.9: [4a59a3681158a182557c75bacd00d184f9b2a8f5,
57c076e64ab55adf556cc515914564d61979f7c2]
stable/5.10: [cb14b196d991c864ed2d1b6e79d68a7ce38e6538,
34e54703fb0fdbfc0a3cfc065d71e9a8353d3ac9]
stable/5.15: [96a209038a99a379444ea3ef9ae823e685ba60e7,
ed35e950d8e5658db5b45526be2c4e3778746909]
stable/5.4: [e418bb556ff801e11592851fd465415757a2ef68,
eff32973ecc3838d9a6dc5174bd24d76b120843c]

CVE-2021-4203: af_unix: fix races in sk_peer_pid and sk_peer_cred accesses

CVSS v3 score is not provided

A local attacker can cause a system crash or internal kernel
information leak via this issue.
All stable kernels and the mainline kernel have been fixed.

Fixed status

mainline: [35306eb23814444bd4021f8a1c3047d3cb0c8b2b]
stable/4.14: [9d76f723256d68eea16f0c563fc80b3c14258634]
stable/4.19: [0512a9aede6e4417c4fa6e0042a7ca8bc7e06b86]
stable/4.4: [323f0968a81b082cf02ef15b447cd35e4328385e]
stable/4.9: [09818f629bafbe20e24bac919019853ea3ac5ca4]
stable/5.10: [3db53827a0e9130d9e2cbe3c3b5bca601caa4c74]
stable/5.4: [0fcfaa8ed9d1dcbe377b202a1b3cdfd4e566114c]

CVE-2021-4204: eBPF Improper Input Validation Vulnerability

CVSS v3 score is not provided

A local attacker can escalate privileges via this bug.
This bug is affecting the 5.8 or later kernel. The commit 457f4436
("bpf: Implement BPF ring buffer and verifier support for it")
introduced this issue.

To mitigate this issue, set kernel.unprivileged_bpf_disabled to 1.

Fixed status

Not fixed yet.

CVE-2021-46283: netfilter: nf_tables: initialize set before expression setup

CVSS v3 score is not provided

A local attacker to cause a local DoS attack by this bug.
This issue was introduced at commit 65038428 (netfilter: nf_tables:
allow to specify stateful expression in set definition) which was
merged at 5.7-rc1. Before 5.7 kernels aren't affected by this issue.

Fixed status

mainline: [ad9f151e560b016b6ad3280b48e42fa11e1a5440]
stable/5.10: [36983fc2f87ea3b74a33bf460c9ee7329735b7b5]

* Updated CVEs

CVE-2021-45095: phonet: refcount leak in pep_sock_accep

Stable kernels are updated. So stable kernels and the mainline kernel
have been fixed.

Fixed status

mainline: [bcd0f93353326954817a4f9fa55ec57fb38acbb0]
stable/4.14: [a025db5658d5c10019ffed0d59026da8172897b6]
stable/4.19: [4dece2760af408ad91d6e43afc485d20386c2885]
stable/4.4: [172b3f506c24a61805b3910b9acfe7159d980b9b]
stable/4.9: [3bae29ecb2909c46309671090311230239f1bdd7]
stable/5.10: [4f260ea5537db35d2eeec9bca78a74713078a544]
stable/5.15: [9ca97a693aa8b86e8424f0047198ea3ab997d50f]
stable/5.4: [2a6a811a45fde5acb805ead4d1e942be3875b302]

Currently tracking CVEs

CVE-2021-31615: Unencrypted Bluetooth Low Energy baseband links in
Bluetooth Core Specifications 4.0 through 5.2

There is no fix information.

CVE-2020-26555: BR/EDR pin code pairing broken

No fix information

CVE-2020-26556: kernel: malleable commitment Bluetooth Mesh Provisioning

No fix information.

CVE-2020-26557: kernel: predictable Authvalue in Bluetooth Mesh
Provisioning Leads to MITM

No fix information.

CVE-2020-26559: kernel: Authvalue leak in Bluetooth Mesh Provisioning

No fix information.

CVE-2020-26560: kernel: impersonation attack in Bluetooth Mesh Provisioning

No fix information.


Regards,
--
Masami Ichikawa
Cybertrust Japan Co., Ltd.

Email :masami.ichikawa@cybertrust.co.jp
:masami.ichikawa@miraclelinux.com


cip/linux-5.10.y-cip sleep: 8 runs, 2 regressions (v5.10.83-cip1-150-ge27e063993d9) #kernelci

kernelci.org bot <bot@...>
 

cip/linux-5.10.y-cip sleep: 8 runs, 2 regressions (v5.10.83-cip1-150-ge27e063993d9)

Regressions Summary
-------------------

platform | arch | lab | compiler | defconfig | regressions
-------------------+--------+---------------+----------+------------------------------+------------
hp-11A-G6-EE-grunt | x86_64 | lab-collabora | gcc-10 | x86_64_defcon...6-chromebook | 1
rk3399-gru-kevin | arm64 | lab-collabora | gcc-10 | defconfig+arm64-chromebook | 1

Details: https://kernelci.org/test/job/cip/branch/linux-5.10.y-cip/kernel/v5.10.83-cip1-150-ge27e063993d9/plan/sleep/

Test: sleep
Tree: cip
Branch: linux-5.10.y-cip
Describe: v5.10.83-cip1-150-ge27e063993d9
URL: https://git.kernel.org/pub/scm/linux/kernel/git/cip/linux-cip.git
SHA: e27e063993d9bed9942dbaddd575086dccd29623


Test Regressions
----------------


platform | arch | lab | compiler | defconfig | regressions
-------------------+--------+---------------+----------+------------------------------+------------
hp-11A-G6-EE-grunt | x86_64 | lab-collabora | gcc-10 | x86_64_defcon...6-chromebook | 1

Details: https://kernelci.org/test/plan/id/61deca04423bb9d80aef6755

Results: 22 PASS, 1 FAIL, 0 SKIP
Full config: x86_64_defconfig+x86-chromebook
Compiler: gcc-10 (gcc (Debian 10.2.1-6) 10.2.1 20210110)
Plain log: https://storage.kernelci.org//cip/linux-5.10.y-cip/v5.10.83-cip1-150-ge27e063993d9/x86_64/x86_64_defconfig+x86-chromebook/gcc-10/lab-collabora/sleep-hp-11A-G6-EE-grunt.txt
HTML log: https://storage.kernelci.org//cip/linux-5.10.y-cip/v5.10.83-cip1-150-ge27e063993d9/x86_64/x86_64_defconfig+x86-chromebook/gcc-10/lab-collabora/sleep-hp-11A-G6-EE-grunt.html
Rootfs: http://storage.kernelci.org/images/rootfs/debian/bullseye/20211224.1/amd64/rootfs.cpio.gz


* sleep.rtcwake-mem-9: https://kernelci.org/test/case/id/61deca04423bb9d80aef6762
new failure (last pass: v5.10.83-cip1-89-ga7f9ee34265b)

2022-01-12T12:29:22.369899 rtcwake: assuming RTC uses UTC ...
2022-01-12T12:29:22.376549 rtcwake: wakeup from \"mem\" using rtc0 at Wed Jan 12 12:29:28 2022
2022-01-12T12:29:22.378259 <6>[ 31.348218] PM: suspend entry (deep)
2022-01-12T12:29:22.382913 <6>[ 31.357160] Filesystems sync: 0.000 seconds
2022-01-12T12:29:22.392896 <6>[ 31.362344] Freezing user space processes ... (elapsed 0.001 seconds) done.
2022-01-12T12:29:22.396437 <6>[ 31.371305] OOM killer disabled.
2022-01-12T12:29:23.881831 <6>[ 31.374792] Freezing remaining freezable tasks ... (elapsed 1.444 seconds) done.
2022-01-12T12:29:23.888159 <6>[ 32.859450] printk: Suspending console(s) (use no_console_suspend to debug)
2022-01-12T12:29:24.141887
2022-01-12T12:29:24.142422
... (1150 line(s) more)



platform | arch | lab | compiler | defconfig | regressions
-------------------+--------+---------------+----------+------------------------------+------------
rk3399-gru-kevin | arm64 | lab-collabora | gcc-10 | defconfig+arm64-chromebook | 1

Details: https://kernelci.org/test/plan/id/61dec37287c2380f82ef673f

Results: 12 PASS, 1 FAIL, 0 SKIP
Full config: defconfig+arm64-chromebook
Compiler: gcc-10 (aarch64-linux-gnu-gcc (Debian 10.2.1-6) 10.2.1 20210110)
Plain log: https://storage.kernelci.org//cip/linux-5.10.y-cip/v5.10.83-cip1-150-ge27e063993d9/arm64/defconfig+arm64-chromebook/gcc-10/lab-collabora/sleep-rk3399-gru-kevin.txt
HTML log: https://storage.kernelci.org//cip/linux-5.10.y-cip/v5.10.83-cip1-150-ge27e063993d9/arm64/defconfig+arm64-chromebook/gcc-10/lab-collabora/sleep-rk3399-gru-kevin.html
Rootfs: http://storage.kernelci.org/images/rootfs/debian/bullseye/20211224.1/arm64/rootfs.cpio.gz


* sleep.rtcwake-mem-9: https://kernelci.org/test/case/id/61dec37287c2380f82ef6742
new failure (last pass: v5.10.83-cip1-89-ga7f9ee34265b)

2022-01-12T11:58:33.165677 rtcwake: assuming RTC uses UTC ...
2022-01-12T11:58:33.172055 rtcwake: wakeup from \"mem\" using rtc0 at Wed Jan 12 11:05:56 2022
2022-01-12T11:58:33.186549 <6>[ 37.653319] PM: suspend entry (deep)
2022-01-12T11:58:33.201401 <6>[ 37.667581] Filesystems sync: 0.000 seconds
2022-01-12T11:58:33.219625 <6>[ 37.680824] Freezing user space processes ... (elapsed 0.001 seconds) done.
2022-01-12T11:58:33.230518 <6>[ 37.698161] OOM killer disabled.
2022-01-12T11:58:33.246785 <6>[ 37.707823] Freezing remaining freezable tasks ... (elapsed 0.001 seconds) done.
2022-01-12T11:58:33.264563 <6>[ 37.728146] printk: Suspending console(s) (use no_console_suspend to debug)
2022-01-12T11:58:39.774038 <3>[ 38.350350] mwifiex_pcie 0000:01:00.0: adapter is not valid
2022-01-12T11:58:39.784198 <6>[ 38.575968] Disabling non-boot CPUs ...
... (98 line(s) more)


cip/linux-5.10.y-cip ltp-ipc: 8 runs, 1 regressions (v5.10.83-cip1-150-ge27e063993d9) #kernelci

kernelci.org bot <bot@...>
 

cip/linux-5.10.y-cip ltp-ipc: 8 runs, 1 regressions (v5.10.83-cip1-150-ge27e063993d9)

Regressions Summary
-------------------

platform | arch | lab | compiler | defconfig | regressions
-------------------------+-------+---------+----------+----------------------------+------------
r8a774a1-hihope-rzg2m-ex | arm64 | lab-cip | gcc-10 | defconfig+arm64-chromebook | 1

Details: https://kernelci.org/test/job/cip/branch/linux-5.10.y-cip/kernel/v5.10.83-cip1-150-ge27e063993d9/plan/ltp-ipc/

Test: ltp-ipc
Tree: cip
Branch: linux-5.10.y-cip
Describe: v5.10.83-cip1-150-ge27e063993d9
URL: https://git.kernel.org/pub/scm/linux/kernel/git/cip/linux-cip.git
SHA: e27e063993d9bed9942dbaddd575086dccd29623

Test suite revisions:
ltp-tests
URL: https://github.com/linux-test-project/ltp.git
SHA: e48f57becbcc836f7d9c554b1709a5926e29f703


Test Regressions
----------------


platform | arch | lab | compiler | defconfig | regressions
-------------------------+-------+---------+----------+----------------------------+------------
r8a774a1-hihope-rzg2m-ex | arm64 | lab-cip | gcc-10 | defconfig+arm64-chromebook | 1

Details: https://kernelci.org/test/plan/id/61ded5071af54ef8b4ef6748

Results: 8 PASS, 1 FAIL, 0 SKIP
Full config: defconfig+arm64-chromebook
Compiler: gcc-10 (aarch64-linux-gnu-gcc (Debian 10.2.1-6) 10.2.1 20210110)
Plain log: https://storage.kernelci.org//cip/linux-5.10.y-cip/v5.10.83-cip1-150-ge27e063993d9/arm64/defconfig+arm64-chromebook/gcc-10/lab-cip/ltp-ipc-r8a774a1-hihope-rzg2m-ex.txt
HTML log: https://storage.kernelci.org//cip/linux-5.10.y-cip/v5.10.83-cip1-150-ge27e063993d9/arm64/defconfig+arm64-chromebook/gcc-10/lab-cip/ltp-ipc-r8a774a1-hihope-rzg2m-ex.html
Rootfs: http://storage.kernelci.org/images/rootfs/debian/bullseye-ltp/20211221.0/arm64/initrd.cpio.gz


* ltp-ipc.pipeio_5: https://kernelci.org/test/case/id/61ded5071af54ef8b4ef674e
new failure (last pass: v5.10.83-cip1-89-ga7f9ee34265b)


cip/linux-5.10.y-cip baseline: 169 runs, 1 regressions (v5.10.83-cip1-150-ge27e063993d9) #kernelci

kernelci.org bot <bot@...>
 

cip/linux-5.10.y-cip baseline: 169 runs, 1 regressions (v5.10.83-cip1-150-ge27e063993d9)

Regressions Summary
-------------------

platform | arch | lab | compiler | defconfig | regressions
----------------+-------+--------------+----------+-----------+------------
meson-gxbb-p200 | arm64 | lab-baylibre | gcc-10 | defconfig | 1

Details: https://kernelci.org/test/job/cip/branch/linux-5.10.y-cip/kernel/v5.10.83-cip1-150-ge27e063993d9/plan/baseline/

Test: baseline
Tree: cip
Branch: linux-5.10.y-cip
Describe: v5.10.83-cip1-150-ge27e063993d9
URL: https://git.kernel.org/pub/scm/linux/kernel/git/cip/linux-cip.git
SHA: e27e063993d9bed9942dbaddd575086dccd29623


Test Regressions
----------------


platform | arch | lab | compiler | defconfig | regressions
----------------+-------+--------------+----------+-----------+------------
meson-gxbb-p200 | arm64 | lab-baylibre | gcc-10 | defconfig | 1

Details: https://kernelci.org/test/plan/id/61dec875dfbef98145ef675e

Results: 0 PASS, 1 FAIL, 0 SKIP
Full config: defconfig
Compiler: gcc-10 (aarch64-linux-gnu-gcc (Debian 10.2.1-6) 10.2.1 20210110)
Plain log: https://storage.kernelci.org//cip/linux-5.10.y-cip/v5.10.83-cip1-150-ge27e063993d9/arm64/defconfig/gcc-10/lab-baylibre/baseline-meson-gxbb-p200.txt
HTML log: https://storage.kernelci.org//cip/linux-5.10.y-cip/v5.10.83-cip1-150-ge27e063993d9/arm64/defconfig/gcc-10/lab-baylibre/baseline-meson-gxbb-p200.html
Rootfs: http://storage.kernelci.org/images/rootfs/buildroot/buildroot-baseline/20211210.0/arm64/rootfs.cpio.gz


* baseline.login: https://kernelci.org/test/case/id/61dec875dfbef98145ef675f
new failure (last pass: v5.10.83-cip1-89-ga7f9ee34265b)


cip/linux-5.10.y-cip build: 190 builds: 3 failed, 187 passed, 4 errors, 10 warnings (v5.10.83-cip1-150-ge27e063993d9) #kernelci

kernelci.org bot <bot@...>
 

cip/linux-5.10.y-cip build: 190 builds: 3 failed, 187 passed, 4 errors, 10 warnings (v5.10.83-cip1-150-ge27e063993d9)

Full Build Summary: https://kernelci.org/build/cip/branch/linux-5.10.y-cip/kernel/v5.10.83-cip1-150-ge27e063993d9/

Tree: cip
Branch: linux-5.10.y-cip
Git Describe: v5.10.83-cip1-150-ge27e063993d9
Git Commit: e27e063993d9bed9942dbaddd575086dccd29623
Git URL: https://git.kernel.org/pub/scm/linux/kernel/git/cip/linux-cip.git
Built: 7 unique architectures

Build Failures Detected:

arm:
rpc_defconfig: (gcc-10) FAIL

mips:
ip27_defconfig: (gcc-10) FAIL
ip28_defconfig: (gcc-10) FAIL

Errors and Warnings Detected:

arc:

arm64:

arm:
rpc_defconfig (gcc-10): 4 errors

i386:

mips:
32r2el_defconfig (gcc-10): 1 warning
decstation_64_defconfig (gcc-10): 1 warning
decstation_defconfig (gcc-10): 1 warning
decstation_r4k_defconfig (gcc-10): 1 warning
lemote2f_defconfig (gcc-10): 1 warning
rm200_defconfig (gcc-10): 1 warning

riscv:
rv32_defconfig (gcc-10): 4 warnings

x86_64:

Errors summary:

2 arm-linux-gnueabihf-gcc: error: unrecognized -march target: armv3m
2 arm-linux-gnueabihf-gcc: error: missing argument to ‘-march=’

Warnings summary:

3 kernel/rcu/tasks.h:707:13: warning: ‘show_rcu_tasks_rude_gp_kthread’ defined but not used [-Wunused-function]
2 <stdin>:830:2: warning: #warning syscall fstat64 not implemented [-Wcpp]
2 <stdin>:1127:2: warning: #warning syscall fstatat64 not implemented [-Wcpp]
1 net/mac80211/mlme.c:4328:1: warning: the frame size of 1040 bytes is larger than 1024 bytes [-Wframe-larger-than=]
1 drivers/block/paride/bpck.c:32: warning: "PC" redefined
1 WARNING: modpost: Symbol info of vmlinux is missing. Unresolved symbol check will be entirely skipped.

================================================================================

Detailed per-defconfig build reports:

--------------------------------------------------------------------------------
32r2el_defconfig (mips, gcc-10) — PASS, 0 errors, 1 warning, 0 section mismatches

Warnings:
WARNING: modpost: Symbol info of vmlinux is missing. Unresolved symbol check will be entirely skipped.

--------------------------------------------------------------------------------
allnoconfig (i386, gcc-10) — PASS, 0 errors, 0 warnings, 0 section mismatches

--------------------------------------------------------------------------------
allnoconfig (x86_64, gcc-10) — PASS, 0 errors, 0 warnings, 0 section mismatches

--------------------------------------------------------------------------------
allnoconfig (arc, gcc-10) — PASS, 0 errors, 0 warnings, 0 section mismatches

--------------------------------------------------------------------------------
am200epdkit_defconfig (arm, gcc-10) — PASS, 0 errors, 0 warnings, 0 section mismatches

--------------------------------------------------------------------------------
ar7_defconfig (mips, gcc-10) — PASS, 0 errors, 0 warnings, 0 section mismatches

--------------------------------------------------------------------------------
aspeed_g4_defconfig (arm, gcc-10) — PASS, 0 errors, 0 warnings, 0 section mismatches

--------------------------------------------------------------------------------
aspeed_g5_defconfig (arm, gcc-10) — PASS, 0 errors, 0 warnings, 0 section mismatches

--------------------------------------------------------------------------------
assabet_defconfig (arm, gcc-10) — PASS, 0 errors, 0 warnings, 0 section mismatches

--------------------------------------------------------------------------------
at91_dt_defconfig (arm, gcc-10) — PASS, 0 errors, 0 warnings, 0 section mismatches

--------------------------------------------------------------------------------
ath25_defconfig (mips, gcc-10) — PASS, 0 errors, 0 warnings, 0 section mismatches

--------------------------------------------------------------------------------
ath79_defconfig (mips, gcc-10) — PASS, 0 errors, 0 warnings, 0 section mismatches

--------------------------------------------------------------------------------
axm55xx_defconfig (arm, gcc-10) — PASS, 0 errors, 0 warnings, 0 section mismatches

--------------------------------------------------------------------------------
axs103_defconfig (arc, gcc-10) — PASS, 0 errors, 0 warnings, 0 section mismatches

--------------------------------------------------------------------------------
axs103_smp_defconfig (arc, gcc-10) — PASS, 0 errors, 0 warnings, 0 section mismatches

--------------------------------------------------------------------------------
badge4_defconfig (arm, gcc-10) — PASS, 0 errors, 0 warnings, 0 section mismatches

--------------------------------------------------------------------------------
bcm2835_defconfig (arm, gcc-10) — PASS, 0 errors, 0 warnings, 0 section mismatches

--------------------------------------------------------------------------------
bcm47xx_defconfig (mips, gcc-10) — PASS, 0 errors, 0 warnings, 0 section mismatches

--------------------------------------------------------------------------------
bcm63xx_defconfig (mips, gcc-10) — PASS, 0 errors, 0 warnings, 0 section mismatches

--------------------------------------------------------------------------------
bigsur_defconfig (mips, gcc-10) — PASS, 0 errors, 0 warnings, 0 section mismatches

--------------------------------------------------------------------------------
bmips_be_defconfig (mips, gcc-10) — PASS, 0 errors, 0 warnings, 0 section mismatches

--------------------------------------------------------------------------------
bmips_stb_defconfig (mips, gcc-10) — PASS, 0 errors, 0 warnings, 0 section mismatches

--------------------------------------------------------------------------------
capcella_defconfig (mips, gcc-10) — PASS, 0 errors, 0 warnings, 0 section mismatches

--------------------------------------------------------------------------------
cavium_octeon_defconfig (mips, gcc-10) — PASS, 0 errors, 0 warnings, 0 section mismatches

--------------------------------------------------------------------------------
cerfcube_defconfig (arm, gcc-10) — PASS, 0 errors, 0 warnings, 0 section mismatches

--------------------------------------------------------------------------------
ci20_defconfig (mips, gcc-10) — PASS, 0 errors, 0 warnings, 0 section mismatches

--------------------------------------------------------------------------------
cm_x300_defconfig (arm, gcc-10) — PASS, 0 errors, 0 warnings, 0 section mismatches

--------------------------------------------------------------------------------
cobalt_defconfig (mips, gcc-10) — PASS, 0 errors, 0 warnings, 0 section mismatches

--------------------------------------------------------------------------------
colibri_pxa270_defconfig (arm, gcc-10) — PASS, 0 errors, 0 warnings, 0 section mismatches

--------------------------------------------------------------------------------
colibri_pxa300_defconfig (arm, gcc-10) — PASS, 0 errors, 0 warnings, 0 section mismatches

--------------------------------------------------------------------------------
collie_defconfig (arm, gcc-10) — PASS, 0 errors, 0 warnings, 0 section mismatches

--------------------------------------------------------------------------------
corgi_defconfig (arm, gcc-10) — PASS, 0 errors, 0 warnings, 0 section mismatches

--------------------------------------------------------------------------------
cu1000-neo_defconfig (mips, gcc-10) — PASS, 0 errors, 0 warnings, 0 section mismatches

--------------------------------------------------------------------------------
cu1830-neo_defconfig (mips, gcc-10) — PASS, 0 errors, 0 warnings, 0 section mismatches

--------------------------------------------------------------------------------
davinci_all_defconfig (arm, gcc-10) — PASS, 0 errors, 0 warnings, 0 section mismatches

--------------------------------------------------------------------------------
db1xxx_defconfig (mips, gcc-10) — PASS, 0 errors, 0 warnings, 0 section mismatches

--------------------------------------------------------------------------------
decstation_64_defconfig (mips, gcc-10) — PASS, 0 errors, 1 warning, 0 section mismatches

Warnings:
kernel/rcu/tasks.h:707:13: warning: ‘show_rcu_tasks_rude_gp_kthread’ defined but not used [-Wunused-function]

--------------------------------------------------------------------------------
decstation_defconfig (mips, gcc-10) — PASS, 0 errors, 1 warning, 0 section mismatches

Warnings:
kernel/rcu/tasks.h:707:13: warning: ‘show_rcu_tasks_rude_gp_kthread’ defined but not used [-Wunused-function]

--------------------------------------------------------------------------------
decstation_r4k_defconfig (mips, gcc-10) — PASS, 0 errors, 1 warning, 0 section mismatches

Warnings:
kernel/rcu/tasks.h:707:13: warning: ‘show_rcu_tasks_rude_gp_kthread’ defined but not used [-Wunused-function]

--------------------------------------------------------------------------------
defconfig (arm64, gcc-10) — PASS, 0 errors, 0 warnings, 0 section mismatches

--------------------------------------------------------------------------------
defconfig (riscv, gcc-10) — PASS, 0 errors, 0 warnings, 0 section mismatches

--------------------------------------------------------------------------------
defconfig+arm64-chromebook (arm64, gcc-10) — PASS, 0 errors, 0 warnings, 0 section mismatches

--------------------------------------------------------------------------------
defconfig+arm64-chromebook+kselftest (arm64, gcc-10) — PASS, 0 errors, 0 warnings, 0 section mismatches

--------------------------------------------------------------------------------
defconfig+kselftest (arm64, gcc-10) — PASS, 0 errors, 0 warnings, 0 section mismatches

--------------------------------------------------------------------------------
dove_defconfig (arm, gcc-10) — PASS, 0 errors, 0 warnings, 0 section mismatches

--------------------------------------------------------------------------------
e55_defconfig (mips, gcc-10) — PASS, 0 errors, 0 warnings, 0 section mismatches

--------------------------------------------------------------------------------
ebsa110_defconfig (arm, gcc-10) — PASS, 0 errors, 0 warnings, 0 section mismatches

--------------------------------------------------------------------------------
efm32_defconfig (arm, gcc-10) — PASS, 0 errors, 0 warnings, 0 section mismatches

--------------------------------------------------------------------------------
ep93xx_defconfig (arm, gcc-10) — PASS, 0 errors, 0 warnings, 0 section mismatches

--------------------------------------------------------------------------------
eseries_pxa_defconfig (arm, gcc-10) — PASS, 0 errors, 0 warnings, 0 section mismatches

--------------------------------------------------------------------------------
exynos_defconfig (arm, gcc-10) — PASS, 0 errors, 0 warnings, 0 section mismatches

--------------------------------------------------------------------------------
ezx_defconfig (arm, gcc-10) — PASS, 0 errors, 0 warnings, 0 section mismatches

--------------------------------------------------------------------------------
footbridge_defconfig (arm, gcc-10) — PASS, 0 errors, 0 warnings, 0 section mismatches

--------------------------------------------------------------------------------
fuloong2e_defconfig (mips, gcc-10) — PASS, 0 errors, 0 warnings, 0 section mismatches

--------------------------------------------------------------------------------
gcw0_defconfig (mips, gcc-10) — PASS, 0 errors, 0 warnings, 0 section mismatches

--------------------------------------------------------------------------------
gemini_defconfig (arm, gcc-10) — PASS, 0 errors, 0 warnings, 0 section mismatches

--------------------------------------------------------------------------------
gpr_defconfig (mips, gcc-10) — PASS, 0 errors, 0 warnings, 0 section mismatches

--------------------------------------------------------------------------------
h3600_defconfig (arm, gcc-10) — PASS, 0 errors, 0 warnings, 0 section mismatches

--------------------------------------------------------------------------------
h5000_defconfig (arm, gcc-10) — PASS, 0 errors, 0 warnings, 0 section mismatches

--------------------------------------------------------------------------------
hackkit_defconfig (arm, gcc-10) — PASS, 0 errors, 0 warnings, 0 section mismatches

--------------------------------------------------------------------------------
haps_hs_defconfig (arc, gcc-10) — PASS, 0 errors, 0 warnings, 0 section mismatches

--------------------------------------------------------------------------------
haps_hs_smp_defconfig (arc, gcc-10) — PASS, 0 errors, 0 warnings, 0 section mismatches

--------------------------------------------------------------------------------
hisi_defconfig (arm, gcc-10) — PASS, 0 errors, 0 warnings, 0 section mismatches

--------------------------------------------------------------------------------
hsdk_defconfig (arc, gcc-10) — PASS, 0 errors, 0 warnings, 0 section mismatches

--------------------------------------------------------------------------------
i386_defconfig (i386, gcc-10) — PASS, 0 errors, 0 warnings, 0 section mismatches

--------------------------------------------------------------------------------
imote2_defconfig (arm, gcc-10) — PASS, 0 errors, 0 warnings, 0 section mismatches

--------------------------------------------------------------------------------
imx_v4_v5_defconfig (arm, gcc-10) — PASS, 0 errors, 0 warnings, 0 section mismatches

--------------------------------------------------------------------------------
imx_v6_v7_defconfig (arm, gcc-10) — PASS, 0 errors, 0 warnings, 0 section mismatches

--------------------------------------------------------------------------------
integrator_defconfig (arm, gcc-10) — PASS, 0 errors, 0 warnings, 0 section mismatches

--------------------------------------------------------------------------------
iop32x_defconfig (arm, gcc-10) — PASS, 0 errors, 0 warnings, 0 section mismatches

--------------------------------------------------------------------------------
ip22_defconfig (mips, gcc-10) — PASS, 0 errors, 0 warnings, 0 section mismatches

--------------------------------------------------------------------------------
ip27_defconfig (mips, gcc-10) — FAIL, 0 errors, 0 warnings, 0 section mismatches

--------------------------------------------------------------------------------
ip28_defconfig (mips, gcc-10) — FAIL, 0 errors, 0 warnings, 0 section mismatches

--------------------------------------------------------------------------------
ip32_defconfig (mips, gcc-10) — PASS, 0 errors, 0 warnings, 0 section mismatches

--------------------------------------------------------------------------------
ixp4xx_defconfig (arm, gcc-10) — PASS, 0 errors, 0 warnings, 0 section mismatches

--------------------------------------------------------------------------------
jazz_defconfig (mips, gcc-10) — PASS, 0 errors, 0 warnings, 0 section mismatches

--------------------------------------------------------------------------------
jmr3927_defconfig (mips, gcc-10) — PASS, 0 errors, 0 warnings, 0 section mismatches

--------------------------------------------------------------------------------
jornada720_defconfig (arm, gcc-10) — PASS, 0 errors, 0 warnings, 0 section mismatches

--------------------------------------------------------------------------------
keystone_defconfig (arm, gcc-10) — PASS, 0 errors, 0 warnings, 0 section mismatches

--------------------------------------------------------------------------------
lart_defconfig (arm, gcc-10) — PASS, 0 errors, 0 warnings, 0 section mismatches

--------------------------------------------------------------------------------
lemote2f_defconfig (mips, gcc-10) — PASS, 0 errors, 1 warning, 0 section mismatches

Warnings:
net/mac80211/mlme.c:4328:1: warning: the frame size of 1040 bytes is larger than 1024 bytes [-Wframe-larger-than=]

--------------------------------------------------------------------------------
loongson1b_defconfig (mips, gcc-10) — PASS, 0 errors, 0 warnings, 0 section mismatches

--------------------------------------------------------------------------------
loongson1c_defconfig (mips, gcc-10) — PASS, 0 errors, 0 warnings, 0 section mismatches

--------------------------------------------------------------------------------
loongson3_defconfig (mips, gcc-10) — PASS, 0 errors, 0 warnings, 0 section mismatches

--------------------------------------------------------------------------------
lpc18xx_defconfig (arm, gcc-10) — PASS, 0 errors, 0 warnings, 0 section mismatches

--------------------------------------------------------------------------------
lpc32xx_defconfig (arm, gcc-10) — PASS, 0 errors, 0 warnings, 0 section mismatches

--------------------------------------------------------------------------------
lpd270_defconfig (arm, gcc-10) — PASS, 0 errors, 0 warnings, 0 section mismatches

--------------------------------------------------------------------------------
lubbock_defconfig (arm, gcc-10) — PASS, 0 errors, 0 warnings, 0 section mismatches

--------------------------------------------------------------------------------
magician_defconfig (arm, gcc-10) — PASS, 0 errors, 0 warnings, 0 section mismatches

--------------------------------------------------------------------------------
mainstone_defconfig (arm, gcc-10) — PASS, 0 errors, 0 warnings, 0 section mismatches

--------------------------------------------------------------------------------
malta_defconfig (mips, gcc-10) — PASS, 0 errors, 0 warnings, 0 section mismatches

--------------------------------------------------------------------------------
malta_kvm_defconfig (mips, gcc-10) — PASS, 0 errors, 0 warnings, 0 section mismatches

--------------------------------------------------------------------------------
malta_kvm_guest_defconfig (mips, gcc-10) — PASS, 0 errors, 0 warnings, 0 section mismatches

--------------------------------------------------------------------------------
malta_qemu_32r6_defconfig (mips, gcc-10) — PASS, 0 errors, 0 warnings, 0 section mismatches

--------------------------------------------------------------------------------
maltaaprp_defconfig (mips, gcc-10) — PASS, 0 errors, 0 warnings, 0 section mismatches

--------------------------------------------------------------------------------
maltasmvp_defconfig (mips, gcc-10) — PASS, 0 errors, 0 warnings, 0 section mismatches

--------------------------------------------------------------------------------
maltasmvp_eva_defconfig (mips, gcc-10) — PASS, 0 errors, 0 warnings, 0 section mismatches

--------------------------------------------------------------------------------
maltaup_defconfig (mips, gcc-10) — PASS, 0 errors, 0 warnings, 0 section mismatches

--------------------------------------------------------------------------------
maltaup_xpa_defconfig (mips, gcc-10) — PASS, 0 errors, 0 warnings, 0 section mismatches

--------------------------------------------------------------------------------
milbeaut_m10v_defconfig (arm, gcc-10) — PASS, 0 errors, 0 warnings, 0 section mismatches

--------------------------------------------------------------------------------
mini2440_defconfig (arm, gcc-10) — PASS, 0 errors, 0 warnings, 0 section mismatches

--------------------------------------------------------------------------------
mmp2_defconfig (arm, gcc-10) — PASS, 0 errors, 0 warnings, 0 section mismatches

--------------------------------------------------------------------------------
moxart_defconfig (arm, gcc-10) — PASS, 0 errors, 0 warnings, 0 section mismatches

--------------------------------------------------------------------------------
mpc30x_defconfig (mips, gcc-10) — PASS, 0 errors, 0 warnings, 0 section mismatches

--------------------------------------------------------------------------------
mps2_defconfig (arm, gcc-10) — PASS, 0 errors, 0 warnings, 0 section mismatches

--------------------------------------------------------------------------------
mtx1_defconfig (mips, gcc-10) — PASS, 0 errors, 0 warnings, 0 section mismatches

--------------------------------------------------------------------------------
multi_v4t_defconfig (arm, gcc-10) — PASS, 0 errors, 0 warnings, 0 section mismatches

--------------------------------------------------------------------------------
multi_v5_defconfig (arm, gcc-10) — PASS, 0 errors, 0 warnings, 0 section mismatches

--------------------------------------------------------------------------------
multi_v7_defconfig (arm, gcc-10) — PASS, 0 errors, 0 warnings, 0 section mismatches

--------------------------------------------------------------------------------
multi_v7_defconfig+kselftest (arm, gcc-10) — PASS, 0 errors, 0 warnings, 0 section mismatches

--------------------------------------------------------------------------------
mvebu_v5_defconfig (arm, gcc-10) — PASS, 0 errors, 0 warnings, 0 section mismatches

--------------------------------------------------------------------------------
mvebu_v7_defconfig (arm, gcc-10) — PASS, 0 errors, 0 warnings, 0 section mismatches

--------------------------------------------------------------------------------
mxs_defconfig (arm, gcc-10) — PASS, 0 errors, 0 warnings, 0 section mismatches

--------------------------------------------------------------------------------
neponset_defconfig (arm, gcc-10) — PASS, 0 errors, 0 warnings, 0 section mismatches

--------------------------------------------------------------------------------
netwinder_defconfig (arm, gcc-10) — PASS, 0 errors, 0 warnings, 0 section mismatches

--------------------------------------------------------------------------------
nhk8815_defconfig (arm, gcc-10) — PASS, 0 errors, 0 warnings, 0 section mismatches

--------------------------------------------------------------------------------
nlm_xlp_defconfig (mips, gcc-10) — PASS, 0 errors, 0 warnings, 0 section mismatches

--------------------------------------------------------------------------------
nlm_xlr_defconfig (mips, gcc-10) — PASS, 0 errors, 0 warnings, 0 section mismatches

--------------------------------------------------------------------------------
nommu_k210_defconfig (riscv, gcc-10) — PASS, 0 errors, 0 warnings, 0 section mismatches

--------------------------------------------------------------------------------
nsimosci_hs_defconfig (arc, gcc-10) — PASS, 0 errors, 0 warnings, 0 section mismatches

--------------------------------------------------------------------------------
nsimosci_hs_smp_defconfig (arc, gcc-10) — PASS, 0 errors, 0 warnings, 0 section mismatches

--------------------------------------------------------------------------------
omap1_defconfig (arm, gcc-10) — PASS, 0 errors, 0 warnings, 0 section mismatches

--------------------------------------------------------------------------------
omap2plus_defconfig (arm, gcc-10) — PASS, 0 errors, 0 warnings, 0 section mismatches

--------------------------------------------------------------------------------
omega2p_defconfig (mips, gcc-10) — PASS, 0 errors, 0 warnings, 0 section mismatches

--------------------------------------------------------------------------------
orion5x_defconfig (arm, gcc-10) — PASS, 0 errors, 0 warnings, 0 section mismatches

--------------------------------------------------------------------------------
oxnas_v6_defconfig (arm, gcc-10) — PASS, 0 errors, 0 warnings, 0 section mismatches

--------------------------------------------------------------------------------
palmz72_defconfig (arm, gcc-10) — PASS, 0 errors, 0 warnings, 0 section mismatches

--------------------------------------------------------------------------------
pcm027_defconfig (arm, gcc-10) — PASS, 0 errors, 0 warnings, 0 section mismatches

--------------------------------------------------------------------------------
pic32mzda_defconfig (mips, gcc-10) — PASS, 0 errors, 0 warnings, 0 section mismatches

--------------------------------------------------------------------------------
pistachio_defconfig (mips, gcc-10) — PASS, 0 errors, 0 warnings, 0 section mismatches

--------------------------------------------------------------------------------
pleb_defconfig (arm, gcc-10) — PASS, 0 errors, 0 warnings, 0 section mismatches

--------------------------------------------------------------------------------
prima2_defconfig (arm, gcc-10) — PASS, 0 errors, 0 warnings, 0 section mismatches

--------------------------------------------------------------------------------
pxa168_defconfig (arm, gcc-10) — PASS, 0 errors, 0 warnings, 0 section mismatches

--------------------------------------------------------------------------------
pxa255-idp_defconfig (arm, gcc-10) — PASS, 0 errors, 0 warnings, 0 section mismatches

--------------------------------------------------------------------------------
pxa3xx_defconfig (arm, gcc-10) — PASS, 0 errors, 0 warnings, 0 section mismatches

--------------------------------------------------------------------------------
pxa910_defconfig (arm, gcc-10) — PASS, 0 errors, 0 warnings, 0 section mismatches

--------------------------------------------------------------------------------
pxa_defconfig (arm, gcc-10) — PASS, 0 errors, 0 warnings, 0 section mismatches

--------------------------------------------------------------------------------
qcom_defconfig (arm, gcc-10) — PASS, 0 errors, 0 warnings, 0 section mismatches

--------------------------------------------------------------------------------
qi_lb60_defconfig (mips, gcc-10) — PASS, 0 errors, 0 warnings, 0 section mismatches

--------------------------------------------------------------------------------
rb532_defconfig (mips, gcc-10) — PASS, 0 errors, 0 warnings, 0 section mismatches

--------------------------------------------------------------------------------
rbtx49xx_defconfig (mips, gcc-10) — PASS, 0 errors, 0 warnings, 0 section mismatches

--------------------------------------------------------------------------------
realview_defconfig (arm, gcc-10) — PASS, 0 errors, 0 warnings, 0 section mismatches

--------------------------------------------------------------------------------
rm200_defconfig (mips, gcc-10) — PASS, 0 errors, 1 warning, 0 section mismatches

Warnings:
drivers/block/paride/bpck.c:32: warning: "PC" redefined

--------------------------------------------------------------------------------
rpc_defconfig (arm, gcc-10) — FAIL, 4 errors, 0 warnings, 0 section mismatches

Errors:
arm-linux-gnueabihf-gcc: error: unrecognized -march target: armv3m
arm-linux-gnueabihf-gcc: error: missing argument to ‘-march=’
arm-linux-gnueabihf-gcc: error: unrecognized -march target: armv3m
arm-linux-gnueabihf-gcc: error: missing argument to ‘-march=’

--------------------------------------------------------------------------------
rs90_defconfig (mips, gcc-10) — PASS, 0 errors, 0 warnings, 0 section mismatches

--------------------------------------------------------------------------------
rt305x_defconfig (mips, gcc-10) — PASS, 0 errors, 0 warnings, 0 section mismatches

--------------------------------------------------------------------------------
rv32_defconfig (riscv, gcc-10) — PASS, 0 errors, 4 warnings, 0 section mismatches

Warnings:
<stdin>:830:2: warning: #warning syscall fstat64 not implemented [-Wcpp]
<stdin>:1127:2: warning: #warning syscall fstatat64 not implemented [-Wcpp]
<stdin>:830:2: warning: #warning syscall fstat64 not implemented [-Wcpp]
<stdin>:1127:2: warning: #warning syscall fstatat64 not implemented [-Wcpp]

--------------------------------------------------------------------------------
s3c2410_defconfig (arm, gcc-10) — PASS, 0 errors, 0 warnings, 0 section mismatches

--------------------------------------------------------------------------------
s3c6400_defconfig (arm, gcc-10) — PASS, 0 errors, 0 warnings, 0 section mismatches

--------------------------------------------------------------------------------
s5pv210_defconfig (arm, gcc-10) — PASS, 0 errors, 0 warnings, 0 section mismatches

--------------------------------------------------------------------------------
sama5_defconfig (arm, gcc-10) — PASS, 0 errors, 0 warnings, 0 section mismatches

--------------------------------------------------------------------------------
sb1250_swarm_defconfig (mips, gcc-10) — PASS, 0 errors, 0 warnings, 0 section mismatches

--------------------------------------------------------------------------------
shannon_defconfig (arm, gcc-10) — PASS, 0 errors, 0 warnings, 0 section mismatches

--------------------------------------------------------------------------------
shmobile_defconfig (arm, gcc-10) — PASS, 0 errors, 0 warnings, 0 section mismatches

--------------------------------------------------------------------------------
simpad_defconfig (arm, gcc-10) — PASS, 0 errors, 0 warnings, 0 section mismatches

--------------------------------------------------------------------------------
socfpga_defconfig (arm, gcc-10) — PASS, 0 errors, 0 warnings, 0 section mismatches

--------------------------------------------------------------------------------
spear13xx_defconfig (arm, gcc-10) — PASS, 0 errors, 0 warnings, 0 section mismatches

--------------------------------------------------------------------------------
spear3xx_defconfig (arm, gcc-10) — PASS, 0 errors, 0 warnings, 0 section mismatches

--------------------------------------------------------------------------------
spear6xx_defconfig (arm, gcc-10) — PASS, 0 errors, 0 warnings, 0 section mismatches

--------------------------------------------------------------------------------
spitz_defconfig (arm, gcc-10) — PASS, 0 errors, 0 warnings, 0 section mismatches

--------------------------------------------------------------------------------
stm32_defconfig (arm, gcc-10) — PASS, 0 errors, 0 warnings, 0 section mismatches

--------------------------------------------------------------------------------
sunxi_defconfig (arm, gcc-10) — PASS, 0 errors, 0 warnings, 0 section mismatches

--------------------------------------------------------------------------------
tango4_defconfig (arm, gcc-10) — PASS, 0 errors, 0 warnings, 0 section mismatches

--------------------------------------------------------------------------------
tb0219_defconfig (mips, gcc-10) — PASS, 0 errors, 0 warnings, 0 section mismatches

--------------------------------------------------------------------------------
tb0226_defconfig (mips, gcc-10) — PASS, 0 errors, 0 warnings, 0 section mismatches

--------------------------------------------------------------------------------
tb0287_defconfig (mips, gcc-10) — PASS, 0 errors, 0 warnings, 0 section mismatches

--------------------------------------------------------------------------------
tct_hammer_defconfig (arm, gcc-10) — PASS, 0 errors, 0 warnings, 0 section mismatches

--------------------------------------------------------------------------------
tegra_defconfig (arm, gcc-10) — PASS, 0 errors, 0 warnings, 0 section mismatches

--------------------------------------------------------------------------------
tinyconfig (arc, gcc-10) — PASS, 0 errors, 0 warnings, 0 section mismatches

--------------------------------------------------------------------------------
tinyconfig (i386, gcc-10) — PASS, 0 errors, 0 warnings, 0 section mismatches

--------------------------------------------------------------------------------
tinyconfig (x86_64, gcc-10) — PASS, 0 errors, 0 warnings, 0 section mismatches

--------------------------------------------------------------------------------
trizeps4_defconfig (arm, gcc-10) — PASS, 0 errors, 0 warnings, 0 section mismatches

--------------------------------------------------------------------------------
u300_defconfig (arm, gcc-10) — PASS, 0 errors, 0 warnings, 0 section mismatches

--------------------------------------------------------------------------------
u8500_defconfig (arm, gcc-10) — PASS, 0 errors, 0 warnings, 0 section mismatches

--------------------------------------------------------------------------------
vdk_hs38_defconfig (arc, gcc-10) — PASS, 0 errors, 0 warnings, 0 section mismatches

--------------------------------------------------------------------------------
vdk_hs38_smp_defconfig (arc, gcc-10) — PASS, 0 errors, 0 warnings, 0 section mismatches

--------------------------------------------------------------------------------
versatile_defconfig (arm, gcc-10) — PASS, 0 errors, 0 warnings, 0 section mismatches

--------------------------------------------------------------------------------
vexpress_defconfig (arm, gcc-10) — PASS, 0 errors, 0 warnings, 0 section mismatches

--------------------------------------------------------------------------------
vf610m4_defconfig (arm, gcc-10) — PASS, 0 errors, 0 warnings, 0 section mismatches

--------------------------------------------------------------------------------
viper_defconfig (arm, gcc-10) — PASS, 0 errors, 0 warnings, 0 section mismatches

--------------------------------------------------------------------------------
vocore2_defconfig (mips, gcc-10) — PASS, 0 errors, 0 warnings, 0 section mismatches

--------------------------------------------------------------------------------
vt8500_v6_v7_defconfig (arm, gcc-10) — PASS, 0 errors, 0 warnings, 0 section mismatches

--------------------------------------------------------------------------------
workpad_defconfig (mips, gcc-10) — PASS, 0 errors, 0 warnings, 0 section mismatches

--------------------------------------------------------------------------------
x86_64_defconfig (x86_64, gcc-10) — PASS, 0 errors, 0 warnings, 0 section mismatches

--------------------------------------------------------------------------------
x86_64_defconfig+kselftest (x86_64, gcc-10) — PASS, 0 errors, 0 warnings, 0 section mismatches

--------------------------------------------------------------------------------
x86_64_defconfig+x86-chromebook (x86_64, gcc-10) — PASS, 0 errors, 0 warnings, 0 section mismatches

--------------------------------------------------------------------------------
x86_64_defconfig+x86-chromebook+kselftest (x86_64, gcc-10) — PASS, 0 errors, 0 warnings, 0 section mismatches

--------------------------------------------------------------------------------
xcep_defconfig (arm, gcc-10) — PASS, 0 errors, 0 warnings, 0 section mismatches

--------------------------------------------------------------------------------
zeus_defconfig (arm, gcc-10) — PASS, 0 errors, 0 warnings, 0 section mismatches

--------------------------------------------------------------------------------
zx_defconfig (arm, gcc-10) — PASS, 0 errors, 0 warnings, 0 section mismatches

---
For more info write to <info@kernelci.org>


Re: [PATCH 5.10.y-cip 00/61] Add Ethernet support to RZ/G2L

Pavel Machek
 

Hi!

This patch series adds Ethernet support to RZ/G2L SoC and enables ETH support
on RZ/G2L SMARC EVK.

All the patches have been cherry picked from v5.16-rc8.
Ok, this is really taking nice small steps. Thanks :-). You could help
reviewers a bit more by saying "no functional changes" when there are
none, but this was already very good job.

I could not find anything significant; each time issue was found it
was fixed in subsequent patches.

If there are no other comments, I'll run the tests and apply the
series.
Thank you, applied.

Best regards,
Pavel
--
DENX Software Engineering GmbH, Managing Director: Wolfgang Denk
HRB 165235 Munich, Office: Kirchenstr.5, D-82194 Groebenzell, Germany


cip/linux-5.10.y-cip sleep: 8 runs, 1 regressions (v5.10.83-cip1-89-ga7f9ee34265b) #kernelci

kernelci.org bot <bot@...>
 

cip/linux-5.10.y-cip sleep: 8 runs, 1 regressions (v5.10.83-cip1-89-ga7f9ee34265b)

Regressions Summary
-------------------

platform | arch | lab | compiler | defconfig | regressions
-------------------+--------+---------------+----------+------------------------------+------------
hp-11A-G6-EE-grunt | x86_64 | lab-collabora | gcc-10 | x86_64_defcon...6-chromebook | 1

Details: https://kernelci.org/test/job/cip/branch/linux-5.10.y-cip/kernel/v5.10.83-cip1-89-ga7f9ee34265b/plan/sleep/

Test: sleep
Tree: cip
Branch: linux-5.10.y-cip
Describe: v5.10.83-cip1-89-ga7f9ee34265b
URL: https://git.kernel.org/pub/scm/linux/kernel/git/cip/linux-cip.git
SHA: a7f9ee34265bcc306fd450f83524d631b74b6dbb


Test Regressions
----------------


platform | arch | lab | compiler | defconfig | regressions
-------------------+--------+---------------+----------+------------------------------+------------
hp-11A-G6-EE-grunt | x86_64 | lab-collabora | gcc-10 | x86_64_defcon...6-chromebook | 1

Details: https://kernelci.org/test/plan/id/61ddca78c82187ca29ef673e

Results: 21 PASS, 1 FAIL, 0 SKIP
Full config: x86_64_defconfig+x86-chromebook
Compiler: gcc-10 (gcc (Debian 10.2.1-6) 10.2.1 20210110)
Plain log: https://storage.kernelci.org//cip/linux-5.10.y-cip/v5.10.83-cip1-89-ga7f9ee34265b/x86_64/x86_64_defconfig+x86-chromebook/gcc-10/lab-collabora/sleep-hp-11A-G6-EE-grunt.txt
HTML log: https://storage.kernelci.org//cip/linux-5.10.y-cip/v5.10.83-cip1-89-ga7f9ee34265b/x86_64/x86_64_defconfig+x86-chromebook/gcc-10/lab-collabora/sleep-hp-11A-G6-EE-grunt.html
Rootfs: http://storage.kernelci.org/images/rootfs/debian/bullseye/20211224.1/amd64/rootfs.cpio.gz


* sleep.rtcwake-freeze-1: https://kernelci.org/test/case/id/61ddca78c82187ca29ef6749
failing since 16 days (last pass: v5.10.83-cip1-53-g2f788040f8b6, first fail: v5.10.83-cip1-74-g842fbb4554b8)

2022-01-11T18:19:25.131632 rtcwake: assuming RTC uses UTC ...
2022-01-11T18:19:25.138241 rtcwake: wakeup from \"freeze\" using rtc0 at Tue Jan 11 18:19:30 2022
2022-01-11T18:19:25.141693 <6>[ 30.746151] PM: suspend entry (deep)
2022-01-11T18:19:25.148639 <6>[ 30.751377] Filesystems sync: 0.000 seconds
2022-01-11T18:19:25.155096 <6>[ 30.755996] Freezing user space processes ... (elapsed 0.001 seconds) done.
2022-01-11T18:19:25.158451 <6>[ 30.764489] OOM killer disabled.
2022-01-11T18:19:26.223093 <6>[ 30.767974] Freezing remaining freezable tasks ... (elapsed 1.055 seconds) done.
2022-01-11T18:19:26.229740 <6>[ 31.831235] printk: Suspending console(s) (use no_console_suspend to debug)
2022-01-11T18:19:26.338676
2022-01-11T18:19:26.339246
... (1151 line(s) more)


cip/linux-5.10.y-cip baseline-nfs: 23 runs, 1 regressions (v5.10.83-cip1-89-ga7f9ee34265b) #kernelci

kernelci.org bot <bot@...>
 

cip/linux-5.10.y-cip baseline-nfs: 23 runs, 1 regressions (v5.10.83-cip1-89-ga7f9ee34265b)

Regressions Summary
-------------------

platform | arch | lab | compiler | defconfig | regressions
--------------------+-------+--------------+----------+-----------+------------
r8a77950-salvator-x | arm64 | lab-baylibre | gcc-10 | defconfig | 1

Details: https://kernelci.org/test/job/cip/branch/linux-5.10.y-cip/kernel/v5.10.83-cip1-89-ga7f9ee34265b/plan/baseline-nfs/

Test: baseline-nfs
Tree: cip
Branch: linux-5.10.y-cip
Describe: v5.10.83-cip1-89-ga7f9ee34265b
URL: https://git.kernel.org/pub/scm/linux/kernel/git/cip/linux-cip.git
SHA: a7f9ee34265bcc306fd450f83524d631b74b6dbb


Test Regressions
----------------


platform | arch | lab | compiler | defconfig | regressions
--------------------+-------+--------------+----------+-----------+------------
r8a77950-salvator-x | arm64 | lab-baylibre | gcc-10 | defconfig | 1

Details: https://kernelci.org/test/plan/id/61ddcb9507b26652b6ef6767

Results: 0 PASS, 1 FAIL, 0 SKIP
Full config: defconfig
Compiler: gcc-10 (aarch64-linux-gnu-gcc (Debian 10.2.1-6) 10.2.1 20210110)
Plain log: https://storage.kernelci.org//cip/linux-5.10.y-cip/v5.10.83-cip1-89-ga7f9ee34265b/arm64/defconfig/gcc-10/lab-baylibre/baseline-nfs-r8a77950-salvator-x.txt
HTML log: https://storage.kernelci.org//cip/linux-5.10.y-cip/v5.10.83-cip1-89-ga7f9ee34265b/arm64/defconfig/gcc-10/lab-baylibre/baseline-nfs-r8a77950-salvator-x.html
Rootfs: http://storage.kernelci.org/images/rootfs/debian/bullseye/20211224.1/arm64/initrd.cpio.gz


* baseline-nfs.login: https://kernelci.org/test/case/id/61ddcb9507b26652b6ef6768
new failure (last pass: v5.10.83-cip1-74-g842fbb4554b8)


cip/linux-5.10.y-cip build: 190 builds: 3 failed, 187 passed, 4 errors, 10 warnings (v5.10.83-cip1-89-ga7f9ee34265b) #kernelci

kernelci.org bot <bot@...>
 

cip/linux-5.10.y-cip build: 190 builds: 3 failed, 187 passed, 4 errors, 10 warnings (v5.10.83-cip1-89-ga7f9ee34265b)

Full Build Summary: https://kernelci.org/build/cip/branch/linux-5.10.y-cip/kernel/v5.10.83-cip1-89-ga7f9ee34265b/

Tree: cip
Branch: linux-5.10.y-cip
Git Describe: v5.10.83-cip1-89-ga7f9ee34265b
Git Commit: a7f9ee34265bcc306fd450f83524d631b74b6dbb
Git URL: https://git.kernel.org/pub/scm/linux/kernel/git/cip/linux-cip.git
Built: 7 unique architectures

Build Failures Detected:

arm:
rpc_defconfig: (gcc-10) FAIL

mips:
ip27_defconfig: (gcc-10) FAIL
ip28_defconfig: (gcc-10) FAIL

Errors and Warnings Detected:

arc:

arm64:

arm:
rpc_defconfig (gcc-10): 4 errors

i386:

mips:
32r2el_defconfig (gcc-10): 1 warning
decstation_64_defconfig (gcc-10): 1 warning
decstation_defconfig (gcc-10): 1 warning
decstation_r4k_defconfig (gcc-10): 1 warning
lemote2f_defconfig (gcc-10): 1 warning
rm200_defconfig (gcc-10): 1 warning

riscv:
rv32_defconfig (gcc-10): 4 warnings

x86_64:

Errors summary:

2 arm-linux-gnueabihf-gcc: error: unrecognized -march target: armv3m
2 arm-linux-gnueabihf-gcc: error: missing argument to ‘-march=’

Warnings summary:

3 kernel/rcu/tasks.h:707:13: warning: ‘show_rcu_tasks_rude_gp_kthread’ defined but not used [-Wunused-function]
2 <stdin>:830:2: warning: #warning syscall fstat64 not implemented [-Wcpp]
2 <stdin>:1127:2: warning: #warning syscall fstatat64 not implemented [-Wcpp]
1 net/mac80211/mlme.c:4328:1: warning: the frame size of 1040 bytes is larger than 1024 bytes [-Wframe-larger-than=]
1 drivers/block/paride/bpck.c:32: warning: "PC" redefined
1 WARNING: modpost: Symbol info of vmlinux is missing. Unresolved symbol check will be entirely skipped.

================================================================================

Detailed per-defconfig build reports:

--------------------------------------------------------------------------------
32r2el_defconfig (mips, gcc-10) — PASS, 0 errors, 1 warning, 0 section mismatches

Warnings:
WARNING: modpost: Symbol info of vmlinux is missing. Unresolved symbol check will be entirely skipped.

--------------------------------------------------------------------------------
allnoconfig (i386, gcc-10) — PASS, 0 errors, 0 warnings, 0 section mismatches

--------------------------------------------------------------------------------
allnoconfig (x86_64, gcc-10) — PASS, 0 errors, 0 warnings, 0 section mismatches

--------------------------------------------------------------------------------
allnoconfig (arc, gcc-10) — PASS, 0 errors, 0 warnings, 0 section mismatches

--------------------------------------------------------------------------------
am200epdkit_defconfig (arm, gcc-10) — PASS, 0 errors, 0 warnings, 0 section mismatches

--------------------------------------------------------------------------------
ar7_defconfig (mips, gcc-10) — PASS, 0 errors, 0 warnings, 0 section mismatches

--------------------------------------------------------------------------------
aspeed_g4_defconfig (arm, gcc-10) — PASS, 0 errors, 0 warnings, 0 section mismatches

--------------------------------------------------------------------------------
aspeed_g5_defconfig (arm, gcc-10) — PASS, 0 errors, 0 warnings, 0 section mismatches

--------------------------------------------------------------------------------
assabet_defconfig (arm, gcc-10) — PASS, 0 errors, 0 warnings, 0 section mismatches

--------------------------------------------------------------------------------
at91_dt_defconfig (arm, gcc-10) — PASS, 0 errors, 0 warnings, 0 section mismatches

--------------------------------------------------------------------------------
ath25_defconfig (mips, gcc-10) — PASS, 0 errors, 0 warnings, 0 section mismatches

--------------------------------------------------------------------------------
ath79_defconfig (mips, gcc-10) — PASS, 0 errors, 0 warnings, 0 section mismatches

--------------------------------------------------------------------------------
axm55xx_defconfig (arm, gcc-10) — PASS, 0 errors, 0 warnings, 0 section mismatches

--------------------------------------------------------------------------------
axs103_defconfig (arc, gcc-10) — PASS, 0 errors, 0 warnings, 0 section mismatches

--------------------------------------------------------------------------------
axs103_smp_defconfig (arc, gcc-10) — PASS, 0 errors, 0 warnings, 0 section mismatches

--------------------------------------------------------------------------------
badge4_defconfig (arm, gcc-10) — PASS, 0 errors, 0 warnings, 0 section mismatches

--------------------------------------------------------------------------------
bcm2835_defconfig (arm, gcc-10) — PASS, 0 errors, 0 warnings, 0 section mismatches

--------------------------------------------------------------------------------
bcm47xx_defconfig (mips, gcc-10) — PASS, 0 errors, 0 warnings, 0 section mismatches

--------------------------------------------------------------------------------
bcm63xx_defconfig (mips, gcc-10) — PASS, 0 errors, 0 warnings, 0 section mismatches

--------------------------------------------------------------------------------
bigsur_defconfig (mips, gcc-10) — PASS, 0 errors, 0 warnings, 0 section mismatches

--------------------------------------------------------------------------------
bmips_be_defconfig (mips, gcc-10) — PASS, 0 errors, 0 warnings, 0 section mismatches

--------------------------------------------------------------------------------
bmips_stb_defconfig (mips, gcc-10) — PASS, 0 errors, 0 warnings, 0 section mismatches

--------------------------------------------------------------------------------
capcella_defconfig (mips, gcc-10) — PASS, 0 errors, 0 warnings, 0 section mismatches

--------------------------------------------------------------------------------
cavium_octeon_defconfig (mips, gcc-10) — PASS, 0 errors, 0 warnings, 0 section mismatches

--------------------------------------------------------------------------------
cerfcube_defconfig (arm, gcc-10) — PASS, 0 errors, 0 warnings, 0 section mismatches

--------------------------------------------------------------------------------
ci20_defconfig (mips, gcc-10) — PASS, 0 errors, 0 warnings, 0 section mismatches

--------------------------------------------------------------------------------
cm_x300_defconfig (arm, gcc-10) — PASS, 0 errors, 0 warnings, 0 section mismatches

--------------------------------------------------------------------------------
cobalt_defconfig (mips, gcc-10) — PASS, 0 errors, 0 warnings, 0 section mismatches

--------------------------------------------------------------------------------
colibri_pxa270_defconfig (arm, gcc-10) — PASS, 0 errors, 0 warnings, 0 section mismatches

--------------------------------------------------------------------------------
colibri_pxa300_defconfig (arm, gcc-10) — PASS, 0 errors, 0 warnings, 0 section mismatches

--------------------------------------------------------------------------------
collie_defconfig (arm, gcc-10) — PASS, 0 errors, 0 warnings, 0 section mismatches

--------------------------------------------------------------------------------
corgi_defconfig (arm, gcc-10) — PASS, 0 errors, 0 warnings, 0 section mismatches

--------------------------------------------------------------------------------
cu1000-neo_defconfig (mips, gcc-10) — PASS, 0 errors, 0 warnings, 0 section mismatches

--------------------------------------------------------------------------------
cu1830-neo_defconfig (mips, gcc-10) — PASS, 0 errors, 0 warnings, 0 section mismatches

--------------------------------------------------------------------------------
davinci_all_defconfig (arm, gcc-10) — PASS, 0 errors, 0 warnings, 0 section mismatches

--------------------------------------------------------------------------------
db1xxx_defconfig (mips, gcc-10) — PASS, 0 errors, 0 warnings, 0 section mismatches

--------------------------------------------------------------------------------
decstation_64_defconfig (mips, gcc-10) — PASS, 0 errors, 1 warning, 0 section mismatches

Warnings:
kernel/rcu/tasks.h:707:13: warning: ‘show_rcu_tasks_rude_gp_kthread’ defined but not used [-Wunused-function]

--------------------------------------------------------------------------------
decstation_defconfig (mips, gcc-10) — PASS, 0 errors, 1 warning, 0 section mismatches

Warnings:
kernel/rcu/tasks.h:707:13: warning: ‘show_rcu_tasks_rude_gp_kthread’ defined but not used [-Wunused-function]

--------------------------------------------------------------------------------
decstation_r4k_defconfig (mips, gcc-10) — PASS, 0 errors, 1 warning, 0 section mismatches

Warnings:
kernel/rcu/tasks.h:707:13: warning: ‘show_rcu_tasks_rude_gp_kthread’ defined but not used [-Wunused-function]

--------------------------------------------------------------------------------
defconfig (riscv, gcc-10) — PASS, 0 errors, 0 warnings, 0 section mismatches

--------------------------------------------------------------------------------
defconfig (arm64, gcc-10) — PASS, 0 errors, 0 warnings, 0 section mismatches

--------------------------------------------------------------------------------
defconfig+arm64-chromebook (arm64, gcc-10) — PASS, 0 errors, 0 warnings, 0 section mismatches

--------------------------------------------------------------------------------
defconfig+arm64-chromebook+kselftest (arm64, gcc-10) — PASS, 0 errors, 0 warnings, 0 section mismatches

--------------------------------------------------------------------------------
defconfig+kselftest (arm64, gcc-10) — PASS, 0 errors, 0 warnings, 0 section mismatches

--------------------------------------------------------------------------------
dove_defconfig (arm, gcc-10) — PASS, 0 errors, 0 warnings, 0 section mismatches

--------------------------------------------------------------------------------
e55_defconfig (mips, gcc-10) — PASS, 0 errors, 0 warnings, 0 section mismatches

--------------------------------------------------------------------------------
ebsa110_defconfig (arm, gcc-10) — PASS, 0 errors, 0 warnings, 0 section mismatches

--------------------------------------------------------------------------------
efm32_defconfig (arm, gcc-10) — PASS, 0 errors, 0 warnings, 0 section mismatches

--------------------------------------------------------------------------------
ep93xx_defconfig (arm, gcc-10) — PASS, 0 errors, 0 warnings, 0 section mismatches

--------------------------------------------------------------------------------
eseries_pxa_defconfig (arm, gcc-10) — PASS, 0 errors, 0 warnings, 0 section mismatches

--------------------------------------------------------------------------------
exynos_defconfig (arm, gcc-10) — PASS, 0 errors, 0 warnings, 0 section mismatches

--------------------------------------------------------------------------------
ezx_defconfig (arm, gcc-10) — PASS, 0 errors, 0 warnings, 0 section mismatches

--------------------------------------------------------------------------------
footbridge_defconfig (arm, gcc-10) — PASS, 0 errors, 0 warnings, 0 section mismatches

--------------------------------------------------------------------------------
fuloong2e_defconfig (mips, gcc-10) — PASS, 0 errors, 0 warnings, 0 section mismatches

--------------------------------------------------------------------------------
gcw0_defconfig (mips, gcc-10) — PASS, 0 errors, 0 warnings, 0 section mismatches

--------------------------------------------------------------------------------
gemini_defconfig (arm, gcc-10) — PASS, 0 errors, 0 warnings, 0 section mismatches

--------------------------------------------------------------------------------
gpr_defconfig (mips, gcc-10) — PASS, 0 errors, 0 warnings, 0 section mismatches

--------------------------------------------------------------------------------
h3600_defconfig (arm, gcc-10) — PASS, 0 errors, 0 warnings, 0 section mismatches

--------------------------------------------------------------------------------
h5000_defconfig (arm, gcc-10) — PASS, 0 errors, 0 warnings, 0 section mismatches

--------------------------------------------------------------------------------
hackkit_defconfig (arm, gcc-10) — PASS, 0 errors, 0 warnings, 0 section mismatches

--------------------------------------------------------------------------------
haps_hs_defconfig (arc, gcc-10) — PASS, 0 errors, 0 warnings, 0 section mismatches

--------------------------------------------------------------------------------
haps_hs_smp_defconfig (arc, gcc-10) — PASS, 0 errors, 0 warnings, 0 section mismatches

--------------------------------------------------------------------------------
hisi_defconfig (arm, gcc-10) — PASS, 0 errors, 0 warnings, 0 section mismatches

--------------------------------------------------------------------------------
hsdk_defconfig (arc, gcc-10) — PASS, 0 errors, 0 warnings, 0 section mismatches

--------------------------------------------------------------------------------
i386_defconfig (i386, gcc-10) — PASS, 0 errors, 0 warnings, 0 section mismatches

--------------------------------------------------------------------------------
imote2_defconfig (arm, gcc-10) — PASS, 0 errors, 0 warnings, 0 section mismatches

--------------------------------------------------------------------------------
imx_v4_v5_defconfig (arm, gcc-10) — PASS, 0 errors, 0 warnings, 0 section mismatches

--------------------------------------------------------------------------------
imx_v6_v7_defconfig (arm, gcc-10) — PASS, 0 errors, 0 warnings, 0 section mismatches

--------------------------------------------------------------------------------
integrator_defconfig (arm, gcc-10) — PASS, 0 errors, 0 warnings, 0 section mismatches

--------------------------------------------------------------------------------
iop32x_defconfig (arm, gcc-10) — PASS, 0 errors, 0 warnings, 0 section mismatches

--------------------------------------------------------------------------------
ip22_defconfig (mips, gcc-10) — PASS, 0 errors, 0 warnings, 0 section mismatches

--------------------------------------------------------------------------------
ip27_defconfig (mips, gcc-10) — FAIL, 0 errors, 0 warnings, 0 section mismatches

--------------------------------------------------------------------------------
ip28_defconfig (mips, gcc-10) — FAIL, 0 errors, 0 warnings, 0 section mismatches

--------------------------------------------------------------------------------
ip32_defconfig (mips, gcc-10) — PASS, 0 errors, 0 warnings, 0 section mismatches

--------------------------------------------------------------------------------
ixp4xx_defconfig (arm, gcc-10) — PASS, 0 errors, 0 warnings, 0 section mismatches

--------------------------------------------------------------------------------
jazz_defconfig (mips, gcc-10) — PASS, 0 errors, 0 warnings, 0 section mismatches

--------------------------------------------------------------------------------
jmr3927_defconfig (mips, gcc-10) — PASS, 0 errors, 0 warnings, 0 section mismatches

--------------------------------------------------------------------------------
jornada720_defconfig (arm, gcc-10) — PASS, 0 errors, 0 warnings, 0 section mismatches

--------------------------------------------------------------------------------
keystone_defconfig (arm, gcc-10) — PASS, 0 errors, 0 warnings, 0 section mismatches

--------------------------------------------------------------------------------
lart_defconfig (arm, gcc-10) — PASS, 0 errors, 0 warnings, 0 section mismatches

--------------------------------------------------------------------------------
lemote2f_defconfig (mips, gcc-10) — PASS, 0 errors, 1 warning, 0 section mismatches

Warnings:
net/mac80211/mlme.c:4328:1: warning: the frame size of 1040 bytes is larger than 1024 bytes [-Wframe-larger-than=]

--------------------------------------------------------------------------------
loongson1b_defconfig (mips, gcc-10) — PASS, 0 errors, 0 warnings, 0 section mismatches

--------------------------------------------------------------------------------
loongson1c_defconfig (mips, gcc-10) — PASS, 0 errors, 0 warnings, 0 section mismatches

--------------------------------------------------------------------------------
loongson3_defconfig (mips, gcc-10) — PASS, 0 errors, 0 warnings, 0 section mismatches

--------------------------------------------------------------------------------
lpc18xx_defconfig (arm, gcc-10) — PASS, 0 errors, 0 warnings, 0 section mismatches

--------------------------------------------------------------------------------
lpc32xx_defconfig (arm, gcc-10) — PASS, 0 errors, 0 warnings, 0 section mismatches

--------------------------------------------------------------------------------
lpd270_defconfig (arm, gcc-10) — PASS, 0 errors, 0 warnings, 0 section mismatches

--------------------------------------------------------------------------------
lubbock_defconfig (arm, gcc-10) — PASS, 0 errors, 0 warnings, 0 section mismatches

--------------------------------------------------------------------------------
magician_defconfig (arm, gcc-10) — PASS, 0 errors, 0 warnings, 0 section mismatches

--------------------------------------------------------------------------------
mainstone_defconfig (arm, gcc-10) — PASS, 0 errors, 0 warnings, 0 section mismatches

--------------------------------------------------------------------------------
malta_defconfig (mips, gcc-10) — PASS, 0 errors, 0 warnings, 0 section mismatches

--------------------------------------------------------------------------------
malta_kvm_defconfig (mips, gcc-10) — PASS, 0 errors, 0 warnings, 0 section mismatches

--------------------------------------------------------------------------------
malta_kvm_guest_defconfig (mips, gcc-10) — PASS, 0 errors, 0 warnings, 0 section mismatches

--------------------------------------------------------------------------------
malta_qemu_32r6_defconfig (mips, gcc-10) — PASS, 0 errors, 0 warnings, 0 section mismatches

--------------------------------------------------------------------------------
maltaaprp_defconfig (mips, gcc-10) — PASS, 0 errors, 0 warnings, 0 section mismatches

--------------------------------------------------------------------------------
maltasmvp_defconfig (mips, gcc-10) — PASS, 0 errors, 0 warnings, 0 section mismatches

--------------------------------------------------------------------------------
maltasmvp_eva_defconfig (mips, gcc-10) — PASS, 0 errors, 0 warnings, 0 section mismatches

--------------------------------------------------------------------------------
maltaup_defconfig (mips, gcc-10) — PASS, 0 errors, 0 warnings, 0 section mismatches

--------------------------------------------------------------------------------
maltaup_xpa_defconfig (mips, gcc-10) — PASS, 0 errors, 0 warnings, 0 section mismatches

--------------------------------------------------------------------------------
milbeaut_m10v_defconfig (arm, gcc-10) — PASS, 0 errors, 0 warnings, 0 section mismatches

--------------------------------------------------------------------------------
mini2440_defconfig (arm, gcc-10) — PASS, 0 errors, 0 warnings, 0 section mismatches

--------------------------------------------------------------------------------
mmp2_defconfig (arm, gcc-10) — PASS, 0 errors, 0 warnings, 0 section mismatches

--------------------------------------------------------------------------------
moxart_defconfig (arm, gcc-10) — PASS, 0 errors, 0 warnings, 0 section mismatches

--------------------------------------------------------------------------------
mpc30x_defconfig (mips, gcc-10) — PASS, 0 errors, 0 warnings, 0 section mismatches

--------------------------------------------------------------------------------
mps2_defconfig (arm, gcc-10) — PASS, 0 errors, 0 warnings, 0 section mismatches

--------------------------------------------------------------------------------
mtx1_defconfig (mips, gcc-10) — PASS, 0 errors, 0 warnings, 0 section mismatches

--------------------------------------------------------------------------------
multi_v4t_defconfig (arm, gcc-10) — PASS, 0 errors, 0 warnings, 0 section mismatches

--------------------------------------------------------------------------------
multi_v5_defconfig (arm, gcc-10) — PASS, 0 errors, 0 warnings, 0 section mismatches

--------------------------------------------------------------------------------
multi_v7_defconfig (arm, gcc-10) — PASS, 0 errors, 0 warnings, 0 section mismatches

--------------------------------------------------------------------------------
multi_v7_defconfig+kselftest (arm, gcc-10) — PASS, 0 errors, 0 warnings, 0 section mismatches

--------------------------------------------------------------------------------
mvebu_v5_defconfig (arm, gcc-10) — PASS, 0 errors, 0 warnings, 0 section mismatches

--------------------------------------------------------------------------------
mvebu_v7_defconfig (arm, gcc-10) — PASS, 0 errors, 0 warnings, 0 section mismatches

--------------------------------------------------------------------------------
mxs_defconfig (arm, gcc-10) — PASS, 0 errors, 0 warnings, 0 section mismatches

--------------------------------------------------------------------------------
neponset_defconfig (arm, gcc-10) — PASS, 0 errors, 0 warnings, 0 section mismatches

--------------------------------------------------------------------------------
netwinder_defconfig (arm, gcc-10) — PASS, 0 errors, 0 warnings, 0 section mismatches

--------------------------------------------------------------------------------
nhk8815_defconfig (arm, gcc-10) — PASS, 0 errors, 0 warnings, 0 section mismatches

--------------------------------------------------------------------------------
nlm_xlp_defconfig (mips, gcc-10) — PASS, 0 errors, 0 warnings, 0 section mismatches

--------------------------------------------------------------------------------
nlm_xlr_defconfig (mips, gcc-10) — PASS, 0 errors, 0 warnings, 0 section mismatches

--------------------------------------------------------------------------------
nommu_k210_defconfig (riscv, gcc-10) — PASS, 0 errors, 0 warnings, 0 section mismatches

--------------------------------------------------------------------------------
nsimosci_hs_defconfig (arc, gcc-10) — PASS, 0 errors, 0 warnings, 0 section mismatches

--------------------------------------------------------------------------------
nsimosci_hs_smp_defconfig (arc, gcc-10) — PASS, 0 errors, 0 warnings, 0 section mismatches

--------------------------------------------------------------------------------
omap1_defconfig (arm, gcc-10) — PASS, 0 errors, 0 warnings, 0 section mismatches

--------------------------------------------------------------------------------
omap2plus_defconfig (arm, gcc-10) — PASS, 0 errors, 0 warnings, 0 section mismatches

--------------------------------------------------------------------------------
omega2p_defconfig (mips, gcc-10) — PASS, 0 errors, 0 warnings, 0 section mismatches

--------------------------------------------------------------------------------
orion5x_defconfig (arm, gcc-10) — PASS, 0 errors, 0 warnings, 0 section mismatches

--------------------------------------------------------------------------------
oxnas_v6_defconfig (arm, gcc-10) — PASS, 0 errors, 0 warnings, 0 section mismatches

--------------------------------------------------------------------------------
palmz72_defconfig (arm, gcc-10) — PASS, 0 errors, 0 warnings, 0 section mismatches

--------------------------------------------------------------------------------
pcm027_defconfig (arm, gcc-10) — PASS, 0 errors, 0 warnings, 0 section mismatches

--------------------------------------------------------------------------------
pic32mzda_defconfig (mips, gcc-10) — PASS, 0 errors, 0 warnings, 0 section mismatches

--------------------------------------------------------------------------------
pistachio_defconfig (mips, gcc-10) — PASS, 0 errors, 0 warnings, 0 section mismatches

--------------------------------------------------------------------------------
pleb_defconfig (arm, gcc-10) — PASS, 0 errors, 0 warnings, 0 section mismatches

--------------------------------------------------------------------------------
prima2_defconfig (arm, gcc-10) — PASS, 0 errors, 0 warnings, 0 section mismatches

--------------------------------------------------------------------------------
pxa168_defconfig (arm, gcc-10) — PASS, 0 errors, 0 warnings, 0 section mismatches

--------------------------------------------------------------------------------
pxa255-idp_defconfig (arm, gcc-10) — PASS, 0 errors, 0 warnings, 0 section mismatches

--------------------------------------------------------------------------------
pxa3xx_defconfig (arm, gcc-10) — PASS, 0 errors, 0 warnings, 0 section mismatches

--------------------------------------------------------------------------------
pxa910_defconfig (arm, gcc-10) — PASS, 0 errors, 0 warnings, 0 section mismatches

--------------------------------------------------------------------------------
pxa_defconfig (arm, gcc-10) — PASS, 0 errors, 0 warnings, 0 section mismatches

--------------------------------------------------------------------------------
qcom_defconfig (arm, gcc-10) — PASS, 0 errors, 0 warnings, 0 section mismatches

--------------------------------------------------------------------------------
qi_lb60_defconfig (mips, gcc-10) — PASS, 0 errors, 0 warnings, 0 section mismatches

--------------------------------------------------------------------------------
rb532_defconfig (mips, gcc-10) — PASS, 0 errors, 0 warnings, 0 section mismatches

--------------------------------------------------------------------------------
rbtx49xx_defconfig (mips, gcc-10) — PASS, 0 errors, 0 warnings, 0 section mismatches

--------------------------------------------------------------------------------
realview_defconfig (arm, gcc-10) — PASS, 0 errors, 0 warnings, 0 section mismatches

--------------------------------------------------------------------------------
rm200_defconfig (mips, gcc-10) — PASS, 0 errors, 1 warning, 0 section mismatches

Warnings:
drivers/block/paride/bpck.c:32: warning: "PC" redefined

--------------------------------------------------------------------------------
rpc_defconfig (arm, gcc-10) — FAIL, 4 errors, 0 warnings, 0 section mismatches

Errors:
arm-linux-gnueabihf-gcc: error: unrecognized -march target: armv3m
arm-linux-gnueabihf-gcc: error: missing argument to ‘-march=’
arm-linux-gnueabihf-gcc: error: unrecognized -march target: armv3m
arm-linux-gnueabihf-gcc: error: missing argument to ‘-march=’

--------------------------------------------------------------------------------
rs90_defconfig (mips, gcc-10) — PASS, 0 errors, 0 warnings, 0 section mismatches

--------------------------------------------------------------------------------
rt305x_defconfig (mips, gcc-10) — PASS, 0 errors, 0 warnings, 0 section mismatches

--------------------------------------------------------------------------------
rv32_defconfig (riscv, gcc-10) — PASS, 0 errors, 4 warnings, 0 section mismatches

Warnings:
<stdin>:830:2: warning: #warning syscall fstat64 not implemented [-Wcpp]
<stdin>:1127:2: warning: #warning syscall fstatat64 not implemented [-Wcpp]
<stdin>:830:2: warning: #warning syscall fstat64 not implemented [-Wcpp]
<stdin>:1127:2: warning: #warning syscall fstatat64 not implemented [-Wcpp]

--------------------------------------------------------------------------------
s3c2410_defconfig (arm, gcc-10) — PASS, 0 errors, 0 warnings, 0 section mismatches

--------------------------------------------------------------------------------
s3c6400_defconfig (arm, gcc-10) — PASS, 0 errors, 0 warnings, 0 section mismatches

--------------------------------------------------------------------------------
s5pv210_defconfig (arm, gcc-10) — PASS, 0 errors, 0 warnings, 0 section mismatches

--------------------------------------------------------------------------------
sama5_defconfig (arm, gcc-10) — PASS, 0 errors, 0 warnings, 0 section mismatches

--------------------------------------------------------------------------------
sb1250_swarm_defconfig (mips, gcc-10) — PASS, 0 errors, 0 warnings, 0 section mismatches

--------------------------------------------------------------------------------
shannon_defconfig (arm, gcc-10) — PASS, 0 errors, 0 warnings, 0 section mismatches

--------------------------------------------------------------------------------
shmobile_defconfig (arm, gcc-10) — PASS, 0 errors, 0 warnings, 0 section mismatches

--------------------------------------------------------------------------------
simpad_defconfig (arm, gcc-10) — PASS, 0 errors, 0 warnings, 0 section mismatches

--------------------------------------------------------------------------------
socfpga_defconfig (arm, gcc-10) — PASS, 0 errors, 0 warnings, 0 section mismatches

--------------------------------------------------------------------------------
spear13xx_defconfig (arm, gcc-10) — PASS, 0 errors, 0 warnings, 0 section mismatches

--------------------------------------------------------------------------------
spear3xx_defconfig (arm, gcc-10) — PASS, 0 errors, 0 warnings, 0 section mismatches

--------------------------------------------------------------------------------
spear6xx_defconfig (arm, gcc-10) — PASS, 0 errors, 0 warnings, 0 section mismatches

--------------------------------------------------------------------------------
spitz_defconfig (arm, gcc-10) — PASS, 0 errors, 0 warnings, 0 section mismatches

--------------------------------------------------------------------------------
stm32_defconfig (arm, gcc-10) — PASS, 0 errors, 0 warnings, 0 section mismatches

--------------------------------------------------------------------------------
sunxi_defconfig (arm, gcc-10) — PASS, 0 errors, 0 warnings, 0 section mismatches

--------------------------------------------------------------------------------
tango4_defconfig (arm, gcc-10) — PASS, 0 errors, 0 warnings, 0 section mismatches

--------------------------------------------------------------------------------
tb0219_defconfig (mips, gcc-10) — PASS, 0 errors, 0 warnings, 0 section mismatches

--------------------------------------------------------------------------------
tb0226_defconfig (mips, gcc-10) — PASS, 0 errors, 0 warnings, 0 section mismatches

--------------------------------------------------------------------------------
tb0287_defconfig (mips, gcc-10) — PASS, 0 errors, 0 warnings, 0 section mismatches

--------------------------------------------------------------------------------
tct_hammer_defconfig (arm, gcc-10) — PASS, 0 errors, 0 warnings, 0 section mismatches

--------------------------------------------------------------------------------
tegra_defconfig (arm, gcc-10) — PASS, 0 errors, 0 warnings, 0 section mismatches

--------------------------------------------------------------------------------
tinyconfig (i386, gcc-10) — PASS, 0 errors, 0 warnings, 0 section mismatches

--------------------------------------------------------------------------------
tinyconfig (arc, gcc-10) — PASS, 0 errors, 0 warnings, 0 section mismatches

--------------------------------------------------------------------------------
tinyconfig (x86_64, gcc-10) — PASS, 0 errors, 0 warnings, 0 section mismatches

--------------------------------------------------------------------------------
trizeps4_defconfig (arm, gcc-10) — PASS, 0 errors, 0 warnings, 0 section mismatches

--------------------------------------------------------------------------------
u300_defconfig (arm, gcc-10) — PASS, 0 errors, 0 warnings, 0 section mismatches

--------------------------------------------------------------------------------
u8500_defconfig (arm, gcc-10) — PASS, 0 errors, 0 warnings, 0 section mismatches

--------------------------------------------------------------------------------
vdk_hs38_defconfig (arc, gcc-10) — PASS, 0 errors, 0 warnings, 0 section mismatches

--------------------------------------------------------------------------------
vdk_hs38_smp_defconfig (arc, gcc-10) — PASS, 0 errors, 0 warnings, 0 section mismatches

--------------------------------------------------------------------------------
versatile_defconfig (arm, gcc-10) — PASS, 0 errors, 0 warnings, 0 section mismatches

--------------------------------------------------------------------------------
vexpress_defconfig (arm, gcc-10) — PASS, 0 errors, 0 warnings, 0 section mismatches

--------------------------------------------------------------------------------
vf610m4_defconfig (arm, gcc-10) — PASS, 0 errors, 0 warnings, 0 section mismatches

--------------------------------------------------------------------------------
viper_defconfig (arm, gcc-10) — PASS, 0 errors, 0 warnings, 0 section mismatches

--------------------------------------------------------------------------------
vocore2_defconfig (mips, gcc-10) — PASS, 0 errors, 0 warnings, 0 section mismatches

--------------------------------------------------------------------------------
vt8500_v6_v7_defconfig (arm, gcc-10) — PASS, 0 errors, 0 warnings, 0 section mismatches

--------------------------------------------------------------------------------
workpad_defconfig (mips, gcc-10) — PASS, 0 errors, 0 warnings, 0 section mismatches

--------------------------------------------------------------------------------
x86_64_defconfig (x86_64, gcc-10) — PASS, 0 errors, 0 warnings, 0 section mismatches

--------------------------------------------------------------------------------
x86_64_defconfig+kselftest (x86_64, gcc-10) — PASS, 0 errors, 0 warnings, 0 section mismatches

--------------------------------------------------------------------------------
x86_64_defconfig+x86-chromebook (x86_64, gcc-10) — PASS, 0 errors, 0 warnings, 0 section mismatches

--------------------------------------------------------------------------------
x86_64_defconfig+x86-chromebook+kselftest (x86_64, gcc-10) — PASS, 0 errors, 0 warnings, 0 section mismatches

--------------------------------------------------------------------------------
xcep_defconfig (arm, gcc-10) — PASS, 0 errors, 0 warnings, 0 section mismatches

--------------------------------------------------------------------------------
zeus_defconfig (arm, gcc-10) — PASS, 0 errors, 0 warnings, 0 section mismatches

--------------------------------------------------------------------------------
zx_defconfig (arm, gcc-10) — PASS, 0 errors, 0 warnings, 0 section mismatches

---
For more info write to <info@kernelci.org>


Re: [PATCH 4.19.y-cip 1/6] Backport netfilter: nf_tables: autoload modules from the abort path

Pavel Machek
 

Hi!

Is there reason not to submit it to stable? You are describing it is
as a bugfix, and Greg takes those. [Advantages are a) community
review, b) less patches to maintain for us, c) bug fixed for everyone,
not just us].
I will submit the patches to stable.
Thank you. The patches look good to me. You may want to include sha1
hash on the first line of changelog as

[ Upstream commit c1833c3964d5bd8c163bd4e01736a38bc473cb8a ]

...as that's what's usually used in stable AFAICT. If they apply to
more than one -stable version, you should mention that. Feel free to
Cc me.

Thanks and best regards,
Pavel
--
DENX Software Engineering GmbH, Managing Director: Wolfgang Denk
HRB 165235 Munich, Office: Kirchenstr.5, D-82194 Groebenzell, Germany


Re: [PATCH 4.19.y-cip 1/6] Backport netfilter: nf_tables: autoload modules from the abort path

Fong, Amy
 

On Tue, Jan 11, 2022 at 10:02:18AM +0100, Pavel Machek wrote:
Hi!
Ok, let me take a look at the series. But... could you provide some
kind of explanation of what these are and why you want them in -cip?

These are not usual "hardware enablement" patches...
0/6 email was not part of the thread, so I missed it in the first
look.

I see it fixes sysbot report.

Do you have special loads where you are hitting these netfilter
problems? Are similar fixes needed in 4.4 / 5.10?
Would it make sense to get it fixed in -stable kernels?
We haven't been able to reproduce the issue but apparently it's being reproduced
periodically.

The offending patch doesn't appear in linux-4.4.y-cip
linux-5.10.y-cip has the fix already.

Both patches were introduced in 5.5.0-rc5
Thank you for answers.

Is there reason not to submit it to stable? You are describing it is
as a bugfix, and Greg takes those. [Advantages are a) community
review, b) less patches to maintain for us, c) bug fixed for everyone,
not just us].

Best regards,

Pavel
--
DENX Software Engineering GmbH, Managing Director: Wolfgang Denk
HRB 165235 Munich, Office: Kirchenstr.5, D-82194 Groebenzell, Germany
I will submit the patches to stable.

Thanks.
Amy


Re: [PATCH 5.10.y-cip 00/61] Add Ethernet support to RZ/G2L

Pavel Machek
 

Hi!

This patch series adds Ethernet support to RZ/G2L SoC and enables ETH support
on RZ/G2L SMARC EVK.

All the patches have been cherry picked from v5.16-rc8.
Ok, this is really taking nice small steps. Thanks :-). You could help
reviewers a bit more by saying "no functional changes" when there are
none, but this was already very good job.

I could not find anything significant; each time issue was found it
was fixed in subsequent patches.

If there are no other comments, I'll run the tests and apply the
series.

Best regards,
Pavel
--
DENX Software Engineering GmbH, Managing Director: Wolfgang Denk
HRB 165235 Munich, Office: Kirchenstr.5, D-82194 Groebenzell, Germany


Re: Inserting patch into history was Re: [PATCH v2 5.10.y-cip 15/15] clk: renesas: r9a07g044: Mark IA55_CLK and DMAC_ACLK critical

Pavel Machek
 

Hi!

Subject: Inserting patch into history was Re: [PATCH v2 5.10.y-cip 15/15]
clk: renesas: r9a07g044: Mark IA55_CLK and DMAC_ACLK critical

Hi!

Is it possible to rearrange this patch before [1] and after [2]?

[1]
https://git.kernel.org/pub/scm/linux/kernel/git/cip/linux-cip.git/comm
it/?h=linux-5.10.y-cip&id=dcbef66029571fbada7522b2db0790e5ff054c66

[2]https://git.kernel.org/pub/scm/linux/kernel/git/cip/linux-cip.git/c
ommit/?h=linux-5.10.y-cip&id=e2568c0c7de565a5688544907422ca470844df87
Wow.

It means changing history. We usually try to avoid that, as it will cause
problems for people using git head. But we did not yet do a release with
those commits, so it is not completely out of question.
I thought it is simple.

Since we haven't made any release, history modification and force pushing is not required,
as this patch will be part of upcoming release.
Ok, good. Patches passed testing (zynqmp board has problems but they
are not kernel related) and I have pushed them.

Best regards,
Pavel
--
DENX Software Engineering GmbH, Managing Director: Wolfgang Denk
HRB 165235 Munich, Office: Kirchenstr.5, D-82194 Groebenzell, Germany


Re: [PATCH 4.19.y-cip 1/6] Backport netfilter: nf_tables: autoload modules from the abort path

Pavel Machek
 

Hi!
Ok, let me take a look at the series. But... could you provide some
kind of explanation of what these are and why you want them in -cip?

These are not usual "hardware enablement" patches...
0/6 email was not part of the thread, so I missed it in the first
look.

I see it fixes sysbot report.

Do you have special loads where you are hitting these netfilter
problems? Are similar fixes needed in 4.4 / 5.10?
Would it make sense to get it fixed in -stable kernels?
We haven't been able to reproduce the issue but apparently it's being reproduced
periodically.

The offending patch doesn't appear in linux-4.4.y-cip
linux-5.10.y-cip has the fix already.

Both patches were introduced in 5.5.0-rc5
Thank you for answers.

Is there reason not to submit it to stable? You are describing it is
as a bugfix, and Greg takes those. [Advantages are a) community
review, b) less patches to maintain for us, c) bug fixed for everyone,
not just us].

Best regards,

Pavel
--
DENX Software Engineering GmbH, Managing Director: Wolfgang Denk
HRB 165235 Munich, Office: Kirchenstr.5, D-82194 Groebenzell, Germany


Re: [PATCH 4.19.y-cip 1/6] Backport netfilter: nf_tables: autoload modules from the abort path

Fong, Amy
 

On Mon, Jan 10, 2022 at 07:06:35PM +0100, Pavel Machek wrote:
Hi!

Ok, let me take a look at the series. But... could you provide some
kind of explanation of what these are and why you want them in -cip?

These are not usual "hardware enablement" patches...
0/6 email was not part of the thread, so I missed it in the first
look.

I see it fixes sysbot report.

Do you have special loads where you are hitting these netfilter
problems? Are similar fixes needed in 4.4 / 5.10?
Would it make sense to get it fixed in -stable kernels?

Best regards,
Pavel
--
DENX Software Engineering GmbH, Managing Director: Wolfgang Denk
HRB 165235 Munich, Office: Kirchenstr.5, D-82194 Groebenzell, Germany
We haven't been able to reproduce the issue but apparently it's being reproduced
periodically.

The offending patch doesn't appear in linux-4.4.y-cip
linux-5.10.y-cip has the fix already.

Both patches were introduced in 5.5.0-rc5

Thanks.
Amy


Re: Inserting patch into history was Re: [PATCH v2 5.10.y-cip 15/15] clk: renesas: r9a07g044: Mark IA55_CLK and DMAC_ACLK critical

Biju Das <biju.das.jz@...>
 

Hi Pavel,

Thanks for the feedback.

Subject: Inserting patch into history was Re: [PATCH v2 5.10.y-cip 15/15]
clk: renesas: r9a07g044: Mark IA55_CLK and DMAC_ACLK critical

Hi!

Is it possible to rearrange this patch before [1] and after [2]?

[1]
https://git.kernel.org/pub/scm/linux/kernel/git/cip/linux-cip.git/comm
it/?h=linux-5.10.y-cip&id=dcbef66029571fbada7522b2db0790e5ff054c66

[2]https://git.kernel.org/pub/scm/linux/kernel/git/cip/linux-cip.git/c
ommit/?h=linux-5.10.y-cip&id=e2568c0c7de565a5688544907422ca470844df87
Wow.

It means changing history. We usually try to avoid that, as it will cause
problems for people using git head. But we did not yet do a release with
those commits, so it is not completely out of question.
I thought it is simple.

Since we haven't made any release, history modification and force pushing is not required,
as this patch will be part of upcoming release.


How important is that?
Some how this patch, becomes out of order from our internal huge cherry-picked patchset from mainline,
which we use for testing before posting to ML.

It will stop booting after[1], without this.

Any way, this patch is going to be part of upcoming release. So History modification and
Force pushing is not required.

Regards,
Biju

At the very least I'll need to know that rest of
the kernel team is okay with it.

commit e2568c0c7de565a5688544907422ca470844df87
Author: Biju Das <biju.das.jz@bp.renesas.com>
Date: Mon Dec 20 13:31:30 2021 +0000

commit dcbef66029571fbada7522b2db0790e5ff054c66
Author: Biju Das <biju.das.jz@bp.renesas.com>
Date: Thu Dec 16 12:54:46 2021 +0000

clk: renesas: rzg2l: Fix clk status function

Best regards,
Pavel
--
DENX Software Engineering GmbH, Managing Director: Wolfgang Denk
HRB 165235 Munich, Office: Kirchenstr.5, D-82194 Groebenzell, Germany


Re: Inserting patch into history was Re: [PATCH v2 5.10.y-cip 15/15] clk: renesas: r9a07g044: Mark IA55_CLK and DMAC_ACLK critical

Jan Kiszka
 

On 10.01.22 19:33, Pavel Machek wrote:
Hi!

Is it possible to rearrange this patch before [1] and after [2]?

[1] https://git.kernel.org/pub/scm/linux/kernel/git/cip/linux-cip.git/commit/?h=linux-5.10.y-cip&id=dcbef66029571fbada7522b2db0790e5ff054c66

[2]https://git.kernel.org/pub/scm/linux/kernel/git/cip/linux-cip.git/commit/?h=linux-5.10.y-cip&id=e2568c0c7de565a5688544907422ca470844df87
Wow.
It means changing history. We usually try to avoid that, as it will
cause problems for people using git head. But we did not yet do a
release with those commits, so it is not completely out of question.
How important is that? At the very least I'll need to know that rest
of the kernel team is okay with it.
commit e2568c0c7de565a5688544907422ca470844df87
Author: Biju Das <biju.das.jz@bp.renesas.com>
Date: Mon Dec 20 13:31:30 2021 +0000
commit dcbef66029571fbada7522b2db0790e5ff054c66
Author: Biju Das <biju.das.jz@bp.renesas.com>
Date: Thu Dec 16 12:54:46 2021 +0000
clk: renesas: rzg2l: Fix clk status function
Best regards,
Pavel
Patch application in unfortunate order is a very common issue in upstream: dependencies are missed, patches take different routes through different maintainer trees, bugs get fixed only after the patch was applied. In none of these cases, a maintainer did a force-push so far (to my best knowledge), why should CIP do that?

Jan

--
Siemens AG, Technology
Competence Center Embedded Linux


Re: [PATCH v2 5.10.y-cip 00/15] Add ADC/CANFD/IIC support for RZ/G2L

Pavel Machek
 

Hi!

This patch series adds Sound and ADC support for Renesas RZ/G2L SoC
and enables RIIC/SOUND/CANFD/ADC on Renesas SMARC EVK.

I have also included the missing driver patch for riic and kernel configs.

All the patches have been cherry picked from v5.16-rc7.

I have created a MR [0] for cip-kernel-config to support build testing and
can be merged once this patch series is accepted.

Note: I have kept the clock related patches for audio as this will avoid
conflicts with the later patches.
Series looks okay to me. I did not test it but I assume it will pass.

I can test/apply it quickly if history modification and force push is
not required. I'd like confirmation from rest of the team before
inserting commit into history.

Best regards,
Pavel
--
DENX Software Engineering GmbH, Managing Director: Wolfgang Denk
HRB 165235 Munich, Office: Kirchenstr.5, D-82194 Groebenzell, Germany


Inserting patch into history was Re: [PATCH v2 5.10.y-cip 15/15] clk: renesas: r9a07g044: Mark IA55_CLK and DMAC_ACLK critical

Pavel Machek
 

Hi!

Is it possible to rearrange this patch before [1] and after [2]?

[1] https://git.kernel.org/pub/scm/linux/kernel/git/cip/linux-cip.git/commit/?h=linux-5.10.y-cip&id=dcbef66029571fbada7522b2db0790e5ff054c66

[2]https://git.kernel.org/pub/scm/linux/kernel/git/cip/linux-cip.git/commit/?h=linux-5.10.y-cip&id=e2568c0c7de565a5688544907422ca470844df87
Wow.

It means changing history. We usually try to avoid that, as it will
cause problems for people using git head. But we did not yet do a
release with those commits, so it is not completely out of question.

How important is that? At the very least I'll need to know that rest
of the kernel team is okay with it.

commit e2568c0c7de565a5688544907422ca470844df87
Author: Biju Das <biju.das.jz@bp.renesas.com>
Date: Mon Dec 20 13:31:30 2021 +0000

commit dcbef66029571fbada7522b2db0790e5ff054c66
Author: Biju Das <biju.das.jz@bp.renesas.com>
Date: Thu Dec 16 12:54:46 2021 +0000

clk: renesas: rzg2l: Fix clk status function

Best regards,
Pavel
--
DENX Software Engineering GmbH, Managing Director: Wolfgang Denk
HRB 165235 Munich, Office: Kirchenstr.5, D-82194 Groebenzell, Germany

61 - 80 of 7514