Date   

cip-gitlab/ci/pavel/linux-test ltp-timers: 7 runs, 5 regressions (v4.4-st5-297-gc0d53c2a5c03d) #kernelci

kernelci.org bot <bot@...>
 

cip-gitlab/ci/pavel/linux-test ltp-timers: 7 runs, 5 regressions (v4.4-st5-297-gc0d53c2a5c03d)

Regressions Summary
-------------------

platform | arch | lab | compiler | defconfig | regressions
--------------------------+--------+---------------+----------+------------------------------+------------
asus-C433TA-AJ0005-rammus | x86_64 | lab-collabora | gcc-10 | x86_64_defcon...6-chromebook | 1
asus-C436FA-Flip-hatch | x86_64 | lab-collabora | gcc-10 | x86_64_defcon...6-chromebook | 1
asus-C523NA-A20057-coral | x86_64 | lab-collabora | gcc-10 | x86_64_defcon...6-chromebook | 1
hp-11A-G6-EE-grunt | x86_64 | lab-collabora | gcc-10 | x86_64_defcon...6-chromebook | 1
rk3288-veyron-jaq | arm | lab-collabora | gcc-10 | multi_v7_defconfig | 1

Details: https://kernelci.org/test/job/cip-gitlab/branch/ci%2Fpavel%2Flinux-test/kernel/v4.4-st5-297-gc0d53c2a5c03d/plan/ltp-timers/

Test: ltp-timers
Tree: cip-gitlab
Branch: ci/pavel/linux-test
Describe: v4.4-st5-297-gc0d53c2a5c03d
URL: https://gitlab.com/cip-project/cip-kernel/linux-cip.git
SHA: c0d53c2a5c03d0b2672a56140f211b51b3e047c1

Test suite revisions:
ltp-tests
URL: https://github.com/linux-test-project/ltp.git
SHA: 17e9ae697a340242c49188ace12a60cd3bc95a53


Test Regressions
----------------


platform | arch | lab | compiler | defconfig | regressions
--------------------------+--------+---------------+----------+------------------------------+------------
asus-C433TA-AJ0005-rammus | x86_64 | lab-collabora | gcc-10 | x86_64_defcon...6-chromebook | 1

Details: https://kernelci.org/test/plan/id/62937976903f0eaf0aa39bcd

Results: 0 PASS, 1 FAIL, 0 SKIP
Full config: x86_64_defconfig+x86-chromebook
Compiler: gcc-10 (gcc (Debian 10.2.1-6) 10.2.1 20210110)
Plain log: https://storage.kernelci.org//cip-gitlab/ci-pavel-linux-test/v4.4-st5-297-gc0d53c2a5c03d/x86_64/x86_64_defconfig+x86-chromebook/gcc-10/lab-collabora/ltp-timers-asus-C433TA-AJ0005-rammus.txt
HTML log: https://storage.kernelci.org//cip-gitlab/ci-pavel-linux-test/v4.4-st5-297-gc0d53c2a5c03d/x86_64/x86_64_defconfig+x86-chromebook/gcc-10/lab-collabora/ltp-timers-asus-C433TA-AJ0005-rammus.html
Rootfs: http://storage.kernelci.org/images/rootfs/debian/bullseye-ltp/20220513.0/amd64/initrd.cpio.gz


* ltp-timers.login: https://kernelci.org/test/case/id/62937976903f0eaf0aa39bce
new failure (last pass: v5.10.112-cip6)



platform | arch | lab | compiler | defconfig | regressions
--------------------------+--------+---------------+----------+------------------------------+------------
asus-C436FA-Flip-hatch | x86_64 | lab-collabora | gcc-10 | x86_64_defcon...6-chromebook | 1

Details: https://kernelci.org/test/plan/id/62937c507eb080f440a39bda

Results: 0 PASS, 1 FAIL, 0 SKIP
Full config: x86_64_defconfig+x86-chromebook
Compiler: gcc-10 (gcc (Debian 10.2.1-6) 10.2.1 20210110)
Plain log: https://storage.kernelci.org//cip-gitlab/ci-pavel-linux-test/v4.4-st5-297-gc0d53c2a5c03d/x86_64/x86_64_defconfig+x86-chromebook/gcc-10/lab-collabora/ltp-timers-asus-C436FA-Flip-hatch.txt
HTML log: https://storage.kernelci.org//cip-gitlab/ci-pavel-linux-test/v4.4-st5-297-gc0d53c2a5c03d/x86_64/x86_64_defconfig+x86-chromebook/gcc-10/lab-collabora/ltp-timers-asus-C436FA-Flip-hatch.html
Rootfs: http://storage.kernelci.org/images/rootfs/debian/bullseye-ltp/20220513.0/amd64/initrd.cpio.gz


* ltp-timers.login: https://kernelci.org/test/case/id/62937c507eb080f440a39bdb
new failure (last pass: v5.10.112-cip6)



platform | arch | lab | compiler | defconfig | regressions
--------------------------+--------+---------------+----------+------------------------------+------------
asus-C523NA-A20057-coral | x86_64 | lab-collabora | gcc-10 | x86_64_defcon...6-chromebook | 1

Details: https://kernelci.org/test/plan/id/62937a59c2cbec76d8a39bda

Results: 0 PASS, 1 FAIL, 0 SKIP
Full config: x86_64_defconfig+x86-chromebook
Compiler: gcc-10 (gcc (Debian 10.2.1-6) 10.2.1 20210110)
Plain log: https://storage.kernelci.org//cip-gitlab/ci-pavel-linux-test/v4.4-st5-297-gc0d53c2a5c03d/x86_64/x86_64_defconfig+x86-chromebook/gcc-10/lab-collabora/ltp-timers-asus-C523NA-A20057-coral.txt
HTML log: https://storage.kernelci.org//cip-gitlab/ci-pavel-linux-test/v4.4-st5-297-gc0d53c2a5c03d/x86_64/x86_64_defconfig+x86-chromebook/gcc-10/lab-collabora/ltp-timers-asus-C523NA-A20057-coral.html
Rootfs: http://storage.kernelci.org/images/rootfs/debian/bullseye-ltp/20220513.0/amd64/initrd.cpio.gz


* ltp-timers.login: https://kernelci.org/test/case/id/62937a59c2cbec76d8a39bdb
new failure (last pass: v5.10.112-cip6)



platform | arch | lab | compiler | defconfig | regressions
--------------------------+--------+---------------+----------+------------------------------+------------
hp-11A-G6-EE-grunt | x86_64 | lab-collabora | gcc-10 | x86_64_defcon...6-chromebook | 1

Details: https://kernelci.org/test/plan/id/6293798f12fa5a0a8ba39bcf

Results: 0 PASS, 1 FAIL, 0 SKIP
Full config: x86_64_defconfig+x86-chromebook
Compiler: gcc-10 (gcc (Debian 10.2.1-6) 10.2.1 20210110)
Plain log: https://storage.kernelci.org//cip-gitlab/ci-pavel-linux-test/v4.4-st5-297-gc0d53c2a5c03d/x86_64/x86_64_defconfig+x86-chromebook/gcc-10/lab-collabora/ltp-timers-hp-11A-G6-EE-grunt.txt
HTML log: https://storage.kernelci.org//cip-gitlab/ci-pavel-linux-test/v4.4-st5-297-gc0d53c2a5c03d/x86_64/x86_64_defconfig+x86-chromebook/gcc-10/lab-collabora/ltp-timers-hp-11A-G6-EE-grunt.html
Rootfs: http://storage.kernelci.org/images/rootfs/debian/bullseye-ltp/20220513.0/amd64/initrd.cpio.gz


* ltp-timers.login: https://kernelci.org/test/case/id/6293798f12fa5a0a8ba39bd0
new failure (last pass: v5.10.112-cip6)



platform | arch | lab | compiler | defconfig | regressions
--------------------------+--------+---------------+----------+------------------------------+------------
rk3288-veyron-jaq | arm | lab-collabora | gcc-10 | multi_v7_defconfig | 1

Details: https://kernelci.org/test/plan/id/62937ac1cf2dfaea3ba39be1

Results: 0 PASS, 1 FAIL, 0 SKIP
Full config: multi_v7_defconfig
Compiler: gcc-10 (arm-linux-gnueabihf-gcc (Debian 10.2.1-6) 10.2.1 20210110)
Plain log: https://storage.kernelci.org//cip-gitlab/ci-pavel-linux-test/v4.4-st5-297-gc0d53c2a5c03d/arm/multi_v7_defconfig/gcc-10/lab-collabora/ltp-timers-rk3288-veyron-jaq.txt
HTML log: https://storage.kernelci.org//cip-gitlab/ci-pavel-linux-test/v4.4-st5-297-gc0d53c2a5c03d/arm/multi_v7_defconfig/gcc-10/lab-collabora/ltp-timers-rk3288-veyron-jaq.html
Rootfs: http://storage.kernelci.org/images/rootfs/debian/bullseye-ltp/20220513.0/armhf/initrd.cpio.gz


* ltp-timers.login: https://kernelci.org/test/case/id/62937ac1cf2dfaea3ba39be2
new failure (last pass: v5.10.112-cip6)


cip-gitlab/ci/pavel/linux-test ltp-mm: 4 runs, 4 regressions (v4.4-st5-297-gc0d53c2a5c03d) #kernelci

kernelci.org bot <bot@...>
 

cip-gitlab/ci/pavel/linux-test ltp-mm: 4 runs, 4 regressions (v4.4-st5-297-gc0d53c2a5c03d)

Regressions Summary
-------------------

platform | arch | lab | compiler | defconfig | regressions
--------------------------+--------+---------------+----------+------------------------------+------------
asus-C436FA-Flip-hatch | x86_64 | lab-collabora | gcc-10 | x86_64_defcon...6-chromebook | 1
asus-C523NA-A20057-coral | x86_64 | lab-collabora | gcc-10 | x86_64_defcon...6-chromebook | 1
hp-11A-G6-EE-grunt | x86_64 | lab-collabora | gcc-10 | x86_64_defcon...6-chromebook | 1
hp-x360-12b-n4000-octopus | x86_64 | lab-collabora | gcc-10 | x86_64_defcon...6-chromebook | 1

Details: https://kernelci.org/test/job/cip-gitlab/branch/ci%2Fpavel%2Flinux-test/kernel/v4.4-st5-297-gc0d53c2a5c03d/plan/ltp-mm/

Test: ltp-mm
Tree: cip-gitlab
Branch: ci/pavel/linux-test
Describe: v4.4-st5-297-gc0d53c2a5c03d
URL: https://gitlab.com/cip-project/cip-kernel/linux-cip.git
SHA: c0d53c2a5c03d0b2672a56140f211b51b3e047c1

Test suite revisions:
ltp-tests
URL: https://github.com/linux-test-project/ltp.git
SHA: 17e9ae697a340242c49188ace12a60cd3bc95a53


Test Regressions
----------------


platform | arch | lab | compiler | defconfig | regressions
--------------------------+--------+---------------+----------+------------------------------+------------
asus-C436FA-Flip-hatch | x86_64 | lab-collabora | gcc-10 | x86_64_defcon...6-chromebook | 1

Details: https://kernelci.org/test/plan/id/62937a941d3b5a920ba39bd1

Results: 0 PASS, 1 FAIL, 0 SKIP
Full config: x86_64_defconfig+x86-chromebook
Compiler: gcc-10 (gcc (Debian 10.2.1-6) 10.2.1 20210110)
Plain log: https://storage.kernelci.org//cip-gitlab/ci-pavel-linux-test/v4.4-st5-297-gc0d53c2a5c03d/x86_64/x86_64_defconfig+x86-chromebook/gcc-10/lab-collabora/ltp-mm-asus-C436FA-Flip-hatch.txt
HTML log: https://storage.kernelci.org//cip-gitlab/ci-pavel-linux-test/v4.4-st5-297-gc0d53c2a5c03d/x86_64/x86_64_defconfig+x86-chromebook/gcc-10/lab-collabora/ltp-mm-asus-C436FA-Flip-hatch.html
Rootfs: http://storage.kernelci.org/images/rootfs/debian/bullseye-ltp/20220513.0/amd64/initrd.cpio.gz


* ltp-mm.login: https://kernelci.org/test/case/id/62937a941d3b5a920ba39bd2
new failure (last pass: v5.10.112-cip6)



platform | arch | lab | compiler | defconfig | regressions
--------------------------+--------+---------------+----------+------------------------------+------------
asus-C523NA-A20057-coral | x86_64 | lab-collabora | gcc-10 | x86_64_defcon...6-chromebook | 1

Details: https://kernelci.org/test/plan/id/62937992903f0eaf0aa39be3

Results: 0 PASS, 1 FAIL, 0 SKIP
Full config: x86_64_defconfig+x86-chromebook
Compiler: gcc-10 (gcc (Debian 10.2.1-6) 10.2.1 20210110)
Plain log: https://storage.kernelci.org//cip-gitlab/ci-pavel-linux-test/v4.4-st5-297-gc0d53c2a5c03d/x86_64/x86_64_defconfig+x86-chromebook/gcc-10/lab-collabora/ltp-mm-asus-C523NA-A20057-coral.txt
HTML log: https://storage.kernelci.org//cip-gitlab/ci-pavel-linux-test/v4.4-st5-297-gc0d53c2a5c03d/x86_64/x86_64_defconfig+x86-chromebook/gcc-10/lab-collabora/ltp-mm-asus-C523NA-A20057-coral.html
Rootfs: http://storage.kernelci.org/images/rootfs/debian/bullseye-ltp/20220513.0/amd64/initrd.cpio.gz


* ltp-mm.login: https://kernelci.org/test/case/id/62937993903f0eaf0aa39be4
new failure (last pass: v5.10.112-cip6)



platform | arch | lab | compiler | defconfig | regressions
--------------------------+--------+---------------+----------+------------------------------+------------
hp-11A-G6-EE-grunt | x86_64 | lab-collabora | gcc-10 | x86_64_defcon...6-chromebook | 1

Details: https://kernelci.org/test/plan/id/629379b22c990460eea39bec

Results: 0 PASS, 1 FAIL, 0 SKIP
Full config: x86_64_defconfig+x86-chromebook
Compiler: gcc-10 (gcc (Debian 10.2.1-6) 10.2.1 20210110)
Plain log: https://storage.kernelci.org//cip-gitlab/ci-pavel-linux-test/v4.4-st5-297-gc0d53c2a5c03d/x86_64/x86_64_defconfig+x86-chromebook/gcc-10/lab-collabora/ltp-mm-hp-11A-G6-EE-grunt.txt
HTML log: https://storage.kernelci.org//cip-gitlab/ci-pavel-linux-test/v4.4-st5-297-gc0d53c2a5c03d/x86_64/x86_64_defconfig+x86-chromebook/gcc-10/lab-collabora/ltp-mm-hp-11A-G6-EE-grunt.html
Rootfs: http://storage.kernelci.org/images/rootfs/debian/bullseye-ltp/20220513.0/amd64/initrd.cpio.gz


* ltp-mm.login: https://kernelci.org/test/case/id/629379b22c990460eea39bed
new failure (last pass: v5.10.112-cip6)



platform | arch | lab | compiler | defconfig | regressions
--------------------------+--------+---------------+----------+------------------------------+------------
hp-x360-12b-n4000-octopus | x86_64 | lab-collabora | gcc-10 | x86_64_defcon...6-chromebook | 1

Details: https://kernelci.org/test/plan/id/62937aa31d3b5a920ba39be8

Results: 0 PASS, 1 FAIL, 0 SKIP
Full config: x86_64_defconfig+x86-chromebook
Compiler: gcc-10 (gcc (Debian 10.2.1-6) 10.2.1 20210110)
Plain log: https://storage.kernelci.org//cip-gitlab/ci-pavel-linux-test/v4.4-st5-297-gc0d53c2a5c03d/x86_64/x86_64_defconfig+x86-chromebook/gcc-10/lab-collabora/ltp-mm-hp-x360-12b-n4000-octopus.txt
HTML log: https://storage.kernelci.org//cip-gitlab/ci-pavel-linux-test/v4.4-st5-297-gc0d53c2a5c03d/x86_64/x86_64_defconfig+x86-chromebook/gcc-10/lab-collabora/ltp-mm-hp-x360-12b-n4000-octopus.html
Rootfs: http://storage.kernelci.org/images/rootfs/debian/bullseye-ltp/20220513.0/amd64/initrd.cpio.gz


* ltp-mm.login: https://kernelci.org/test/case/id/62937aa31d3b5a920ba39be9
new failure (last pass: v5.10.112-cip6)


cip-gitlab/ci/pavel/linux-test ltp-pty: 3 runs, 3 regressions (v4.4-st5-297-gc0d53c2a5c03d) #kernelci

kernelci.org bot <bot@...>
 

cip-gitlab/ci/pavel/linux-test ltp-pty: 3 runs, 3 regressions (v4.4-st5-297-gc0d53c2a5c03d)

Regressions Summary
-------------------

platform | arch | lab | compiler | defconfig | regressions
--------------------------+--------+---------------+----------+------------------------------+------------
asus-C433TA-AJ0005-rammus | x86_64 | lab-collabora | gcc-10 | x86_64_defcon...6-chromebook | 1
asus-C523NA-A20057-coral | x86_64 | lab-collabora | gcc-10 | x86_64_defcon...6-chromebook | 1
hp-11A-G6-EE-grunt | x86_64 | lab-collabora | gcc-10 | x86_64_defcon...6-chromebook | 1

Details: https://kernelci.org/test/job/cip-gitlab/branch/ci%2Fpavel%2Flinux-test/kernel/v4.4-st5-297-gc0d53c2a5c03d/plan/ltp-pty/

Test: ltp-pty
Tree: cip-gitlab
Branch: ci/pavel/linux-test
Describe: v4.4-st5-297-gc0d53c2a5c03d
URL: https://gitlab.com/cip-project/cip-kernel/linux-cip.git
SHA: c0d53c2a5c03d0b2672a56140f211b51b3e047c1

Test suite revisions:
ltp-tests
URL: https://github.com/linux-test-project/ltp.git
SHA: 17e9ae697a340242c49188ace12a60cd3bc95a53


Test Regressions
----------------


platform | arch | lab | compiler | defconfig | regressions
--------------------------+--------+---------------+----------+------------------------------+------------
asus-C433TA-AJ0005-rammus | x86_64 | lab-collabora | gcc-10 | x86_64_defcon...6-chromebook | 1

Details: https://kernelci.org/test/plan/id/629379c007f73d195ba39bcd

Results: 0 PASS, 1 FAIL, 0 SKIP
Full config: x86_64_defconfig+x86-chromebook
Compiler: gcc-10 (gcc (Debian 10.2.1-6) 10.2.1 20210110)
Plain log: https://storage.kernelci.org//cip-gitlab/ci-pavel-linux-test/v4.4-st5-297-gc0d53c2a5c03d/x86_64/x86_64_defconfig+x86-chromebook/gcc-10/lab-collabora/ltp-pty-asus-C433TA-AJ0005-rammus.txt
HTML log: https://storage.kernelci.org//cip-gitlab/ci-pavel-linux-test/v4.4-st5-297-gc0d53c2a5c03d/x86_64/x86_64_defconfig+x86-chromebook/gcc-10/lab-collabora/ltp-pty-asus-C433TA-AJ0005-rammus.html
Rootfs: http://storage.kernelci.org/images/rootfs/debian/bullseye-ltp/20220513.0/amd64/initrd.cpio.gz


* ltp-pty.login: https://kernelci.org/test/case/id/629379c007f73d195ba39bce
new failure (last pass: v5.10.112-cip6)



platform | arch | lab | compiler | defconfig | regressions
--------------------------+--------+---------------+----------+------------------------------+------------
asus-C523NA-A20057-coral | x86_64 | lab-collabora | gcc-10 | x86_64_defcon...6-chromebook | 1

Details: https://kernelci.org/test/plan/id/62937a218eee34ae0ca39bd8

Results: 0 PASS, 1 FAIL, 0 SKIP
Full config: x86_64_defconfig+x86-chromebook
Compiler: gcc-10 (gcc (Debian 10.2.1-6) 10.2.1 20210110)
Plain log: https://storage.kernelci.org//cip-gitlab/ci-pavel-linux-test/v4.4-st5-297-gc0d53c2a5c03d/x86_64/x86_64_defconfig+x86-chromebook/gcc-10/lab-collabora/ltp-pty-asus-C523NA-A20057-coral.txt
HTML log: https://storage.kernelci.org//cip-gitlab/ci-pavel-linux-test/v4.4-st5-297-gc0d53c2a5c03d/x86_64/x86_64_defconfig+x86-chromebook/gcc-10/lab-collabora/ltp-pty-asus-C523NA-A20057-coral.html
Rootfs: http://storage.kernelci.org/images/rootfs/debian/bullseye-ltp/20220513.0/amd64/initrd.cpio.gz


* ltp-pty.login: https://kernelci.org/test/case/id/62937a218eee34ae0ca39bd9
new failure (last pass: v5.10.112-cip6)



platform | arch | lab | compiler | defconfig | regressions
--------------------------+--------+---------------+----------+------------------------------+------------
hp-11A-G6-EE-grunt | x86_64 | lab-collabora | gcc-10 | x86_64_defcon...6-chromebook | 1

Details: https://kernelci.org/test/plan/id/629379b4c0eb3c421aa39bf4

Results: 0 PASS, 1 FAIL, 0 SKIP
Full config: x86_64_defconfig+x86-chromebook
Compiler: gcc-10 (gcc (Debian 10.2.1-6) 10.2.1 20210110)
Plain log: https://storage.kernelci.org//cip-gitlab/ci-pavel-linux-test/v4.4-st5-297-gc0d53c2a5c03d/x86_64/x86_64_defconfig+x86-chromebook/gcc-10/lab-collabora/ltp-pty-hp-11A-G6-EE-grunt.txt
HTML log: https://storage.kernelci.org//cip-gitlab/ci-pavel-linux-test/v4.4-st5-297-gc0d53c2a5c03d/x86_64/x86_64_defconfig+x86-chromebook/gcc-10/lab-collabora/ltp-pty-hp-11A-G6-EE-grunt.html
Rootfs: http://storage.kernelci.org/images/rootfs/debian/bullseye-ltp/20220513.0/amd64/initrd.cpio.gz


* ltp-pty.login: https://kernelci.org/test/case/id/629379b4c0eb3c421aa39bf5
new failure (last pass: v5.10.112-cip6)


cip-gitlab/ci/pavel/linux-test ltp-ipc: 8 runs, 4 regressions (v4.4-st5-297-gc0d53c2a5c03d) #kernelci

kernelci.org bot <bot@...>
 

cip-gitlab/ci/pavel/linux-test ltp-ipc: 8 runs, 4 regressions (v4.4-st5-297-gc0d53c2a5c03d)

Regressions Summary
-------------------

platform | arch | lab | compiler | defconfig | regressions
--------------------------+--------+---------------+----------+------------------------------+------------
asus-C523NA-A20057-coral | x86_64 | lab-collabora | gcc-10 | x86_64_defcon...6-chromebook | 1
asus-cx9400-volteer | x86_64 | lab-collabora | gcc-10 | x86_64_defcon...6-chromebook | 1
hp-11A-G6-EE-grunt | x86_64 | lab-collabora | gcc-10 | x86_64_defcon...6-chromebook | 1
hp-x360-12b-n4000-octopus | x86_64 | lab-collabora | gcc-10 | x86_64_defcon...6-chromebook | 1

Details: https://kernelci.org/test/job/cip-gitlab/branch/ci%2Fpavel%2Flinux-test/kernel/v4.4-st5-297-gc0d53c2a5c03d/plan/ltp-ipc/

Test: ltp-ipc
Tree: cip-gitlab
Branch: ci/pavel/linux-test
Describe: v4.4-st5-297-gc0d53c2a5c03d
URL: https://gitlab.com/cip-project/cip-kernel/linux-cip.git
SHA: c0d53c2a5c03d0b2672a56140f211b51b3e047c1

Test suite revisions:
ltp-tests
URL: https://github.com/linux-test-project/ltp.git
SHA: 17e9ae697a340242c49188ace12a60cd3bc95a53


Test Regressions
----------------


platform | arch | lab | compiler | defconfig | regressions
--------------------------+--------+---------------+----------+------------------------------+------------
asus-C523NA-A20057-coral | x86_64 | lab-collabora | gcc-10 | x86_64_defcon...6-chromebook | 1

Details: https://kernelci.org/test/plan/id/62937a308eee34ae0ca39beb

Results: 0 PASS, 1 FAIL, 0 SKIP
Full config: x86_64_defconfig+x86-chromebook
Compiler: gcc-10 (gcc (Debian 10.2.1-6) 10.2.1 20210110)
Plain log: https://storage.kernelci.org//cip-gitlab/ci-pavel-linux-test/v4.4-st5-297-gc0d53c2a5c03d/x86_64/x86_64_defconfig+x86-chromebook/gcc-10/lab-collabora/ltp-ipc-asus-C523NA-A20057-coral.txt
HTML log: https://storage.kernelci.org//cip-gitlab/ci-pavel-linux-test/v4.4-st5-297-gc0d53c2a5c03d/x86_64/x86_64_defconfig+x86-chromebook/gcc-10/lab-collabora/ltp-ipc-asus-C523NA-A20057-coral.html
Rootfs: http://storage.kernelci.org/images/rootfs/debian/bullseye-ltp/20220513.0/amd64/initrd.cpio.gz


* ltp-ipc.login: https://kernelci.org/test/case/id/62937a308eee34ae0ca39bec
new failure (last pass: v5.10.112-cip6)



platform | arch | lab | compiler | defconfig | regressions
--------------------------+--------+---------------+----------+------------------------------+------------
asus-cx9400-volteer | x86_64 | lab-collabora | gcc-10 | x86_64_defcon...6-chromebook | 1

Details: https://kernelci.org/test/plan/id/62937aa11d3b5a920ba39be5

Results: 0 PASS, 1 FAIL, 0 SKIP
Full config: x86_64_defconfig+x86-chromebook
Compiler: gcc-10 (gcc (Debian 10.2.1-6) 10.2.1 20210110)
Plain log: https://storage.kernelci.org//cip-gitlab/ci-pavel-linux-test/v4.4-st5-297-gc0d53c2a5c03d/x86_64/x86_64_defconfig+x86-chromebook/gcc-10/lab-collabora/ltp-ipc-asus-cx9400-volteer.txt
HTML log: https://storage.kernelci.org//cip-gitlab/ci-pavel-linux-test/v4.4-st5-297-gc0d53c2a5c03d/x86_64/x86_64_defconfig+x86-chromebook/gcc-10/lab-collabora/ltp-ipc-asus-cx9400-volteer.html
Rootfs: http://storage.kernelci.org/images/rootfs/debian/bullseye-ltp/20220513.0/amd64/initrd.cpio.gz


* ltp-ipc.login: https://kernelci.org/test/case/id/62937aa11d3b5a920ba39be6
new failure (last pass: v5.10.112-cip6)



platform | arch | lab | compiler | defconfig | regressions
--------------------------+--------+---------------+----------+------------------------------+------------
hp-11A-G6-EE-grunt | x86_64 | lab-collabora | gcc-10 | x86_64_defcon...6-chromebook | 1

Details: https://kernelci.org/test/plan/id/62938084fc3aa7b9f0a39bd7

Results: 0 PASS, 1 FAIL, 0 SKIP
Full config: x86_64_defconfig+x86-chromebook
Compiler: gcc-10 (gcc (Debian 10.2.1-6) 10.2.1 20210110)
Plain log: https://storage.kernelci.org//cip-gitlab/ci-pavel-linux-test/v4.4-st5-297-gc0d53c2a5c03d/x86_64/x86_64_defconfig+x86-chromebook/gcc-10/lab-collabora/ltp-ipc-hp-11A-G6-EE-grunt.txt
HTML log: https://storage.kernelci.org//cip-gitlab/ci-pavel-linux-test/v4.4-st5-297-gc0d53c2a5c03d/x86_64/x86_64_defconfig+x86-chromebook/gcc-10/lab-collabora/ltp-ipc-hp-11A-G6-EE-grunt.html
Rootfs: http://storage.kernelci.org/images/rootfs/debian/bullseye-ltp/20220513.0/amd64/initrd.cpio.gz


* ltp-ipc.login: https://kernelci.org/test/case/id/62938084fc3aa7b9f0a39bd8
new failure (last pass: v5.10.112-cip6)



platform | arch | lab | compiler | defconfig | regressions
--------------------------+--------+---------------+----------+------------------------------+------------
hp-x360-12b-n4000-octopus | x86_64 | lab-collabora | gcc-10 | x86_64_defcon...6-chromebook | 1

Details: https://kernelci.org/test/plan/id/62937c1507d296f427a39bd5

Results: 0 PASS, 1 FAIL, 0 SKIP
Full config: x86_64_defconfig+x86-chromebook
Compiler: gcc-10 (gcc (Debian 10.2.1-6) 10.2.1 20210110)
Plain log: https://storage.kernelci.org//cip-gitlab/ci-pavel-linux-test/v4.4-st5-297-gc0d53c2a5c03d/x86_64/x86_64_defconfig+x86-chromebook/gcc-10/lab-collabora/ltp-ipc-hp-x360-12b-n4000-octopus.txt
HTML log: https://storage.kernelci.org//cip-gitlab/ci-pavel-linux-test/v4.4-st5-297-gc0d53c2a5c03d/x86_64/x86_64_defconfig+x86-chromebook/gcc-10/lab-collabora/ltp-ipc-hp-x360-12b-n4000-octopus.html
Rootfs: http://storage.kernelci.org/images/rootfs/debian/bullseye-ltp/20220513.0/amd64/initrd.cpio.gz


* ltp-ipc.login: https://kernelci.org/test/case/id/62937c1507d296f427a39bd6
new failure (last pass: v5.10.112-cip6)


cip-gitlab/ci/pavel/linux-test ltp-fcntl-locktests: 3 runs, 3 regressions (v4.4-st5-297-gc0d53c2a5c03d) #kernelci

kernelci.org bot <bot@...>
 

cip-gitlab/ci/pavel/linux-test ltp-fcntl-locktests: 3 runs, 3 regressions (v4.4-st5-297-gc0d53c2a5c03d)

Regressions Summary
-------------------

platform | arch | lab | compiler | defconfig | regressions
--------------------------+--------+---------------+----------+------------------------------+------------
asus-C433TA-AJ0005-rammus | x86_64 | lab-collabora | gcc-10 | x86_64_defcon...6-chromebook | 1
asus-C523NA-A20057-coral | x86_64 | lab-collabora | gcc-10 | x86_64_defcon...6-chromebook | 1
hp-11A-G6-EE-grunt | x86_64 | lab-collabora | gcc-10 | x86_64_defcon...6-chromebook | 1

Details: https://kernelci.org/test/job/cip-gitlab/branch/ci%2Fpavel%2Flinux-test/kernel/v4.4-st5-297-gc0d53c2a5c03d/plan/ltp-fcntl-locktests/

Test: ltp-fcntl-locktests
Tree: cip-gitlab
Branch: ci/pavel/linux-test
Describe: v4.4-st5-297-gc0d53c2a5c03d
URL: https://gitlab.com/cip-project/cip-kernel/linux-cip.git
SHA: c0d53c2a5c03d0b2672a56140f211b51b3e047c1

Test suite revisions:
ltp-tests
URL: https://github.com/linux-test-project/ltp.git
SHA: 17e9ae697a340242c49188ace12a60cd3bc95a53


Test Regressions
----------------


platform | arch | lab | compiler | defconfig | regressions
--------------------------+--------+---------------+----------+------------------------------+------------
asus-C433TA-AJ0005-rammus | x86_64 | lab-collabora | gcc-10 | x86_64_defcon...6-chromebook | 1

Details: https://kernelci.org/test/plan/id/6293798d903f0eaf0aa39bdd

Results: 0 PASS, 1 FAIL, 0 SKIP
Full config: x86_64_defconfig+x86-chromebook
Compiler: gcc-10 (gcc (Debian 10.2.1-6) 10.2.1 20210110)
Plain log: https://storage.kernelci.org//cip-gitlab/ci-pavel-linux-test/v4.4-st5-297-gc0d53c2a5c03d/x86_64/x86_64_defconfig+x86-chromebook/gcc-10/lab-collabora/ltp-fcntl-locktests-asus-C433TA-AJ0005-rammus.txt
HTML log: https://storage.kernelci.org//cip-gitlab/ci-pavel-linux-test/v4.4-st5-297-gc0d53c2a5c03d/x86_64/x86_64_defconfig+x86-chromebook/gcc-10/lab-collabora/ltp-fcntl-locktests-asus-C433TA-AJ0005-rammus.html
Rootfs: http://storage.kernelci.org/images/rootfs/debian/bullseye-ltp/20220513.0/amd64/initrd.cpio.gz


* ltp-fcntl-locktests.login: https://kernelci.org/test/case/id/6293798d903f0eaf0aa39bde
new failure (last pass: v5.10.112-cip6)



platform | arch | lab | compiler | defconfig | regressions
--------------------------+--------+---------------+----------+------------------------------+------------
asus-C523NA-A20057-coral | x86_64 | lab-collabora | gcc-10 | x86_64_defcon...6-chromebook | 1

Details: https://kernelci.org/test/plan/id/6293799512fa5a0a8ba39bd5

Results: 0 PASS, 1 FAIL, 0 SKIP
Full config: x86_64_defconfig+x86-chromebook
Compiler: gcc-10 (gcc (Debian 10.2.1-6) 10.2.1 20210110)
Plain log: https://storage.kernelci.org//cip-gitlab/ci-pavel-linux-test/v4.4-st5-297-gc0d53c2a5c03d/x86_64/x86_64_defconfig+x86-chromebook/gcc-10/lab-collabora/ltp-fcntl-locktests-asus-C523NA-A20057-coral.txt
HTML log: https://storage.kernelci.org//cip-gitlab/ci-pavel-linux-test/v4.4-st5-297-gc0d53c2a5c03d/x86_64/x86_64_defconfig+x86-chromebook/gcc-10/lab-collabora/ltp-fcntl-locktests-asus-C523NA-A20057-coral.html
Rootfs: http://storage.kernelci.org/images/rootfs/debian/bullseye-ltp/20220513.0/amd64/initrd.cpio.gz


* ltp-fcntl-locktests.login: https://kernelci.org/test/case/id/6293799512fa5a0a8ba39bd6
new failure (last pass: v5.10.112-cip6)



platform | arch | lab | compiler | defconfig | regressions
--------------------------+--------+---------------+----------+------------------------------+------------
hp-11A-G6-EE-grunt | x86_64 | lab-collabora | gcc-10 | x86_64_defcon...6-chromebook | 1

Details: https://kernelci.org/test/plan/id/629379a4c0eb3c421aa39bcd

Results: 0 PASS, 1 FAIL, 0 SKIP
Full config: x86_64_defconfig+x86-chromebook
Compiler: gcc-10 (gcc (Debian 10.2.1-6) 10.2.1 20210110)
Plain log: https://storage.kernelci.org//cip-gitlab/ci-pavel-linux-test/v4.4-st5-297-gc0d53c2a5c03d/x86_64/x86_64_defconfig+x86-chromebook/gcc-10/lab-collabora/ltp-fcntl-locktests-hp-11A-G6-EE-grunt.txt
HTML log: https://storage.kernelci.org//cip-gitlab/ci-pavel-linux-test/v4.4-st5-297-gc0d53c2a5c03d/x86_64/x86_64_defconfig+x86-chromebook/gcc-10/lab-collabora/ltp-fcntl-locktests-hp-11A-G6-EE-grunt.html
Rootfs: http://storage.kernelci.org/images/rootfs/debian/bullseye-ltp/20220513.0/amd64/initrd.cpio.gz


* ltp-fcntl-locktests.login: https://kernelci.org/test/case/id/629379a4c0eb3c421aa39bce
new failure (last pass: v5.10.112-cip6)


cip-gitlab/ci/pavel/linux-test kselftest-futex: 4 runs, 3 regressions (v4.4-st5-297-gc0d53c2a5c03d) #kernelci

kernelci.org bot <bot@...>
 

cip-gitlab/ci/pavel/linux-test kselftest-futex: 4 runs, 3 regressions (v4.4-st5-297-gc0d53c2a5c03d)

Regressions Summary
-------------------

platform | arch | lab | compiler | defconfig | regressions
--------------------------+--------+---------------+----------+------------------------------+------------
asus-C436FA-Flip-hatch | x86_64 | lab-collabora | gcc-10 | x86_64_defcon...6-chromebook | 1
hp-11A-G6-EE-grunt | x86_64 | lab-collabora | gcc-10 | x86_64_defcon...6-chromebook | 1
hp-x360-12b-n4000-octopus | x86_64 | lab-collabora | gcc-10 | x86_64_defcon...6-chromebook | 1

Details: https://kernelci.org/test/job/cip-gitlab/branch/ci%2Fpavel%2Flinux-test/kernel/v4.4-st5-297-gc0d53c2a5c03d/plan/kselftest-futex/

Test: kselftest-futex
Tree: cip-gitlab
Branch: ci/pavel/linux-test
Describe: v4.4-st5-297-gc0d53c2a5c03d
URL: https://gitlab.com/cip-project/cip-kernel/linux-cip.git
SHA: c0d53c2a5c03d0b2672a56140f211b51b3e047c1


Test Regressions
----------------


platform | arch | lab | compiler | defconfig | regressions
--------------------------+--------+---------------+----------+------------------------------+------------
asus-C436FA-Flip-hatch | x86_64 | lab-collabora | gcc-10 | x86_64_defcon...6-chromebook | 1

Details: https://kernelci.org/test/plan/id/62937a828a62931b29a39be1

Results: 0 PASS, 1 FAIL, 0 SKIP
Full config: x86_64_defconfig+x86-chromebook
Compiler: gcc-10 (gcc (Debian 10.2.1-6) 10.2.1 20210110)
Plain log: https://storage.kernelci.org//cip-gitlab/ci-pavel-linux-test/v4.4-st5-297-gc0d53c2a5c03d/x86_64/x86_64_defconfig+x86-chromebook/gcc-10/lab-collabora/kselftest-futex-asus-C436FA-Flip-hatch.txt
HTML log: https://storage.kernelci.org//cip-gitlab/ci-pavel-linux-test/v4.4-st5-297-gc0d53c2a5c03d/x86_64/x86_64_defconfig+x86-chromebook/gcc-10/lab-collabora/kselftest-futex-asus-C436FA-Flip-hatch.html
Rootfs: http://storage.kernelci.org/images/rootfs/debian/bullseye-kselftest/20220513.0/amd64/initrd.cpio.gz


* kselftest-futex.login: https://kernelci.org/test/case/id/62937a828a62931b29a39be2
new failure (last pass: v5.10.112-cip6)



platform | arch | lab | compiler | defconfig | regressions
--------------------------+--------+---------------+----------+------------------------------+------------
hp-11A-G6-EE-grunt | x86_64 | lab-collabora | gcc-10 | x86_64_defcon...6-chromebook | 1

Details: https://kernelci.org/test/plan/id/629379faef01d07f1ca39be4

Results: 0 PASS, 1 FAIL, 0 SKIP
Full config: x86_64_defconfig+x86-chromebook
Compiler: gcc-10 (gcc (Debian 10.2.1-6) 10.2.1 20210110)
Plain log: https://storage.kernelci.org//cip-gitlab/ci-pavel-linux-test/v4.4-st5-297-gc0d53c2a5c03d/x86_64/x86_64_defconfig+x86-chromebook/gcc-10/lab-collabora/kselftest-futex-hp-11A-G6-EE-grunt.txt
HTML log: https://storage.kernelci.org//cip-gitlab/ci-pavel-linux-test/v4.4-st5-297-gc0d53c2a5c03d/x86_64/x86_64_defconfig+x86-chromebook/gcc-10/lab-collabora/kselftest-futex-hp-11A-G6-EE-grunt.html
Rootfs: http://storage.kernelci.org/images/rootfs/debian/bullseye-kselftest/20220513.0/amd64/initrd.cpio.gz


* kselftest-futex.login: https://kernelci.org/test/case/id/629379faef01d07f1ca39be5
new failure (last pass: v5.10.112-cip6)



platform | arch | lab | compiler | defconfig | regressions
--------------------------+--------+---------------+----------+------------------------------+------------
hp-x360-12b-n4000-octopus | x86_64 | lab-collabora | gcc-10 | x86_64_defcon...6-chromebook | 1

Details: https://kernelci.org/test/plan/id/62937c2a07d296f427a39be2

Results: 0 PASS, 1 FAIL, 0 SKIP
Full config: x86_64_defconfig+x86-chromebook
Compiler: gcc-10 (gcc (Debian 10.2.1-6) 10.2.1 20210110)
Plain log: https://storage.kernelci.org//cip-gitlab/ci-pavel-linux-test/v4.4-st5-297-gc0d53c2a5c03d/x86_64/x86_64_defconfig+x86-chromebook/gcc-10/lab-collabora/kselftest-futex-hp-x360-12b-n4000-octopus.txt
HTML log: https://storage.kernelci.org//cip-gitlab/ci-pavel-linux-test/v4.4-st5-297-gc0d53c2a5c03d/x86_64/x86_64_defconfig+x86-chromebook/gcc-10/lab-collabora/kselftest-futex-hp-x360-12b-n4000-octopus.html
Rootfs: http://storage.kernelci.org/images/rootfs/debian/bullseye-kselftest/20220513.0/amd64/initrd.cpio.gz


* kselftest-futex.login: https://kernelci.org/test/case/id/62937c2a07d296f427a39be3
new failure (last pass: v5.10.112-cip6)


cip-gitlab/ci/pavel/linux-test kselftest-filesystems: 4 runs, 3 regressions (v4.4-st5-297-gc0d53c2a5c03d) #kernelci

kernelci.org bot <bot@...>
 

cip-gitlab/ci/pavel/linux-test kselftest-filesystems: 4 runs, 3 regressions (v4.4-st5-297-gc0d53c2a5c03d)

Regressions Summary
-------------------

platform | arch | lab | compiler | defconfig | regressions
-------------------------+--------+---------------+----------+------------------------------+------------
asus-C436FA-Flip-hatch | x86_64 | lab-collabora | gcc-10 | x86_64_defcon...6-chromebook | 1
asus-C523NA-A20057-coral | x86_64 | lab-collabora | gcc-10 | x86_64_defcon...6-chromebook | 1
hp-11A-G6-EE-grunt | x86_64 | lab-collabora | gcc-10 | x86_64_defcon...6-chromebook | 1

Details: https://kernelci.org/test/job/cip-gitlab/branch/ci%2Fpavel%2Flinux-test/kernel/v4.4-st5-297-gc0d53c2a5c03d/plan/kselftest-filesystems/

Test: kselftest-filesystems
Tree: cip-gitlab
Branch: ci/pavel/linux-test
Describe: v4.4-st5-297-gc0d53c2a5c03d
URL: https://gitlab.com/cip-project/cip-kernel/linux-cip.git
SHA: c0d53c2a5c03d0b2672a56140f211b51b3e047c1


Test Regressions
----------------


platform | arch | lab | compiler | defconfig | regressions
-------------------------+--------+---------------+----------+------------------------------+------------
asus-C436FA-Flip-hatch | x86_64 | lab-collabora | gcc-10 | x86_64_defcon...6-chromebook | 1

Details: https://kernelci.org/test/plan/id/62937a808a62931b29a39bdb

Results: 0 PASS, 1 FAIL, 0 SKIP
Full config: x86_64_defconfig+x86-chromebook
Compiler: gcc-10 (gcc (Debian 10.2.1-6) 10.2.1 20210110)
Plain log: https://storage.kernelci.org//cip-gitlab/ci-pavel-linux-test/v4.4-st5-297-gc0d53c2a5c03d/x86_64/x86_64_defconfig+x86-chromebook/gcc-10/lab-collabora/kselftest-filesystems-asus-C436FA-Flip-hatch.txt
HTML log: https://storage.kernelci.org//cip-gitlab/ci-pavel-linux-test/v4.4-st5-297-gc0d53c2a5c03d/x86_64/x86_64_defconfig+x86-chromebook/gcc-10/lab-collabora/kselftest-filesystems-asus-C436FA-Flip-hatch.html
Rootfs: http://storage.kernelci.org/images/rootfs/debian/bullseye-kselftest/20220513.0/amd64/initrd.cpio.gz


* kselftest-filesystems.login: https://kernelci.org/test/case/id/62937a808a62931b29a39bdc
new failure (last pass: v5.10.112-cip6)



platform | arch | lab | compiler | defconfig | regressions
-------------------------+--------+---------------+----------+------------------------------+------------
asus-C523NA-A20057-coral | x86_64 | lab-collabora | gcc-10 | x86_64_defcon...6-chromebook | 1

Details: https://kernelci.org/test/plan/id/629379fb79de3f02eda39bcd

Results: 0 PASS, 1 FAIL, 0 SKIP
Full config: x86_64_defconfig+x86-chromebook
Compiler: gcc-10 (gcc (Debian 10.2.1-6) 10.2.1 20210110)
Plain log: https://storage.kernelci.org//cip-gitlab/ci-pavel-linux-test/v4.4-st5-297-gc0d53c2a5c03d/x86_64/x86_64_defconfig+x86-chromebook/gcc-10/lab-collabora/kselftest-filesystems-asus-C523NA-A20057-coral.txt
HTML log: https://storage.kernelci.org//cip-gitlab/ci-pavel-linux-test/v4.4-st5-297-gc0d53c2a5c03d/x86_64/x86_64_defconfig+x86-chromebook/gcc-10/lab-collabora/kselftest-filesystems-asus-C523NA-A20057-coral.html
Rootfs: http://storage.kernelci.org/images/rootfs/debian/bullseye-kselftest/20220513.0/amd64/initrd.cpio.gz


* kselftest-filesystems.login: https://kernelci.org/test/case/id/629379fb79de3f02eda39bce
new failure (last pass: v5.10.112-cip6)



platform | arch | lab | compiler | defconfig | regressions
-------------------------+--------+---------------+----------+------------------------------+------------
hp-11A-G6-EE-grunt | x86_64 | lab-collabora | gcc-10 | x86_64_defcon...6-chromebook | 1

Details: https://kernelci.org/test/plan/id/629380771f76f18504a39bd1

Results: 0 PASS, 1 FAIL, 0 SKIP
Full config: x86_64_defconfig+x86-chromebook
Compiler: gcc-10 (gcc (Debian 10.2.1-6) 10.2.1 20210110)
Plain log: https://storage.kernelci.org//cip-gitlab/ci-pavel-linux-test/v4.4-st5-297-gc0d53c2a5c03d/x86_64/x86_64_defconfig+x86-chromebook/gcc-10/lab-collabora/kselftest-filesystems-hp-11A-G6-EE-grunt.txt
HTML log: https://storage.kernelci.org//cip-gitlab/ci-pavel-linux-test/v4.4-st5-297-gc0d53c2a5c03d/x86_64/x86_64_defconfig+x86-chromebook/gcc-10/lab-collabora/kselftest-filesystems-hp-11A-G6-EE-grunt.html
Rootfs: http://storage.kernelci.org/images/rootfs/debian/bullseye-kselftest/20220513.0/amd64/initrd.cpio.gz


* kselftest-filesystems.login: https://kernelci.org/test/case/id/629380771f76f18504a39bd2
new failure (last pass: v5.10.112-cip6)


cip-gitlab/ci/pavel/linux-test baseline: 65 runs, 52 regressions (v4.4-st5-297-gc0d53c2a5c03d) #kernelci

kernelci.org bot <bot@...>
 

cip-gitlab/ci/pavel/linux-test baseline: 65 runs, 52 regressions (v4.4-st5-297-gc0d53c2a5c03d)

Regressions Summary
-------------------

platform | arch | lab | compiler | defconfig | regressions
---------------------------+--------+---------------+----------+------------------------------+------------
asus-C436FA-Flip-hatch | x86_64 | lab-collabora | gcc-10 | x86_64_defcon...6-chromebook | 1
asus-cx9400-volteer | x86_64 | lab-collabora | gcc-10 | x86_64_defcon...6-chromebook | 1
at91-sama5d4_xplained | arm | lab-baylibre | gcc-10 | multi_v7_defconfig | 1
beaglebone-black | arm | lab-broonie | gcc-10 | multi_v7_defconfig | 1
beaglebone-black | arm | lab-cip | gcc-10 | multi_v7_defconfig | 1
beaglebone-black | arm | lab-broonie | gcc-10 | omap2plus_defconfig | 1
beaglebone-black | arm | lab-cip | gcc-10 | omap2plus_defconfig | 1
hp-x360-12b-n4000-octopus | x86_64 | lab-collabora | gcc-10 | x86_64_defcon...6-chromebook | 1
juno-uboot | arm64 | lab-broonie | gcc-10 | defconfig | 1
odroid-xu3 | arm | lab-collabora | gcc-10 | exynos_defconfig | 1
qemu_arm-virt-gicv2 | arm | lab-broonie | gcc-10 | multi_v7_defconfig | 1
qemu_arm-virt-gicv2-uefi | arm | lab-broonie | gcc-10 | multi_v7_defconfig | 1
qemu_arm-virt-gicv3 | arm | lab-broonie | gcc-10 | multi_v7_defconfig | 1
qemu_arm-virt-gicv3-uefi | arm | lab-broonie | gcc-10 | multi_v7_defconfig | 1
qemu_arm64-virt-gicv2 | arm64 | lab-broonie | gcc-10 | defconfig+arm64-chromebook | 1
qemu_arm64-virt-gicv2 | arm64 | lab-broonie | gcc-10 | defconfig | 1
qemu_arm64-virt-gicv2-uefi | arm64 | lab-broonie | gcc-10 | defconfig+arm64-chromebook | 1
qemu_arm64-virt-gicv2-uefi | arm64 | lab-broonie | gcc-10 | defconfig | 1
qemu_arm64-virt-gicv3 | arm64 | lab-broonie | gcc-10 | defconfig+arm64-chromebook | 1
qemu_arm64-virt-gicv3 | arm64 | lab-broonie | gcc-10 | defconfig | 1
qemu_arm64-virt-gicv3-uefi | arm64 | lab-broonie | gcc-10 | defconfig+arm64-chromebook | 1
qemu_arm64-virt-gicv3-uefi | arm64 | lab-broonie | gcc-10 | defconfig | 1
qemu_x86_64-uefi-mixed | x86_64 | lab-broonie | gcc-10 | x86_64_defconfig | 1
qemu_x86_64-uefi-mixed | x86_64 | lab-broonie | gcc-10 | x86_64_defcon...6-chromebook | 1
rk3288-veyron-jaq | arm | lab-collabora | gcc-10 | multi_v7_defconfig | 28

Details: https://kernelci.org/test/job/cip-gitlab/branch/ci%2Fpavel%2Flinux-test/kernel/v4.4-st5-297-gc0d53c2a5c03d/plan/baseline/

Test: baseline
Tree: cip-gitlab
Branch: ci/pavel/linux-test
Describe: v4.4-st5-297-gc0d53c2a5c03d
URL: https://gitlab.com/cip-project/cip-kernel/linux-cip.git
SHA: c0d53c2a5c03d0b2672a56140f211b51b3e047c1


Test Regressions
----------------


platform | arch | lab | compiler | defconfig | regressions
---------------------------+--------+---------------+----------+------------------------------+------------
asus-C436FA-Flip-hatch | x86_64 | lab-collabora | gcc-10 | x86_64_defcon...6-chromebook | 1

Details: https://kernelci.org/test/plan/id/62937bf8472253be9ea39bd5

Results: 0 PASS, 1 FAIL, 0 SKIP
Full config: x86_64_defconfig+x86-chromebook
Compiler: gcc-10 (gcc (Debian 10.2.1-6) 10.2.1 20210110)
Plain log: https://storage.kernelci.org//cip-gitlab/ci-pavel-linux-test/v4.4-st5-297-gc0d53c2a5c03d/x86_64/x86_64_defconfig+x86-chromebook/gcc-10/lab-collabora/baseline-asus-C436FA-Flip-hatch.txt
HTML log: https://storage.kernelci.org//cip-gitlab/ci-pavel-linux-test/v4.4-st5-297-gc0d53c2a5c03d/x86_64/x86_64_defconfig+x86-chromebook/gcc-10/lab-collabora/baseline-asus-C436FA-Flip-hatch.html
Rootfs: http://storage.kernelci.org/images/rootfs/buildroot/buildroot-baseline/20220513.0/x86/rootfs.cpio.gz


* baseline.login: https://kernelci.org/test/case/id/62937bf8472253be9ea39bd6
new failure (last pass: v5.10.112-cip6)



platform | arch | lab | compiler | defconfig | regressions
---------------------------+--------+---------------+----------+------------------------------+------------
asus-cx9400-volteer | x86_64 | lab-collabora | gcc-10 | x86_64_defcon...6-chromebook | 1

Details: https://kernelci.org/test/plan/id/62937a84c2cbec76d8a39c05

Results: 0 PASS, 1 FAIL, 0 SKIP
Full config: x86_64_defconfig+x86-chromebook
Compiler: gcc-10 (gcc (Debian 10.2.1-6) 10.2.1 20210110)
Plain log: https://storage.kernelci.org//cip-gitlab/ci-pavel-linux-test/v4.4-st5-297-gc0d53c2a5c03d/x86_64/x86_64_defconfig+x86-chromebook/gcc-10/lab-collabora/baseline-asus-cx9400-volteer.txt
HTML log: https://storage.kernelci.org//cip-gitlab/ci-pavel-linux-test/v4.4-st5-297-gc0d53c2a5c03d/x86_64/x86_64_defconfig+x86-chromebook/gcc-10/lab-collabora/baseline-asus-cx9400-volteer.html
Rootfs: http://storage.kernelci.org/images/rootfs/buildroot/buildroot-baseline/20220513.0/x86/rootfs.cpio.gz


* baseline.login: https://kernelci.org/test/case/id/62937a84c2cbec76d8a39c06
new failure (last pass: v5.10.112-cip6)



platform | arch | lab | compiler | defconfig | regressions
---------------------------+--------+---------------+----------+------------------------------+------------
at91-sama5d4_xplained | arm | lab-baylibre | gcc-10 | multi_v7_defconfig | 1

Details: https://kernelci.org/test/plan/id/62937b00688199fc02a39bf3

Results: 0 PASS, 1 FAIL, 0 SKIP
Full config: multi_v7_defconfig
Compiler: gcc-10 (arm-linux-gnueabihf-gcc (Debian 10.2.1-6) 10.2.1 20210110)
Plain log: https://storage.kernelci.org//cip-gitlab/ci-pavel-linux-test/v4.4-st5-297-gc0d53c2a5c03d/arm/multi_v7_defconfig/gcc-10/lab-baylibre/baseline-at91-sama5d4_xplained.txt
HTML log: https://storage.kernelci.org//cip-gitlab/ci-pavel-linux-test/v4.4-st5-297-gc0d53c2a5c03d/arm/multi_v7_defconfig/gcc-10/lab-baylibre/baseline-at91-sama5d4_xplained.html
Rootfs: http://storage.kernelci.org/images/rootfs/buildroot/buildroot-baseline/20220513.0/armel/rootfs.cpio.gz


* baseline.login: https://kernelci.org/test/case/id/62937b00688199fc02a39bf4
new failure (last pass: v5.10.112-cip6)



platform | arch | lab | compiler | defconfig | regressions
---------------------------+--------+---------------+----------+------------------------------+------------
beaglebone-black | arm | lab-broonie | gcc-10 | multi_v7_defconfig | 1

Details: https://kernelci.org/test/plan/id/629378bd98dd07edfaa39be0

Results: 4 PASS, 1 FAIL, 2 SKIP
Full config: multi_v7_defconfig
Compiler: gcc-10 (arm-linux-gnueabihf-gcc (Debian 10.2.1-6) 10.2.1 20210110)
Plain log: https://storage.kernelci.org//cip-gitlab/ci-pavel-linux-test/v4.4-st5-297-gc0d53c2a5c03d/arm/multi_v7_defconfig/gcc-10/lab-broonie/baseline-beaglebone-black.txt
HTML log: https://storage.kernelci.org//cip-gitlab/ci-pavel-linux-test/v4.4-st5-297-gc0d53c2a5c03d/arm/multi_v7_defconfig/gcc-10/lab-broonie/baseline-beaglebone-black.html
Rootfs: http://storage.kernelci.org/images/rootfs/buildroot/buildroot-baseline/20220513.0/armel/rootfs.cpio.gz


* baseline.dmesg.crit: https://kernelci.org/test/case/id/629378bd98dd07edfaa39be9
new failure (last pass: v5.10.112-cip6)
1 lines

2022-05-29T13:44:16.321487 / #
2022-05-29T13:44:16.327227
2022-05-29T13:44:16.433206 / # #
2022-05-29T13:44:16.438834 #
2022-05-29T13:44:16.541309 / # export SHELL=/bin/sh
2022-05-29T13:44:16.546964 export SHELL=/bin/sh
2022-05-29T13:44:16.648942 / # . /lava-182641/environment
2022-05-29T13:44:16.654538 . /lava-182641/environment
2022-05-29T13:44:16.756542 / # /lava-182641/bin/lava-test-runner /lava-182641/0
2022-05-29T13:44:16.761600 /lava-182641/bin/lava-test-runner /lava-182641/0
... (9 line(s) more)



platform | arch | lab | compiler | defconfig | regressions
---------------------------+--------+---------------+----------+------------------------------+------------
beaglebone-black | arm | lab-cip | gcc-10 | multi_v7_defconfig | 1

Details: https://kernelci.org/test/plan/id/629379462b9c305145a39bd8

Results: 4 PASS, 1 FAIL, 2 SKIP
Full config: multi_v7_defconfig
Compiler: gcc-10 (arm-linux-gnueabihf-gcc (Debian 10.2.1-6) 10.2.1 20210110)
Plain log: https://storage.kernelci.org//cip-gitlab/ci-pavel-linux-test/v4.4-st5-297-gc0d53c2a5c03d/arm/multi_v7_defconfig/gcc-10/lab-cip/baseline-beaglebone-black.txt
HTML log: https://storage.kernelci.org//cip-gitlab/ci-pavel-linux-test/v4.4-st5-297-gc0d53c2a5c03d/arm/multi_v7_defconfig/gcc-10/lab-cip/baseline-beaglebone-black.html
Rootfs: http://storage.kernelci.org/images/rootfs/buildroot/buildroot-baseline/20220513.0/armel/rootfs.cpio.gz


* baseline.dmesg.crit: https://kernelci.org/test/case/id/629379462b9c305145a39bdf
new failure (last pass: v5.10.112-cip6)
1 lines

2022-05-29T13:46:23.315668 / #
2022-05-29T13:46:23.318576
2022-05-29T13:46:23.423019 / # #
2022-05-29T13:46:23.425847 #
2022-05-29T13:46:23.527574 / # export SHELL=/bin/sh
2022-05-29T13:46:23.530317 export SHELL=/bin/sh
2022-05-29T13:46:23.631746 / # . /lava-688595/environment
2022-05-29T13:46:23.634626 . /lava-688595/environment
2022-05-29T13:46:23.736110 / # /lava-688595/bin/lava-test-runner /lava-688595/0
2022-05-29T13:46:23.738494 /lava-688595/bin/lava-test-runner /lava-688595/0
... (9 line(s) more)



platform | arch | lab | compiler | defconfig | regressions
---------------------------+--------+---------------+----------+------------------------------+------------
beaglebone-black | arm | lab-broonie | gcc-10 | omap2plus_defconfig | 1

Details: https://kernelci.org/test/plan/id/629379adc0eb3c421aa39be6

Results: 4 PASS, 1 FAIL, 2 SKIP
Full config: omap2plus_defconfig
Compiler: gcc-10 (arm-linux-gnueabihf-gcc (Debian 10.2.1-6) 10.2.1 20210110)
Plain log: https://storage.kernelci.org//cip-gitlab/ci-pavel-linux-test/v4.4-st5-297-gc0d53c2a5c03d/arm/omap2plus_defconfig/gcc-10/lab-broonie/baseline-beaglebone-black.txt
HTML log: https://storage.kernelci.org//cip-gitlab/ci-pavel-linux-test/v4.4-st5-297-gc0d53c2a5c03d/arm/omap2plus_defconfig/gcc-10/lab-broonie/baseline-beaglebone-black.html
Rootfs: http://storage.kernelci.org/images/rootfs/buildroot/buildroot-baseline/20220513.0/armel/rootfs.cpio.gz


* baseline.dmesg.crit: https://kernelci.org/test/case/id/629379adc0eb3c421aa39bee
failing since 18 days (last pass: v5.10.109-cip5-384-g722204542e8a, first fail: v4.4-st5-260-gb0fe64f485ff)
1 lines

2022-05-29T13:48:20.992038 / #
2022-05-29T13:48:20.999803
2022-05-29T13:48:21.105920 / # #
2022-05-29T13:48:21.112712 #
2022-05-29T13:48:21.215108 / # export SHELL=/bin/sh
2022-05-29T13:48:21.221819 export SHELL=/bin/sh
2022-05-29T13:48:21.323761 / # . /lava-182664/environment
2022-05-29T13:48:21.330436 . /lava-182664/environment
2022-05-29T13:48:21.432472 / # /lava-182664/bin/lava-test-runner /lava-182664/0
2022-05-29T13:48:21.437401 /lava-182664/bin/lava-test-runner /lava-182664/0
... (9 line(s) more)



platform | arch | lab | compiler | defconfig | regressions
---------------------------+--------+---------------+----------+------------------------------+------------
beaglebone-black | arm | lab-cip | gcc-10 | omap2plus_defconfig | 1

Details: https://kernelci.org/test/plan/id/62937ab69f04ed5000a39bdc

Results: 4 PASS, 1 FAIL, 2 SKIP
Full config: omap2plus_defconfig
Compiler: gcc-10 (arm-linux-gnueabihf-gcc (Debian 10.2.1-6) 10.2.1 20210110)
Plain log: https://storage.kernelci.org//cip-gitlab/ci-pavel-linux-test/v4.4-st5-297-gc0d53c2a5c03d/arm/omap2plus_defconfig/gcc-10/lab-cip/baseline-beaglebone-black.txt
HTML log: https://storage.kernelci.org//cip-gitlab/ci-pavel-linux-test/v4.4-st5-297-gc0d53c2a5c03d/arm/omap2plus_defconfig/gcc-10/lab-cip/baseline-beaglebone-black.html
Rootfs: http://storage.kernelci.org/images/rootfs/buildroot/buildroot-baseline/20220513.0/armel/rootfs.cpio.gz


* baseline.dmesg.crit: https://kernelci.org/test/case/id/62937ab69f04ed5000a39be3
failing since 18 days (last pass: v5.10.109-cip5-384-g722204542e8a, first fail: v4.4-st5-260-gb0fe64f485ff)
1 lines

2022-05-29T13:52:31.216109 / #
2022-05-29T13:52:31.225415
2022-05-29T13:52:31.329786 / # #
2022-05-29T13:52:31.337920 #
2022-05-29T13:52:31.439822 / # export SHELL=/bin/sh
2022-05-29T13:52:31.447874 export SHELL=/bin/sh
2022-05-29T13:52:31.549481 / # . /lava-688601/environment
2022-05-29T13:52:31.559177 . /lava-688601/environment
2022-05-29T13:52:31.660851 / # /lava-688601/bin/lava-test-runner /lava-688601/0
2022-05-29T13:52:31.668292 /lava-688601/bin/lava-test-runner /lava-688601/0
... (9 line(s) more)



platform | arch | lab | compiler | defconfig | regressions
---------------------------+--------+---------------+----------+------------------------------+------------
hp-x360-12b-n4000-octopus | x86_64 | lab-collabora | gcc-10 | x86_64_defcon...6-chromebook | 1

Details: https://kernelci.org/test/plan/id/62937aa31d3b5a920ba39beb

Results: 0 PASS, 1 FAIL, 0 SKIP
Full config: x86_64_defconfig+x86-chromebook
Compiler: gcc-10 (gcc (Debian 10.2.1-6) 10.2.1 20210110)
Plain log: https://storage.kernelci.org//cip-gitlab/ci-pavel-linux-test/v4.4-st5-297-gc0d53c2a5c03d/x86_64/x86_64_defconfig+x86-chromebook/gcc-10/lab-collabora/baseline-hp-x360-12b-n4000-octopus.txt
HTML log: https://storage.kernelci.org//cip-gitlab/ci-pavel-linux-test/v4.4-st5-297-gc0d53c2a5c03d/x86_64/x86_64_defconfig+x86-chromebook/gcc-10/lab-collabora/baseline-hp-x360-12b-n4000-octopus.html
Rootfs: http://storage.kernelci.org/images/rootfs/buildroot/buildroot-baseline/20220513.0/x86/rootfs.cpio.gz


* baseline.login: https://kernelci.org/test/case/id/62937aa31d3b5a920ba39bec
new failure (last pass: v5.10.112-cip6)



platform | arch | lab | compiler | defconfig | regressions
---------------------------+--------+---------------+----------+------------------------------+------------
juno-uboot | arm64 | lab-broonie | gcc-10 | defconfig | 1

Details: https://kernelci.org/test/plan/id/62937b52a9fd97e1ada39bcd

Results: 0 PASS, 1 FAIL, 0 SKIP
Full config: defconfig
Compiler: gcc-10 (aarch64-linux-gnu-gcc (Debian 10.2.1-6) 10.2.1 20210110)
Plain log: https://storage.kernelci.org//cip-gitlab/ci-pavel-linux-test/v4.4-st5-297-gc0d53c2a5c03d/arm64/defconfig/gcc-10/lab-broonie/baseline-juno-uboot.txt
HTML log: https://storage.kernelci.org//cip-gitlab/ci-pavel-linux-test/v4.4-st5-297-gc0d53c2a5c03d/arm64/defconfig/gcc-10/lab-broonie/baseline-juno-uboot.html
Rootfs: http://storage.kernelci.org/images/rootfs/buildroot/buildroot-baseline/20220513.0/arm64/rootfs.cpio.gz


* baseline.login: https://kernelci.org/test/case/id/62937b52a9fd97e1ada39bce
new failure (last pass: v5.10.112-cip6)



platform | arch | lab | compiler | defconfig | regressions
---------------------------+--------+---------------+----------+------------------------------+------------
odroid-xu3 | arm | lab-collabora | gcc-10 | exynos_defconfig | 1

Details: https://kernelci.org/test/plan/id/6293793d3de8911ba7a39bf7

Results: 4 PASS, 1 FAIL, 2 SKIP
Full config: exynos_defconfig
Compiler: gcc-10 (arm-linux-gnueabihf-gcc (Debian 10.2.1-6) 10.2.1 20210110)
Plain log: https://storage.kernelci.org//cip-gitlab/ci-pavel-linux-test/v4.4-st5-297-gc0d53c2a5c03d/arm/exynos_defconfig/gcc-10/lab-collabora/baseline-odroid-xu3.txt
HTML log: https://storage.kernelci.org//cip-gitlab/ci-pavel-linux-test/v4.4-st5-297-gc0d53c2a5c03d/arm/exynos_defconfig/gcc-10/lab-collabora/baseline-odroid-xu3.html
Rootfs: http://storage.kernelci.org/images/rootfs/buildroot/buildroot-baseline/20220513.0/armel/rootfs.cpio.gz


* baseline.bootrr.all-cpus-are-online: https://kernelci.org/test/case/id/6293793d3de8911ba7a39bfb
new failure (last pass: v5.10.112-cip6)

2022-05-29T13:46:31.372913 /lava-6497447/1/../bin/lava-test-case
2022-05-29T13:46:31.389264 [ 15.044356] <LAVA_SIGNAL_TESTCASE TEST_CASE_ID=all-cpus-are-online RESULT=fail>



platform | arch | lab | compiler | defconfig | regressions
---------------------------+--------+---------------+----------+------------------------------+------------
qemu_arm-virt-gicv2 | arm | lab-broonie | gcc-10 | multi_v7_defconfig | 1

Details: https://kernelci.org/test/plan/id/629379d5ef01d07f1ca39bcd

Results: 0 PASS, 1 FAIL, 0 SKIP
Full config: multi_v7_defconfig
Compiler: gcc-10 (arm-linux-gnueabihf-gcc (Debian 10.2.1-6) 10.2.1 20210110)
Plain log: https://storage.kernelci.org//cip-gitlab/ci-pavel-linux-test/v4.4-st5-297-gc0d53c2a5c03d/arm/multi_v7_defconfig/gcc-10/lab-broonie/baseline-qemu_arm-virt-gicv2.txt
HTML log: https://storage.kernelci.org//cip-gitlab/ci-pavel-linux-test/v4.4-st5-297-gc0d53c2a5c03d/arm/multi_v7_defconfig/gcc-10/lab-broonie/baseline-qemu_arm-virt-gicv2.html
Rootfs: http://storage.kernelci.org/images/rootfs/buildroot/buildroot-baseline/20220513.0/armel/rootfs.cpio.gz


* baseline.login: https://kernelci.org/test/case/id/629379d5ef01d07f1ca39bce
new failure (last pass: v5.10.112-cip6)



platform | arch | lab | compiler | defconfig | regressions
---------------------------+--------+---------------+----------+------------------------------+------------
qemu_arm-virt-gicv2-uefi | arm | lab-broonie | gcc-10 | multi_v7_defconfig | 1

Details: https://kernelci.org/test/plan/id/62937ab09f04ed5000a39bd6

Results: 0 PASS, 1 FAIL, 0 SKIP
Full config: multi_v7_defconfig
Compiler: gcc-10 (arm-linux-gnueabihf-gcc (Debian 10.2.1-6) 10.2.1 20210110)
Plain log: https://storage.kernelci.org//cip-gitlab/ci-pavel-linux-test/v4.4-st5-297-gc0d53c2a5c03d/arm/multi_v7_defconfig/gcc-10/lab-broonie/baseline-qemu_arm-virt-gicv2-uefi.txt
HTML log: https://storage.kernelci.org//cip-gitlab/ci-pavel-linux-test/v4.4-st5-297-gc0d53c2a5c03d/arm/multi_v7_defconfig/gcc-10/lab-broonie/baseline-qemu_arm-virt-gicv2-uefi.html
Rootfs: http://storage.kernelci.org/images/rootfs/buildroot/buildroot-baseline/20220513.0/armel/rootfs.cpio.gz


* baseline.login: https://kernelci.org/test/case/id/62937ab09f04ed5000a39bd7
new failure (last pass: v5.10.112-cip6)



platform | arch | lab | compiler | defconfig | regressions
---------------------------+--------+---------------+----------+------------------------------+------------
qemu_arm-virt-gicv3 | arm | lab-broonie | gcc-10 | multi_v7_defconfig | 1

Details: https://kernelci.org/test/plan/id/629379d60c87d0b49ea39bd8

Results: 0 PASS, 1 FAIL, 0 SKIP
Full config: multi_v7_defconfig
Compiler: gcc-10 (arm-linux-gnueabihf-gcc (Debian 10.2.1-6) 10.2.1 20210110)
Plain log: https://storage.kernelci.org//cip-gitlab/ci-pavel-linux-test/v4.4-st5-297-gc0d53c2a5c03d/arm/multi_v7_defconfig/gcc-10/lab-broonie/baseline-qemu_arm-virt-gicv3.txt
HTML log: https://storage.kernelci.org//cip-gitlab/ci-pavel-linux-test/v4.4-st5-297-gc0d53c2a5c03d/arm/multi_v7_defconfig/gcc-10/lab-broonie/baseline-qemu_arm-virt-gicv3.html
Rootfs: http://storage.kernelci.org/images/rootfs/buildroot/buildroot-baseline/20220513.0/armel/rootfs.cpio.gz


* baseline.login: https://kernelci.org/test/case/id/629379d60c87d0b49ea39bd9
new failure (last pass: v5.10.112-cip6)



platform | arch | lab | compiler | defconfig | regressions
---------------------------+--------+---------------+----------+------------------------------+------------
qemu_arm-virt-gicv3-uefi | arm | lab-broonie | gcc-10 | multi_v7_defconfig | 1

Details: https://kernelci.org/test/plan/id/62937ab2cf2dfaea3ba39bdb

Results: 0 PASS, 1 FAIL, 0 SKIP
Full config: multi_v7_defconfig
Compiler: gcc-10 (arm-linux-gnueabihf-gcc (Debian 10.2.1-6) 10.2.1 20210110)
Plain log: https://storage.kernelci.org//cip-gitlab/ci-pavel-linux-test/v4.4-st5-297-gc0d53c2a5c03d/arm/multi_v7_defconfig/gcc-10/lab-broonie/baseline-qemu_arm-virt-gicv3-uefi.txt
HTML log: https://storage.kernelci.org//cip-gitlab/ci-pavel-linux-test/v4.4-st5-297-gc0d53c2a5c03d/arm/multi_v7_defconfig/gcc-10/lab-broonie/baseline-qemu_arm-virt-gicv3-uefi.html
Rootfs: http://storage.kernelci.org/images/rootfs/buildroot/buildroot-baseline/20220513.0/armel/rootfs.cpio.gz


* baseline.login: https://kernelci.org/test/case/id/62937ab2cf2dfaea3ba39bdc
new failure (last pass: v5.10.112-cip6)



platform | arch | lab | compiler | defconfig | regressions
---------------------------+--------+---------------+----------+------------------------------+------------
qemu_arm64-virt-gicv2 | arm64 | lab-broonie | gcc-10 | defconfig+arm64-chromebook | 1

Details: https://kernelci.org/test/plan/id/6293794a7fed14ec6ba39bd3

Results: 0 PASS, 1 FAIL, 0 SKIP
Full config: defconfig+arm64-chromebook
Compiler: gcc-10 (aarch64-linux-gnu-gcc (Debian 10.2.1-6) 10.2.1 20210110)
Plain log: https://storage.kernelci.org//cip-gitlab/ci-pavel-linux-test/v4.4-st5-297-gc0d53c2a5c03d/arm64/defconfig+arm64-chromebook/gcc-10/lab-broonie/baseline-qemu_arm64-virt-gicv2.txt
HTML log: https://storage.kernelci.org//cip-gitlab/ci-pavel-linux-test/v4.4-st5-297-gc0d53c2a5c03d/arm64/defconfig+arm64-chromebook/gcc-10/lab-broonie/baseline-qemu_arm64-virt-gicv2.html
Rootfs: http://storage.kernelci.org/images/rootfs/buildroot/buildroot-baseline/20220513.0/arm64/rootfs.cpio.gz


* baseline.login: https://kernelci.org/test/case/id/6293794a7fed14ec6ba39bd4
failing since 19 days (last pass: v4.19.233-516-ge5e741fbfc87, first fail: v5.10.109-cip5-384-g722204542e8a)



platform | arch | lab | compiler | defconfig | regressions
---------------------------+--------+---------------+----------+------------------------------+------------
qemu_arm64-virt-gicv2 | arm64 | lab-broonie | gcc-10 | defconfig | 1

Details: https://kernelci.org/test/plan/id/62937c2e07d296f427a39be8

Results: 0 PASS, 1 FAIL, 0 SKIP
Full config: defconfig
Compiler: gcc-10 (aarch64-linux-gnu-gcc (Debian 10.2.1-6) 10.2.1 20210110)
Plain log: https://storage.kernelci.org//cip-gitlab/ci-pavel-linux-test/v4.4-st5-297-gc0d53c2a5c03d/arm64/defconfig/gcc-10/lab-broonie/baseline-qemu_arm64-virt-gicv2.txt
HTML log: https://storage.kernelci.org//cip-gitlab/ci-pavel-linux-test/v4.4-st5-297-gc0d53c2a5c03d/arm64/defconfig/gcc-10/lab-broonie/baseline-qemu_arm64-virt-gicv2.html
Rootfs: http://storage.kernelci.org/images/rootfs/buildroot/buildroot-baseline/20220513.0/arm64/rootfs.cpio.gz


* baseline.login: https://kernelci.org/test/case/id/62937c2e07d296f427a39be9
failing since 19 days (last pass: v4.19.233-516-ge5e741fbfc87, first fail: v5.10.109-cip5-384-g722204542e8a)



platform | arch | lab | compiler | defconfig | regressions
---------------------------+--------+---------------+----------+------------------------------+------------
qemu_arm64-virt-gicv2-uefi | arm64 | lab-broonie | gcc-10 | defconfig+arm64-chromebook | 1

Details: https://kernelci.org/test/plan/id/629379487fed14ec6ba39bcd

Results: 0 PASS, 1 FAIL, 0 SKIP
Full config: defconfig+arm64-chromebook
Compiler: gcc-10 (aarch64-linux-gnu-gcc (Debian 10.2.1-6) 10.2.1 20210110)
Plain log: https://storage.kernelci.org//cip-gitlab/ci-pavel-linux-test/v4.4-st5-297-gc0d53c2a5c03d/arm64/defconfig+arm64-chromebook/gcc-10/lab-broonie/baseline-qemu_arm64-virt-gicv2-uefi.txt
HTML log: https://storage.kernelci.org//cip-gitlab/ci-pavel-linux-test/v4.4-st5-297-gc0d53c2a5c03d/arm64/defconfig+arm64-chromebook/gcc-10/lab-broonie/baseline-qemu_arm64-virt-gicv2-uefi.html
Rootfs: http://storage.kernelci.org/images/rootfs/buildroot/buildroot-baseline/20220513.0/arm64/rootfs.cpio.gz


* baseline.login: https://kernelci.org/test/case/id/629379487fed14ec6ba39bce
failing since 19 days (last pass: v4.19.233-516-ge5e741fbfc87, first fail: v5.10.109-cip5-384-g722204542e8a)



platform | arch | lab | compiler | defconfig | regressions
---------------------------+--------+---------------+----------+------------------------------+------------
qemu_arm64-virt-gicv2-uefi | arm64 | lab-broonie | gcc-10 | defconfig | 1

Details: https://kernelci.org/test/plan/id/62937c2d7eb080f440a39bd4

Results: 0 PASS, 1 FAIL, 0 SKIP
Full config: defconfig
Compiler: gcc-10 (aarch64-linux-gnu-gcc (Debian 10.2.1-6) 10.2.1 20210110)
Plain log: https://storage.kernelci.org//cip-gitlab/ci-pavel-linux-test/v4.4-st5-297-gc0d53c2a5c03d/arm64/defconfig/gcc-10/lab-broonie/baseline-qemu_arm64-virt-gicv2-uefi.txt
HTML log: https://storage.kernelci.org//cip-gitlab/ci-pavel-linux-test/v4.4-st5-297-gc0d53c2a5c03d/arm64/defconfig/gcc-10/lab-broonie/baseline-qemu_arm64-virt-gicv2-uefi.html
Rootfs: http://storage.kernelci.org/images/rootfs/buildroot/buildroot-baseline/20220513.0/arm64/rootfs.cpio.gz


* baseline.login: https://kernelci.org/test/case/id/62937c2d7eb080f440a39bd5
failing since 19 days (last pass: v4.19.233-516-ge5e741fbfc87, first fail: v5.10.109-cip5-384-g722204542e8a)



platform | arch | lab | compiler | defconfig | regressions
---------------------------+--------+---------------+----------+------------------------------+------------
qemu_arm64-virt-gicv3 | arm64 | lab-broonie | gcc-10 | defconfig+arm64-chromebook | 1

Details: https://kernelci.org/test/plan/id/6293794b2b9c305145a39bf3

Results: 0 PASS, 1 FAIL, 0 SKIP
Full config: defconfig+arm64-chromebook
Compiler: gcc-10 (aarch64-linux-gnu-gcc (Debian 10.2.1-6) 10.2.1 20210110)
Plain log: https://storage.kernelci.org//cip-gitlab/ci-pavel-linux-test/v4.4-st5-297-gc0d53c2a5c03d/arm64/defconfig+arm64-chromebook/gcc-10/lab-broonie/baseline-qemu_arm64-virt-gicv3.txt
HTML log: https://storage.kernelci.org//cip-gitlab/ci-pavel-linux-test/v4.4-st5-297-gc0d53c2a5c03d/arm64/defconfig+arm64-chromebook/gcc-10/lab-broonie/baseline-qemu_arm64-virt-gicv3.html
Rootfs: http://storage.kernelci.org/images/rootfs/buildroot/buildroot-baseline/20220513.0/arm64/rootfs.cpio.gz


* baseline.login: https://kernelci.org/test/case/id/6293794b2b9c305145a39bf4
failing since 19 days (last pass: v4.19.233-516-ge5e741fbfc87, first fail: v5.10.109-cip5-384-g722204542e8a)



platform | arch | lab | compiler | defconfig | regressions
---------------------------+--------+---------------+----------+------------------------------+------------
qemu_arm64-virt-gicv3 | arm64 | lab-broonie | gcc-10 | defconfig | 1

Details: https://kernelci.org/test/plan/id/62937ca59cd0edcc5fa39bcd

Results: 0 PASS, 1 FAIL, 0 SKIP
Full config: defconfig
Compiler: gcc-10 (aarch64-linux-gnu-gcc (Debian 10.2.1-6) 10.2.1 20210110)
Plain log: https://storage.kernelci.org//cip-gitlab/ci-pavel-linux-test/v4.4-st5-297-gc0d53c2a5c03d/arm64/defconfig/gcc-10/lab-broonie/baseline-qemu_arm64-virt-gicv3.txt
HTML log: https://storage.kernelci.org//cip-gitlab/ci-pavel-linux-test/v4.4-st5-297-gc0d53c2a5c03d/arm64/defconfig/gcc-10/lab-broonie/baseline-qemu_arm64-virt-gicv3.html
Rootfs: http://storage.kernelci.org/images/rootfs/buildroot/buildroot-baseline/20220513.0/arm64/rootfs.cpio.gz


* baseline.login: https://kernelci.org/test/case/id/62937ca59cd0edcc5fa39bce
failing since 19 days (last pass: v4.19.233-516-ge5e741fbfc87, first fail: v5.10.109-cip5-384-g722204542e8a)



platform | arch | lab | compiler | defconfig | regressions
---------------------------+--------+---------------+----------+------------------------------+------------
qemu_arm64-virt-gicv3-uefi | arm64 | lab-broonie | gcc-10 | defconfig+arm64-chromebook | 1

Details: https://kernelci.org/test/plan/id/6293794c7fed14ec6ba39bd9

Results: 0 PASS, 1 FAIL, 0 SKIP
Full config: defconfig+arm64-chromebook
Compiler: gcc-10 (aarch64-linux-gnu-gcc (Debian 10.2.1-6) 10.2.1 20210110)
Plain log: https://storage.kernelci.org//cip-gitlab/ci-pavel-linux-test/v4.4-st5-297-gc0d53c2a5c03d/arm64/defconfig+arm64-chromebook/gcc-10/lab-broonie/baseline-qemu_arm64-virt-gicv3-uefi.txt
HTML log: https://storage.kernelci.org//cip-gitlab/ci-pavel-linux-test/v4.4-st5-297-gc0d53c2a5c03d/arm64/defconfig+arm64-chromebook/gcc-10/lab-broonie/baseline-qemu_arm64-virt-gicv3-uefi.html
Rootfs: http://storage.kernelci.org/images/rootfs/buildroot/buildroot-baseline/20220513.0/arm64/rootfs.cpio.gz


* baseline.login: https://kernelci.org/test/case/id/6293794c7fed14ec6ba39bda
failing since 19 days (last pass: v4.19.233-516-ge5e741fbfc87, first fail: v5.10.109-cip5-384-g722204542e8a)



platform | arch | lab | compiler | defconfig | regressions
---------------------------+--------+---------------+----------+------------------------------+------------
qemu_arm64-virt-gicv3-uefi | arm64 | lab-broonie | gcc-10 | defconfig | 1

Details: https://kernelci.org/test/plan/id/62937c6932bd5dd26ca39bcd

Results: 0 PASS, 1 FAIL, 0 SKIP
Full config: defconfig
Compiler: gcc-10 (aarch64-linux-gnu-gcc (Debian 10.2.1-6) 10.2.1 20210110)
Plain log: https://storage.kernelci.org//cip-gitlab/ci-pavel-linux-test/v4.4-st5-297-gc0d53c2a5c03d/arm64/defconfig/gcc-10/lab-broonie/baseline-qemu_arm64-virt-gicv3-uefi.txt
HTML log: https://storage.kernelci.org//cip-gitlab/ci-pavel-linux-test/v4.4-st5-297-gc0d53c2a5c03d/arm64/defconfig/gcc-10/lab-broonie/baseline-qemu_arm64-virt-gicv3-uefi.html
Rootfs: http://storage.kernelci.org/images/rootfs/buildroot/buildroot-baseline/20220513.0/arm64/rootfs.cpio.gz


* baseline.login: https://kernelci.org/test/case/id/62937c6932bd5dd26ca39bce
failing since 19 days (last pass: v4.19.233-516-ge5e741fbfc87, first fail: v5.10.109-cip5-384-g722204542e8a)



platform | arch | lab | compiler | defconfig | regressions
---------------------------+--------+---------------+----------+------------------------------+------------
qemu_x86_64-uefi-mixed | x86_64 | lab-broonie | gcc-10 | x86_64_defconfig | 1

Details: https://kernelci.org/test/plan/id/62937b3c9b83b98d4da39bd3

Results: 0 PASS, 1 FAIL, 0 SKIP
Full config: x86_64_defconfig
Compiler: gcc-10 (gcc (Debian 10.2.1-6) 10.2.1 20210110)
Plain log: https://storage.kernelci.org//cip-gitlab/ci-pavel-linux-test/v4.4-st5-297-gc0d53c2a5c03d/x86_64/x86_64_defconfig/gcc-10/lab-broonie/baseline-qemu_x86_64-uefi-mixed.txt
HTML log: https://storage.kernelci.org//cip-gitlab/ci-pavel-linux-test/v4.4-st5-297-gc0d53c2a5c03d/x86_64/x86_64_defconfig/gcc-10/lab-broonie/baseline-qemu_x86_64-uefi-mixed.html
Rootfs: http://storage.kernelci.org/images/rootfs/buildroot/buildroot-baseline/20220513.0/x86/rootfs.cpio.gz


* baseline.login: https://kernelci.org/test/case/id/62937b3c9b83b98d4da39bd4
new failure (last pass: v5.10.112-cip6)



platform | arch | lab | compiler | defconfig | regressions
---------------------------+--------+---------------+----------+------------------------------+------------
qemu_x86_64-uefi-mixed | x86_64 | lab-broonie | gcc-10 | x86_64_defcon...6-chromebook | 1

Details: https://kernelci.org/test/plan/id/62937c1907d296f427a39bdc

Results: 0 PASS, 1 FAIL, 0 SKIP
Full config: x86_64_defconfig+x86-chromebook
Compiler: gcc-10 (gcc (Debian 10.2.1-6) 10.2.1 20210110)
Plain log: https://storage.kernelci.org//cip-gitlab/ci-pavel-linux-test/v4.4-st5-297-gc0d53c2a5c03d/x86_64/x86_64_defconfig+x86-chromebook/gcc-10/lab-broonie/baseline-qemu_x86_64-uefi-mixed.txt
HTML log: https://storage.kernelci.org//cip-gitlab/ci-pavel-linux-test/v4.4-st5-297-gc0d53c2a5c03d/x86_64/x86_64_defconfig+x86-chromebook/gcc-10/lab-broonie/baseline-qemu_x86_64-uefi-mixed.html
Rootfs: http://storage.kernelci.org/images/rootfs/buildroot/buildroot-baseline/20220513.0/x86/rootfs.cpio.gz


* baseline.login: https://kernelci.org/test/case/id/62937c1907d296f427a39bdd
new failure (last pass: v5.10.112-cip6)



platform | arch | lab | compiler | defconfig | regressions
---------------------------+--------+---------------+----------+------------------------------+------------
rk3288-veyron-jaq | arm | lab-collabora | gcc-10 | multi_v7_defconfig | 28

Details: https://kernelci.org/test/plan/id/62937a868a62931b29a39be8

Results: 39 PASS, 30 FAIL, 2 SKIP
Full config: multi_v7_defconfig
Compiler: gcc-10 (arm-linux-gnueabihf-gcc (Debian 10.2.1-6) 10.2.1 20210110)
Plain log: https://storage.kernelci.org//cip-gitlab/ci-pavel-linux-test/v4.4-st5-297-gc0d53c2a5c03d/arm/multi_v7_defconfig/gcc-10/lab-collabora/baseline-rk3288-veyron-jaq.txt
HTML log: https://storage.kernelci.org//cip-gitlab/ci-pavel-linux-test/v4.4-st5-297-gc0d53c2a5c03d/arm/multi_v7_defconfig/gcc-10/lab-collabora/baseline-rk3288-veyron-jaq.html
Rootfs: http://storage.kernelci.org/images/rootfs/buildroot/buildroot-baseline/20220513.0/armel/rootfs.cpio.gz


* baseline.bootrr.rockchip-vopl-probed: https://kernelci.org/test/case/id/62937a868a62931b29a39bed
new failure (last pass: v5.10.112-cip6)

2022-05-29T13:51:44.565157 /lava-6497464/1/../bin/lava-test-case
2022-05-29T13:51:44.586128 [ 48.059940] <LAVA_SIGNAL_TESTCASE TEST_CASE_ID=rockchip-vopl-probed RESULT=fail>

* baseline.bootrr.rockchip-vopb-probed: https://kernelci.org/test/case/id/62937a868a62931b29a39bee
new failure (last pass: v5.10.112-cip6)

2022-05-29T13:51:43.502311 /lava-6497464/1/../bin/lava-test-case
2022-05-29T13:51:43.526082 [ 47.000119] <LAVA_SIGNAL_TESTCASE TEST_CASE_ID=rockchip-vopb-probed RESULT=fail>

* baseline.bootrr.rockchip-usb-phy-grf-probed: https://kernelci.org/test/case/id/62937a868a62931b29a39bf0
new failure (last pass: v5.10.112-cip6)

2022-05-29T13:51:42.392288 /lava-6497464/1/../bin/lava-test-case
2022-05-29T13:51:42.417311 [ 45.890720] <LAVA_SIGNAL_TESTCASE TEST_CASE_ID=rockchip-usb-phy-grf-probed RESULT=fail>

* baseline.bootrr.rockchip-pwm0-probed: https://kernelci.org/test/case/id/62937a868a62931b29a39bf8
new failure (last pass: v5.10.112-cip6)

2022-05-29T13:51:41.196852 /lava-6497464/1/../bin/lava-test-case
2022-05-29T13:51:41.222564 [ 44.696057] <LAVA_SIGNAL_TESTCASE TEST_CASE_ID=rockchip-pwm0-probed RESULT=fail>

* baseline.bootrr.rockchip-pm-domain-pmu-probed: https://kernelci.org/test/case/id/62937a868a62931b29a39bfa
new failure (last pass: v5.10.112-cip6)

2022-05-29T13:51:40.109399 /lava-6497464/1/../bin/lava-test-case
2022-05-29T13:51:40.134262 [ 43.607049] <LAVA_SIGNAL_TESTCASE TEST_CASE_ID=rockchip-pm-domain-pmu-probed RESULT=fail>

* baseline.bootrr.rockchip-pm-domain-driver-present: https://kernelci.org/test/case/id/62937a868a62931b29a39bfb
new failure (last pass: v5.10.112-cip6)

2022-05-29T13:51:39.067465 /lava-6497464/1/../bin/lava-test-case
2022-05-29T13:51:39.087950 [ 42.559932] <LAVA_SIGNAL_TESTCASE TEST_CASE_ID=rockchip-pm-domain-driver-present RESULT=fail>

* baseline.bootrr.dwhdmi-rockchip-probed: https://kernelci.org/test/case/id/62937a868a62931b29a39c01
new failure (last pass: v5.10.112-cip6)

2022-05-29T13:51:20.712295 /lava-6497464/1/../bin/lava-test-case
2022-05-29T13:51:20.737197 [ 24.209826] <LAVA_SIGNAL_TESTCASE TEST_CASE_ID=dwhdmi-rockchip-probed RESULT=fail>

* baseline.bootrr.dw_wdt-probed: https://kernelci.org/test/case/id/62937a868a62931b29a39c06
new failure (last pass: v5.10.112-cip6)

2022-05-29T13:51:19.526558 /lava-6497464/1/../bin/lava-test-case
2022-05-29T13:51:19.550340 [ 23.023764] <LAVA_SIGNAL_TESTCASE TEST_CASE_ID=dw_wdt-probed RESULT=fail>

* baseline.bootrr.dw_wdt-driver-present: https://kernelci.org/test/case/id/62937a868a62931b29a39c07
new failure (last pass: v5.10.112-cip6)

2022-05-29T13:51:18.466323 /lava-6497464/1/../bin/lava-test-case
2022-05-29T13:51:18.491300 [ 21.964595] <LAVA_SIGNAL_TESTCASE TEST_CASE_ID=dw_wdt-driver-present RESULT=fail>

* baseline.bootrr.cros-ec-keyb-probed: https://kernelci.org/test/case/id/62937a868a62931b29a39c0c
new failure (last pass: v5.10.112-cip6)

2022-05-29T13:51:17.337470 /lava-6497464/1/../bin/lava-test-case
2022-05-29T13:51:17.360203 [ 20.833988] <LAVA_SIGNAL_TESTCASE TEST_CASE_ID=cros-ec-keyb-probed RESULT=fail>

* baseline.bootrr.cros-ec-i2c-tunnel-probed: https://kernelci.org/test/case/id/62937a868a62931b29a39c0e
new failure (last pass: v5.10.112-cip6)

2022-05-29T13:51:16.241430 /lava-6497464/1/../bin/lava-test-case
2022-05-29T13:51:16.265185 [ 19.738197] <LAVA_SIGNAL_TESTCASE TEST_CASE_ID=cros-ec-i2c-tunnel-probed RESULT=fail>

* baseline.bootrr.rockchip-iodomain-driver-present: https://kernelci.org/test/case/id/62937a868a62931b29a39c0f
new failure (last pass: v5.10.112-cip6)

2022-05-29T13:51:36.973447 /lava-6497464/1/../bin/lava-test-case
2022-05-29T13:51:36.994053 [ 40.464908] <LAVA_SIGNAL_TESTCASE TEST_CASE_ID=rockchip-iodomain-driver-present RESULT=fail>

* baseline.bootrr.rockchip-i2s-probed: https://kernelci.org/test/case/id/62937a868a62931b29a39c10
new failure (last pass: v5.10.112-cip6)

2022-05-29T13:51:35.914275 /lava-6497464/1/../bin/lava-test-case
2022-05-29T13:51:35.934898 [ 39.409777] <LAVA_SIGNAL_TESTCASE TEST_CASE_ID=rockchip-i2s-probed RESULT=fail>

* baseline.bootrr.rockcip-i2s-driver-present: https://kernelci.org/test/case/id/62937a868a62931b29a39c11
new failure (last pass: v5.10.112-cip6)

2022-05-29T13:51:34.855566 /lava-6497464/1/../bin/lava-test-case
2022-05-29T13:51:34.881435 [ 38.350612] <LAVA_SIGNAL_TESTCASE TEST_CASE_ID=rockcip-i2s-driver-present RESULT=fail>

* baseline.bootrr.rockchip-dp-phy-grf-probed: https://kernelci.org/test/case/id/62937a868a62931b29a39c12
new failure (last pass: v5.10.112-cip6)

2022-05-29T13:51:33.791651 /lava-6497464/1/../bin/lava-test-case
2022-05-29T13:51:33.817274 [ 37.290811] <LAVA_SIGNAL_TESTCASE TEST_CASE_ID=rockchip-dp-phy-grf-probed RESULT=fail>

* baseline.bootrr.rockchip-dp-phy-driver-present: https://kernelci.org/test/case/id/62937a868a62931b29a39c13
new failure (last pass: v5.10.112-cip6)

2022-05-29T13:51:32.732778 /lava-6497464/1/../bin/lava-test-case
2022-05-29T13:51:32.758609 [ 36.231152] <LAVA_SIGNAL_TESTCASE TEST_CASE_ID=rockchip-dp-phy-driver-present RESULT=fail>

* baseline.bootrr.rockchip-dp-edp-probed: https://kernelci.org/test/case/id/62937a868a62931b29a39c14
new failure (last pass: v5.10.112-cip6)

2022-05-29T13:51:31.691558 /lava-6497464/1/../bin/lava-test-case
2022-05-29T13:51:31.706589 [ 35.180045] <LAVA_SIGNAL_TESTCASE TEST_CASE_ID=rockchip-dp-edp-probed RESULT=fail>

* baseline.bootrr.rockchip-dp-driver-present: https://kernelci.org/test/case/id/62937a868a62931b29a39c15
new failure (last pass: v5.10.112-cip6)

2022-05-29T13:51:30.629653 /lava-6497464/1/../bin/lava-test-case
2022-05-29T13:51:30.652624 [ 34.125694] <LAVA_SIGNAL_TESTCASE TEST_CASE_ID=rockchip-dp-driver-present RESULT=fail>

* baseline.bootrr.rk_iommu-vpu_mmu-probed: https://kernelci.org/test/case/id/62937a868a62931b29a39c16
new failure (last pass: v5.10.112-cip6)

2022-05-29T13:51:29.566856 /lava-6497464/1/../bin/lava-test-case
2022-05-29T13:51:29.591713 [ 33.065310] <LAVA_SIGNAL_TESTCASE TEST_CASE_ID=rk_iommu-vpu_mmu-probed RESULT=fail>

* baseline.bootrr.rk_iommu-vopl_mmu-probed: https://kernelci.org/test/case/id/62937a868a62931b29a39c17
new failure (last pass: v5.10.112-cip6)

2022-05-29T13:51:28.510771 /lava-6497464/1/../bin/lava-test-case
2022-05-29T13:51:28.531726 [ 32.004846] <LAVA_SIGNAL_TESTCASE TEST_CASE_ID=rk_iommu-vopl_mmu-probed RESULT=fail>

* baseline.bootrr.rk_iommu-vopb_mmu-probed: https://kernelci.org/test/case/id/62937a868a62931b29a39c18
new failure (last pass: v5.10.112-cip6)

2022-05-29T13:51:27.445865 /lava-6497464/1/../bin/lava-test-case
2022-05-29T13:51:27.471785 [ 30.945265] <LAVA_SIGNAL_TESTCASE TEST_CASE_ID=rk_iommu-vopb_mmu-probed RESULT=fail>

* baseline.bootrr.rk3288-crypto-probed: https://kernelci.org/test/case/id/62937a868a62931b29a39c20
new failure (last pass: v5.10.112-cip6)

2022-05-29T13:51:26.197187 /lava-6497464/1/../bin/lava-test-case
2022-05-29T13:51:26.223087 [ 29.696445] <LAVA_SIGNAL_TESTCASE TEST_CASE_ID=rk3288-crypto-probed RESULT=fail>

* baseline.bootrr.rk3288-crypto-driver-present: https://kernelci.org/test/case/id/62937a868a62931b29a39c21
new failure (last pass: v5.10.112-cip6)

2022-05-29T13:51:25.137338 /lava-6497464/1/../bin/lava-test-case
2022-05-29T13:51:25.163105 [ 28.635754] <LAVA_SIGNAL_TESTCASE TEST_CASE_ID=rk3288-crypto-driver-present RESULT=fail>

* baseline.bootrr.ramoops-probed: https://kernelci.org/test/case/id/62937a868a62931b29a39c22
new failure (last pass: v5.10.112-cip6)

2022-05-29T13:51:24.082773 /lava-6497464/1/../bin/lava-test-case
2022-05-29T13:51:24.108204 [ 27.579556] <LAVA_SIGNAL_TESTCASE TEST_CASE_ID=ramoops-probed RESULT=fail>

* baseline.bootrr.ramoops-driver-present: https://kernelci.org/test/case/id/62937a868a62931b29a39c23
new failure (last pass: v5.10.112-cip6)

2022-05-29T13:51:23.022247 /lava-6497464/1/../bin/lava-test-case
2022-05-29T13:51:23.047990 [ 26.520904] <LAVA_SIGNAL_TESTCASE TEST_CASE_ID=ramoops-driver-present RESULT=fail>

* baseline.bootrr.cros-ec-i2c-tunnel-driver-present: https://kernelci.org/test/case/id/62937a868a62931b29a39c28
new failure (last pass: v5.10.112-cip6)

2022-05-29T13:51:15.183287 /lava-6497464/1/../bin/lava-test-case
2022-05-29T13:51:15.209131 [ 18.677801] <LAVA_SIGNAL_TESTCASE TEST_CASE_ID=cros-ec-i2c-tunnel-driver-present RESULT=fail>

* baseline.bootrr.cros-ec-dev-probed: https://kernelci.org/test/case/id/62937a868a62931b29a39c29
new failure (last pass: v5.10.112-cip6)

2022-05-29T13:51:13.196216 [ 16.670010] usb 3-1.1: new high-speed USB device number 3 using dwc2
2022-05-29T13:51:13.301252 [ 16.778608] smsc95xx v1.0.4
2022-05-29T13:51:13.363313 [ 16.831523] smsc95xx 3-1.1:1.0 eth0: register 'smsc95xx' at usb-ff580000.usb-1.1, smsc95xx USB 2.0 Ethernet, 94:eb:2c:00:05:24
2022-05-29T13:51:13.381210 [ 16.851158] dwmmc_rockchip ff0d0000.dwmmc: IDMAC supports 32-bit address mode.
2022-05-29T13:51:13.386397 [ 16.859139] dwmmc_rockchip ff0d0000.dwmmc: Using internal DMA controller.
2022-05-29T13:51:13.391528 [ 16.866093] dwmmc_rockchip ff0d0000.dwmmc: Version ID is 270a
2022-05-29T13:51:13.401271 [ 16.871980] dwmmc_rockchip ff0d0000.dwmmc: DW MMC controller at irq 30,32 bit host data width,256 deep fifo
2022-05-29T13:51:13.882373 [ 17.357702] random: nonblocking pool is initialized
2022-05-29T13:51:14.124004 /lava-6497464/1/../bin/lava-test-case
2022-05-29T13:51:14.144558 [ 17.619341] <LAVA_SIGNAL_TESTCASE TEST_CASE_ID=cros-ec-dev-probed RESULT=fail>

* baseline.bootrr.cros-ec-dev-driver-present: https://kernelci.org/test/case/id/62937a868a62931b29a39c2a
new failure (last pass: v5.10.112-cip6)

2022-05-29T13:51:12.394346 [ 15.860308] dwc2 ff580000.usb: DWC OTG Controller
2022-05-29T13:51:12.394681 [ 15.865090] dwc2 ff580000.usb: new USB bus registered, assigned bus number 3
2022-05-29T13:51:12.399442 [ 15.872200] dwc2 ff580000.usb: irq 43, io mem 0x00000000
2022-05-29T13:51:12.404764 [ 15.878372] hub 3-0:1.0: USB hub found
2022-05-29T13:51:12.404998 [ 15.882199] hub 3-0:1.0: 1 port detected
2022-05-29T13:51:12.415125 [ 15.889649] dwmmc_rockchip ff0d0000.dwmmc: IDMAC supports 32-bit address mode.
2022-05-29T13:51:12.432312 [ 15.897079] dwmmc_rockchip ff0d0000.dwmmc: Using internal DMA controller.
2022-05-29T13:51:12.432548 [ 15.903902] dwmmc_rockchip ff0d0000.dwmmc: Version ID is 270a
2022-05-29T13:51:12.437404 [ 15.909693] dwmmc_rockchip ff0d0000.dwmmc: DW MMC controller at irq 30,32 bit host data width,256 deep fifo
2022-05-29T13:51:12.699605 [ 16.174977] usb 3-1: new high-speed USB device number 2 using dwc2
... (8 line(s) more)


cip-gitlab/ci/pavel/linux-test baseline-cip-nfs: 6 runs, 6 regressions (v4.4-st5-297-gc0d53c2a5c03d) #kernelci

kernelci.org bot <bot@...>
 

cip-gitlab/ci/pavel/linux-test baseline-cip-nfs: 6 runs, 6 regressions (v4.4-st5-297-gc0d53c2a5c03d)

Regressions Summary
-------------------

platform | arch | lab | compiler | defconfig | regressions
--------------------------+--------+---------------+----------+------------------------------+------------
beaglebone-black | arm | lab-broonie | gcc-10 | multi_v7_defconfig | 1
beaglebone-black | arm | lab-cip | gcc-10 | multi_v7_defconfig | 1
beaglebone-black | arm | lab-broonie | gcc-10 | omap2plus_defconfig | 1
beaglebone-black | arm | lab-cip | gcc-10 | omap2plus_defconfig | 1
hp-11A-G6-EE-grunt | x86_64 | lab-collabora | gcc-10 | x86_64_defcon...6-chromebook | 1
hp-x360-12b-n4000-octopus | x86_64 | lab-collabora | gcc-10 | x86_64_defcon...6-chromebook | 1

Details: https://kernelci.org/test/job/cip-gitlab/branch/ci%2Fpavel%2Flinux-test/kernel/v4.4-st5-297-gc0d53c2a5c03d/plan/baseline-cip-nfs/

Test: baseline-cip-nfs
Tree: cip-gitlab
Branch: ci/pavel/linux-test
Describe: v4.4-st5-297-gc0d53c2a5c03d
URL: https://gitlab.com/cip-project/cip-kernel/linux-cip.git
SHA: c0d53c2a5c03d0b2672a56140f211b51b3e047c1


Test Regressions
----------------


platform | arch | lab | compiler | defconfig | regressions
--------------------------+--------+---------------+----------+------------------------------+------------
beaglebone-black | arm | lab-broonie | gcc-10 | multi_v7_defconfig | 1

Details: https://kernelci.org/test/plan/id/62937b169b83b98d4da39bcd

Results: 0 PASS, 1 FAIL, 0 SKIP
Full config: multi_v7_defconfig
Compiler: gcc-10 (arm-linux-gnueabihf-gcc (Debian 10.2.1-6) 10.2.1 20210110)
Plain log: https://storage.kernelci.org//cip-gitlab/ci-pavel-linux-test/v4.4-st5-297-gc0d53c2a5c03d/arm/multi_v7_defconfig/gcc-10/lab-broonie/baseline-cip-nfs-beaglebone-black.txt
HTML log: https://storage.kernelci.org//cip-gitlab/ci-pavel-linux-test/v4.4-st5-297-gc0d53c2a5c03d/arm/multi_v7_defconfig/gcc-10/lab-broonie/baseline-cip-nfs-beaglebone-black.html
Rootfs: https://storage.kernelci.org/images/rootfs/cip/20211105/qemu-arm/cip-core-image-kernelci-cip-core-buster-qemu-arm-initrd.img.gz


* baseline-cip-nfs.login: https://kernelci.org/test/case/id/62937b169b83b98d4da39bce
failing since 18 days (last pass: v5.10.109-cip5-384-g722204542e8a, first fail: v4.4-st5-260-gb0fe64f485ff)



platform | arch | lab | compiler | defconfig | regressions
--------------------------+--------+---------------+----------+------------------------------+------------
beaglebone-black | arm | lab-cip | gcc-10 | multi_v7_defconfig | 1

Details: https://kernelci.org/test/plan/id/629379d20c87d0b49ea39bcd

Results: 3 PASS, 1 FAIL, 0 SKIP
Full config: multi_v7_defconfig
Compiler: gcc-10 (arm-linux-gnueabihf-gcc (Debian 10.2.1-6) 10.2.1 20210110)
Plain log: https://storage.kernelci.org//cip-gitlab/ci-pavel-linux-test/v4.4-st5-297-gc0d53c2a5c03d/arm/multi_v7_defconfig/gcc-10/lab-cip/baseline-cip-nfs-beaglebone-black.txt
HTML log: https://storage.kernelci.org//cip-gitlab/ci-pavel-linux-test/v4.4-st5-297-gc0d53c2a5c03d/arm/multi_v7_defconfig/gcc-10/lab-cip/baseline-cip-nfs-beaglebone-black.html
Rootfs: https://storage.kernelci.org/images/rootfs/cip/20211105/qemu-arm/cip-core-image-kernelci-cip-core-buster-qemu-arm-initrd.img.gz


* baseline-cip-nfs.dmesg.crit: https://kernelci.org/test/case/id/629379d20c87d0b49ea39bd0
new failure (last pass: v5.10.112-cip6)
1 lines

2022-05-29T13:48:50.392324 / #
2022-05-29T13:48:50.394827
2022-05-29T13:48:55.420403 / # export NFS_ROOTFS='/var/lib/lava/dispatcher/tmp/688596/extract-nfsrootfs-k3oj1di3'
2022-05-29T13:48:55.431083 export NFS_ROOTFS='/var/lib/lava/dispatcher/tmp/688596/extract-nfsrootfs-</lib/lava/dispatcher/tmp/688596/extract-nfsrootfs-k 3oj1di3'
2022-05-29T13:48:57.602276 / # export NFS_SERVER_IP='192.168.11.5'
2022-05-29T13:48:57.612927 export NFS_SERVER_IP='192.168.11.5'
2022-05-29T13:48:57.718733 / # #
2022-05-29T13:48:57.721138 #
2022-05-29T13:48:57.836863 / # export SHELL=/bin/sh
2022-05-29T13:48:57.839190 export SHELL=/bin/sh
... (13 line(s) more)



platform | arch | lab | compiler | defconfig | regressions
--------------------------+--------+---------------+----------+------------------------------+------------
beaglebone-black | arm | lab-broonie | gcc-10 | omap2plus_defconfig | 1

Details: https://kernelci.org/test/plan/id/62937c7e32bd5dd26ca39bd2

Results: 0 PASS, 1 FAIL, 0 SKIP
Full config: omap2plus_defconfig
Compiler: gcc-10 (arm-linux-gnueabihf-gcc (Debian 10.2.1-6) 10.2.1 20210110)
Plain log: https://storage.kernelci.org//cip-gitlab/ci-pavel-linux-test/v4.4-st5-297-gc0d53c2a5c03d/arm/omap2plus_defconfig/gcc-10/lab-broonie/baseline-cip-nfs-beaglebone-black.txt
HTML log: https://storage.kernelci.org//cip-gitlab/ci-pavel-linux-test/v4.4-st5-297-gc0d53c2a5c03d/arm/omap2plus_defconfig/gcc-10/lab-broonie/baseline-cip-nfs-beaglebone-black.html
Rootfs: https://storage.kernelci.org/images/rootfs/cip/20211105/qemu-arm/cip-core-image-kernelci-cip-core-buster-qemu-arm-initrd.img.gz


* baseline-cip-nfs.login: https://kernelci.org/test/case/id/62937c7e32bd5dd26ca39bd3
failing since 1 day (last pass: v4.4-st5-1797-gb2b8419761095, first fail: v5.10.112-cip6)



platform | arch | lab | compiler | defconfig | regressions
--------------------------+--------+---------------+----------+------------------------------+------------
beaglebone-black | arm | lab-cip | gcc-10 | omap2plus_defconfig | 1

Details: https://kernelci.org/test/plan/id/62937a3e3e2a6da913a39bd9

Results: 3 PASS, 1 FAIL, 0 SKIP
Full config: omap2plus_defconfig
Compiler: gcc-10 (arm-linux-gnueabihf-gcc (Debian 10.2.1-6) 10.2.1 20210110)
Plain log: https://storage.kernelci.org//cip-gitlab/ci-pavel-linux-test/v4.4-st5-297-gc0d53c2a5c03d/arm/omap2plus_defconfig/gcc-10/lab-cip/baseline-cip-nfs-beaglebone-black.txt
HTML log: https://storage.kernelci.org//cip-gitlab/ci-pavel-linux-test/v4.4-st5-297-gc0d53c2a5c03d/arm/omap2plus_defconfig/gcc-10/lab-cip/baseline-cip-nfs-beaglebone-black.html
Rootfs: https://storage.kernelci.org/images/rootfs/cip/20211105/qemu-arm/cip-core-image-kernelci-cip-core-buster-qemu-arm-initrd.img.gz


* baseline-cip-nfs.dmesg.crit: https://kernelci.org/test/case/id/62937a3e3e2a6da913a39bdc
new failure (last pass: v5.10.112-cip6)
1 lines

2022-05-29T13:50:21.084580 / #
2022-05-29T13:50:21.094224
2022-05-29T13:50:26.119239 / # export NFS_ROOTFS='/var/lib/lava/dispatcher/tmp/688598/extract-nfsrootfs-bmey4rcr'
2022-05-29T13:50:26.130051 export NFS_ROOTFS='/var/lib/lava/dispatcher/tmp/688598/extract-nfsrootfs-</lib/lava/dispatcher/tmp/688598/extract-nfsrootfs-b mey4rcr'
2022-05-29T13:50:28.202752 / # export NFS_SERVER_IP='172.16.3.3'
2022-05-29T13:50:28.213542 export NFS_SERVER_IP='172.16.3.3'
2022-05-29T13:50:28.343031 / # #
2022-05-29T13:50:28.351032 #
2022-05-29T13:50:28.480500 / # export SHELL=/bin/sh
2022-05-29T13:50:28.488355 export SHELL=/bin/sh
... (13 line(s) more)



platform | arch | lab | compiler | defconfig | regressions
--------------------------+--------+---------------+----------+------------------------------+------------
hp-11A-G6-EE-grunt | x86_64 | lab-collabora | gcc-10 | x86_64_defcon...6-chromebook | 1

Details: https://kernelci.org/test/plan/id/629379a52c990460eea39bcd

Results: 0 PASS, 1 FAIL, 0 SKIP
Full config: x86_64_defconfig+x86-chromebook
Compiler: gcc-10 (gcc (Debian 10.2.1-6) 10.2.1 20210110)
Plain log: https://storage.kernelci.org//cip-gitlab/ci-pavel-linux-test/v4.4-st5-297-gc0d53c2a5c03d/x86_64/x86_64_defconfig+x86-chromebook/gcc-10/lab-collabora/baseline-cip-nfs-hp-11A-G6-EE-grunt.txt
HTML log: https://storage.kernelci.org//cip-gitlab/ci-pavel-linux-test/v4.4-st5-297-gc0d53c2a5c03d/x86_64/x86_64_defconfig+x86-chromebook/gcc-10/lab-collabora/baseline-cip-nfs-hp-11A-G6-EE-grunt.html
Rootfs: https://storage.kernelci.org/images/rootfs/cip/20211105/qemu-amd64/cip-core-image-kernelci-cip-core-buster-qemu-amd64-initrd.img.gz


* baseline-cip-nfs.login: https://kernelci.org/test/case/id/629379a52c990460eea39bce
new failure (last pass: v5.10.112-cip6)



platform | arch | lab | compiler | defconfig | regressions
--------------------------+--------+---------------+----------+------------------------------+------------
hp-x360-12b-n4000-octopus | x86_64 | lab-collabora | gcc-10 | x86_64_defcon...6-chromebook | 1

Details: https://kernelci.org/test/plan/id/62937db97ad1184be6a39bd2

Results: 0 PASS, 1 FAIL, 0 SKIP
Full config: x86_64_defconfig+x86-chromebook
Compiler: gcc-10 (gcc (Debian 10.2.1-6) 10.2.1 20210110)
Plain log: https://storage.kernelci.org//cip-gitlab/ci-pavel-linux-test/v4.4-st5-297-gc0d53c2a5c03d/x86_64/x86_64_defconfig+x86-chromebook/gcc-10/lab-collabora/baseline-cip-nfs-hp-x360-12b-n4000-octopus.txt
HTML log: https://storage.kernelci.org//cip-gitlab/ci-pavel-linux-test/v4.4-st5-297-gc0d53c2a5c03d/x86_64/x86_64_defconfig+x86-chromebook/gcc-10/lab-collabora/baseline-cip-nfs-hp-x360-12b-n4000-octopus.html
Rootfs: https://storage.kernelci.org/images/rootfs/cip/20211105/qemu-amd64/cip-core-image-kernelci-cip-core-buster-qemu-amd64-initrd.img.gz


* baseline-cip-nfs.login: https://kernelci.org/test/case/id/62937db97ad1184be6a39bd3
new failure (last pass: v5.10.112-cip6)


cip-gitlab/ci/pavel/linux-test baseline-nfs: 27 runs, 13 regressions (v4.4-st5-297-gc0d53c2a5c03d) #kernelci

kernelci.org bot <bot@...>
 

cip-gitlab/ci/pavel/linux-test baseline-nfs: 27 runs, 13 regressions (v4.4-st5-297-gc0d53c2a5c03d)

Regressions Summary
-------------------

platform | arch | lab | compiler | defconfig | regressions
--------------------------+--------+---------------+----------+------------------------------+------------
asus-C433TA-AJ0005-rammus | x86_64 | lab-collabora | gcc-10 | x86_64_defcon...6-chromebook | 1
asus-C436FA-Flip-hatch | x86_64 | lab-collabora | gcc-10 | x86_64_defcon...6-chromebook | 1
asus-C523NA-A20057-coral | x86_64 | lab-collabora | gcc-10 | x86_64_defcon...6-chromebook | 1
asus-cx9400-volteer | x86_64 | lab-collabora | gcc-10 | x86_64_defcon...6-chromebook | 1
beaglebone-black | arm | lab-broonie | gcc-10 | multi_v7_defconfig | 1
beaglebone-black | arm | lab-cip | gcc-10 | multi_v7_defconfig | 1
beaglebone-black | arm | lab-broonie | gcc-10 | omap2plus_defconfig | 1
beaglebone-black | arm | lab-cip | gcc-10 | omap2plus_defconfig | 1
hp-11A-G6-EE-grunt | x86_64 | lab-collabora | gcc-10 | x86_64_defcon...6-chromebook | 1
hp-x360-12b-n4000-octopus | x86_64 | lab-collabora | gcc-10 | x86_64_defcon...6-chromebook | 1
hp-x360-14-G1-sona | x86_64 | lab-collabora | gcc-10 | x86_64_defcon...6-chromebook | 1
juno-uboot | arm64 | lab-broonie | gcc-10 | defconfig | 1
rk3288-veyron-jaq | arm | lab-collabora | gcc-10 | multi_v7_defconfig | 1

Details: https://kernelci.org/test/job/cip-gitlab/branch/ci%2Fpavel%2Flinux-test/kernel/v4.4-st5-297-gc0d53c2a5c03d/plan/baseline-nfs/

Test: baseline-nfs
Tree: cip-gitlab
Branch: ci/pavel/linux-test
Describe: v4.4-st5-297-gc0d53c2a5c03d
URL: https://gitlab.com/cip-project/cip-kernel/linux-cip.git
SHA: c0d53c2a5c03d0b2672a56140f211b51b3e047c1


Test Regressions
----------------


platform | arch | lab | compiler | defconfig | regressions
--------------------------+--------+---------------+----------+------------------------------+------------
asus-C433TA-AJ0005-rammus | x86_64 | lab-collabora | gcc-10 | x86_64_defcon...6-chromebook | 1

Details: https://kernelci.org/test/plan/id/6293797c903f0eaf0aa39bd3

Results: 0 PASS, 1 FAIL, 0 SKIP
Full config: x86_64_defconfig+x86-chromebook
Compiler: gcc-10 (gcc (Debian 10.2.1-6) 10.2.1 20210110)
Plain log: https://storage.kernelci.org//cip-gitlab/ci-pavel-linux-test/v4.4-st5-297-gc0d53c2a5c03d/x86_64/x86_64_defconfig+x86-chromebook/gcc-10/lab-collabora/baseline-nfs-asus-C433TA-AJ0005-rammus.txt
HTML log: https://storage.kernelci.org//cip-gitlab/ci-pavel-linux-test/v4.4-st5-297-gc0d53c2a5c03d/x86_64/x86_64_defconfig+x86-chromebook/gcc-10/lab-collabora/baseline-nfs-asus-C433TA-AJ0005-rammus.html
Rootfs: http://storage.kernelci.org/images/rootfs/debian/bullseye/20220513.0/amd64/initrd.cpio.gz


* baseline-nfs.login: https://kernelci.org/test/case/id/6293797c903f0eaf0aa39bd4
new failure (last pass: v5.10.112-cip6)



platform | arch | lab | compiler | defconfig | regressions
--------------------------+--------+---------------+----------+------------------------------+------------
asus-C436FA-Flip-hatch | x86_64 | lab-collabora | gcc-10 | x86_64_defcon...6-chromebook | 1

Details: https://kernelci.org/test/plan/id/62937d6b5c0cf339f0a39bcd

Results: 0 PASS, 1 FAIL, 0 SKIP
Full config: x86_64_defconfig+x86-chromebook
Compiler: gcc-10 (gcc (Debian 10.2.1-6) 10.2.1 20210110)
Plain log: https://storage.kernelci.org//cip-gitlab/ci-pavel-linux-test/v4.4-st5-297-gc0d53c2a5c03d/x86_64/x86_64_defconfig+x86-chromebook/gcc-10/lab-collabora/baseline-nfs-asus-C436FA-Flip-hatch.txt
HTML log: https://storage.kernelci.org//cip-gitlab/ci-pavel-linux-test/v4.4-st5-297-gc0d53c2a5c03d/x86_64/x86_64_defconfig+x86-chromebook/gcc-10/lab-collabora/baseline-nfs-asus-C436FA-Flip-hatch.html
Rootfs: http://storage.kernelci.org/images/rootfs/debian/bullseye/20220513.0/amd64/initrd.cpio.gz


* baseline-nfs.login: https://kernelci.org/test/case/id/62937d6b5c0cf339f0a39bce
new failure (last pass: v5.10.112-cip6)



platform | arch | lab | compiler | defconfig | regressions
--------------------------+--------+---------------+----------+------------------------------+------------
asus-C523NA-A20057-coral | x86_64 | lab-collabora | gcc-10 | x86_64_defcon...6-chromebook | 1

Details: https://kernelci.org/test/plan/id/629379e8ef01d07f1ca39bde

Results: 0 PASS, 1 FAIL, 0 SKIP
Full config: x86_64_defconfig+x86-chromebook
Compiler: gcc-10 (gcc (Debian 10.2.1-6) 10.2.1 20210110)
Plain log: https://storage.kernelci.org//cip-gitlab/ci-pavel-linux-test/v4.4-st5-297-gc0d53c2a5c03d/x86_64/x86_64_defconfig+x86-chromebook/gcc-10/lab-collabora/baseline-nfs-asus-C523NA-A20057-coral.txt
HTML log: https://storage.kernelci.org//cip-gitlab/ci-pavel-linux-test/v4.4-st5-297-gc0d53c2a5c03d/x86_64/x86_64_defconfig+x86-chromebook/gcc-10/lab-collabora/baseline-nfs-asus-C523NA-A20057-coral.html
Rootfs: http://storage.kernelci.org/images/rootfs/debian/bullseye/20220513.0/amd64/initrd.cpio.gz


* baseline-nfs.login: https://kernelci.org/test/case/id/629379e8ef01d07f1ca39bdf
new failure (last pass: v5.10.112-cip6)



platform | arch | lab | compiler | defconfig | regressions
--------------------------+--------+---------------+----------+------------------------------+------------
asus-cx9400-volteer | x86_64 | lab-collabora | gcc-10 | x86_64_defcon...6-chromebook | 1

Details: https://kernelci.org/test/plan/id/62937a80c2cbec76d8a39bf3

Results: 0 PASS, 1 FAIL, 0 SKIP
Full config: x86_64_defconfig+x86-chromebook
Compiler: gcc-10 (gcc (Debian 10.2.1-6) 10.2.1 20210110)
Plain log: https://storage.kernelci.org//cip-gitlab/ci-pavel-linux-test/v4.4-st5-297-gc0d53c2a5c03d/x86_64/x86_64_defconfig+x86-chromebook/gcc-10/lab-collabora/baseline-nfs-asus-cx9400-volteer.txt
HTML log: https://storage.kernelci.org//cip-gitlab/ci-pavel-linux-test/v4.4-st5-297-gc0d53c2a5c03d/x86_64/x86_64_defconfig+x86-chromebook/gcc-10/lab-collabora/baseline-nfs-asus-cx9400-volteer.html
Rootfs: http://storage.kernelci.org/images/rootfs/debian/bullseye/20220513.0/amd64/initrd.cpio.gz


* baseline-nfs.login: https://kernelci.org/test/case/id/62937a80c2cbec76d8a39bf4
new failure (last pass: v5.10.112-cip6)



platform | arch | lab | compiler | defconfig | regressions
--------------------------+--------+---------------+----------+------------------------------+------------
beaglebone-black | arm | lab-broonie | gcc-10 | multi_v7_defconfig | 1

Details: https://kernelci.org/test/plan/id/629379492b9c305145a39be7

Results: 3 PASS, 1 FAIL, 1 SKIP
Full config: multi_v7_defconfig
Compiler: gcc-10 (arm-linux-gnueabihf-gcc (Debian 10.2.1-6) 10.2.1 20210110)
Plain log: https://storage.kernelci.org//cip-gitlab/ci-pavel-linux-test/v4.4-st5-297-gc0d53c2a5c03d/arm/multi_v7_defconfig/gcc-10/lab-broonie/baseline-nfs-beaglebone-black.txt
HTML log: https://storage.kernelci.org//cip-gitlab/ci-pavel-linux-test/v4.4-st5-297-gc0d53c2a5c03d/arm/multi_v7_defconfig/gcc-10/lab-broonie/baseline-nfs-beaglebone-black.html
Rootfs: http://storage.kernelci.org/images/rootfs/debian/bullseye/20220513.0/armhf/initrd.cpio.gz


* baseline-nfs.dmesg.crit: https://kernelci.org/test/case/id/629379492b9c305145a39bee
new failure (last pass: v5.10.112-cip6)
1 lines

2022-05-29T13:46:34.703246 / #
2022-05-29T13:46:34.710390
2022-05-29T13:46:39.725789 / # export NFS_ROOTFS='/var/lib/lava/dispatcher/tmp/182639/extract-nfsrootfs-c_mff3e7'
2022-05-29T13:46:39.736397 export NFS_ROOTFS='/var/lib/lava/dispatcher/tmp/182639/extract-nfsrootfs-c_mff3e7'
2022-05-29T13:46:42.026332 / # export NFS_SERVER_IP='192.168.56.230'
2022-05-29T13:46:42.037276 export NFS_SERVER_IP='192.168.56.230'
2022-05-29T13:46:42.142181 / # #
2022-05-29T13:46:42.149041 #
2022-05-29T13:46:42.251199 / # export SHELL=/bin/sh
2022-05-29T13:46:42.258078 export SHELL=/bin/sh
... (13 line(s) more)



platform | arch | lab | compiler | defconfig | regressions
--------------------------+--------+---------------+----------+------------------------------+------------
beaglebone-black | arm | lab-cip | gcc-10 | multi_v7_defconfig | 1

Details: https://kernelci.org/test/plan/id/629378e2d86a063ffea39be5

Results: 3 PASS, 1 FAIL, 1 SKIP
Full config: multi_v7_defconfig
Compiler: gcc-10 (arm-linux-gnueabihf-gcc (Debian 10.2.1-6) 10.2.1 20210110)
Plain log: https://storage.kernelci.org//cip-gitlab/ci-pavel-linux-test/v4.4-st5-297-gc0d53c2a5c03d/arm/multi_v7_defconfig/gcc-10/lab-cip/baseline-nfs-beaglebone-black.txt
HTML log: https://storage.kernelci.org//cip-gitlab/ci-pavel-linux-test/v4.4-st5-297-gc0d53c2a5c03d/arm/multi_v7_defconfig/gcc-10/lab-cip/baseline-nfs-beaglebone-black.html
Rootfs: http://storage.kernelci.org/images/rootfs/debian/bullseye/20220513.0/armhf/initrd.cpio.gz


* baseline-nfs.dmesg.crit: https://kernelci.org/test/case/id/629378e2d86a063ffea39bea
new failure (last pass: v5.10.112-cip6)
1 lines

2022-05-29T13:44:47.405177 / #
2022-05-29T13:44:47.407468
2022-05-29T13:44:52.417160 / # export NFS_ROOTFS='/var/lib/lava/dispatcher/tmp/688593/extract-nfsrootfs-g01xp3va'
2022-05-29T13:44:52.427857 export NFS_ROOTFS='/var/lib/lava/dispatcher/tmp/688593/extract-nfsrootfs-g01xp3va'
2022-05-29T13:44:54.594255 / # export NFS_SERVER_IP='192.168.11.5'
2022-05-29T13:44:54.604936 export NFS_SERVER_IP='192.168.11.5'
2022-05-29T13:44:54.708264 / # #
2022-05-29T13:44:54.710625 #
2022-05-29T13:44:54.813811 / # export SHELL=/bin/sh
2022-05-29T13:44:54.816049 export SHELL=/bin/sh
... (13 line(s) more)



platform | arch | lab | compiler | defconfig | regressions
--------------------------+--------+---------------+----------+------------------------------+------------
beaglebone-black | arm | lab-broonie | gcc-10 | omap2plus_defconfig | 1

Details: https://kernelci.org/test/plan/id/62937d1e2060e2625fa39bcd

Results: 3 PASS, 1 FAIL, 1 SKIP
Full config: omap2plus_defconfig
Compiler: gcc-10 (arm-linux-gnueabihf-gcc (Debian 10.2.1-6) 10.2.1 20210110)
Plain log: https://storage.kernelci.org//cip-gitlab/ci-pavel-linux-test/v4.4-st5-297-gc0d53c2a5c03d/arm/omap2plus_defconfig/gcc-10/lab-broonie/baseline-nfs-beaglebone-black.txt
HTML log: https://storage.kernelci.org//cip-gitlab/ci-pavel-linux-test/v4.4-st5-297-gc0d53c2a5c03d/arm/omap2plus_defconfig/gcc-10/lab-broonie/baseline-nfs-beaglebone-black.html
Rootfs: http://storage.kernelci.org/images/rootfs/debian/bullseye/20220513.0/armhf/initrd.cpio.gz


* baseline-nfs.dmesg.crit: https://kernelci.org/test/case/id/62937d1e2060e2625fa39bd4
new failure (last pass: v5.10.112-cip6)
1 lines

2022-05-29T14:02:52.385739 / #
2022-05-29T14:02:52.419009
2022-05-29T14:02:57.496547 / # export NFS_ROOTFS='/var/lib/lava/dispatcher/tmp/182662/extract-nfsrootfs-fwbhjhbg'
2022-05-29T14:02:57.507523 export NFS_ROOTFS='/var/lib/lava/dispatcher/tmp/182662/extract-nfsrootfs-fwbhjhbg'
2022-05-29T14:02:59.805834 / # export NFS_SERVER_IP='192.168.56.230'
2022-05-29T14:02:59.816825 export NFS_SERVER_IP='192.168.56.230'
2022-05-29T14:02:59.928271 / # #
2022-05-29T14:02:59.933893 #
2022-05-29T14:03:00.047716 / # export SHELL=/bin/sh
2022-05-29T14:03:00.053307 export SHELL=/bin/sh
... (13 line(s) more)



platform | arch | lab | compiler | defconfig | regressions
--------------------------+--------+---------------+----------+------------------------------+------------
beaglebone-black | arm | lab-cip | gcc-10 | omap2plus_defconfig | 1

Details: https://kernelci.org/test/plan/id/62937a533e2a6da913a39be4

Results: 3 PASS, 1 FAIL, 1 SKIP
Full config: omap2plus_defconfig
Compiler: gcc-10 (arm-linux-gnueabihf-gcc (Debian 10.2.1-6) 10.2.1 20210110)
Plain log: https://storage.kernelci.org//cip-gitlab/ci-pavel-linux-test/v4.4-st5-297-gc0d53c2a5c03d/arm/omap2plus_defconfig/gcc-10/lab-cip/baseline-nfs-beaglebone-black.txt
HTML log: https://storage.kernelci.org//cip-gitlab/ci-pavel-linux-test/v4.4-st5-297-gc0d53c2a5c03d/arm/omap2plus_defconfig/gcc-10/lab-cip/baseline-nfs-beaglebone-black.html
Rootfs: http://storage.kernelci.org/images/rootfs/debian/bullseye/20220513.0/armhf/initrd.cpio.gz


* baseline-nfs.dmesg.crit: https://kernelci.org/test/case/id/62937a533e2a6da913a39be9
new failure (last pass: v5.10.112-cip6)
1 lines

2022-05-29T13:50:39.922671 / #
2022-05-29T13:50:39.930544
2022-05-29T13:50:44.945880 / # export NFS_ROOTFS='/var/lib/lava/dispatcher/tmp/688599/extract-nfsrootfs-1_7zvemm'
2022-05-29T13:50:44.958351 export NFS_ROOTFS='/var/lib/lava/dispatcher/tmp/688599/extract-nfsrootfs-1_7zvemm'
2022-05-29T13:50:47.013890 / # export NFS_SERVER_IP='172.16.3.3'
2022-05-29T13:50:47.024718 export NFS_SERVER_IP='172.16.3.3'
2022-05-29T13:50:47.137102 / # #
2022-05-29T13:50:47.144057 #
2022-05-29T13:50:47.257736 / # export SHELL=/bin/sh
2022-05-29T13:50:47.264455 export SHELL=/bin/sh
... (13 line(s) more)



platform | arch | lab | compiler | defconfig | regressions
--------------------------+--------+---------------+----------+------------------------------+------------
hp-11A-G6-EE-grunt | x86_64 | lab-collabora | gcc-10 | x86_64_defcon...6-chromebook | 1

Details: https://kernelci.org/test/plan/id/629379e70c87d0b49ea39beb

Results: 0 PASS, 1 FAIL, 0 SKIP
Full config: x86_64_defconfig+x86-chromebook
Compiler: gcc-10 (gcc (Debian 10.2.1-6) 10.2.1 20210110)
Plain log: https://storage.kernelci.org//cip-gitlab/ci-pavel-linux-test/v4.4-st5-297-gc0d53c2a5c03d/x86_64/x86_64_defconfig+x86-chromebook/gcc-10/lab-collabora/baseline-nfs-hp-11A-G6-EE-grunt.txt
HTML log: https://storage.kernelci.org//cip-gitlab/ci-pavel-linux-test/v4.4-st5-297-gc0d53c2a5c03d/x86_64/x86_64_defconfig+x86-chromebook/gcc-10/lab-collabora/baseline-nfs-hp-11A-G6-EE-grunt.html
Rootfs: http://storage.kernelci.org/images/rootfs/debian/bullseye/20220513.0/amd64/initrd.cpio.gz


* baseline-nfs.login: https://kernelci.org/test/case/id/629379e70c87d0b49ea39bec
new failure (last pass: v5.10.112-cip6)



platform | arch | lab | compiler | defconfig | regressions
--------------------------+--------+---------------+----------+------------------------------+------------
hp-x360-12b-n4000-octopus | x86_64 | lab-collabora | gcc-10 | x86_64_defcon...6-chromebook | 1

Details: https://kernelci.org/test/plan/id/62937c157eb080f440a39bcd

Results: 0 PASS, 1 FAIL, 0 SKIP
Full config: x86_64_defconfig+x86-chromebook
Compiler: gcc-10 (gcc (Debian 10.2.1-6) 10.2.1 20210110)
Plain log: https://storage.kernelci.org//cip-gitlab/ci-pavel-linux-test/v4.4-st5-297-gc0d53c2a5c03d/x86_64/x86_64_defconfig+x86-chromebook/gcc-10/lab-collabora/baseline-nfs-hp-x360-12b-n4000-octopus.txt
HTML log: https://storage.kernelci.org//cip-gitlab/ci-pavel-linux-test/v4.4-st5-297-gc0d53c2a5c03d/x86_64/x86_64_defconfig+x86-chromebook/gcc-10/lab-collabora/baseline-nfs-hp-x360-12b-n4000-octopus.html
Rootfs: http://storage.kernelci.org/images/rootfs/debian/bullseye/20220513.0/amd64/initrd.cpio.gz


* baseline-nfs.login: https://kernelci.org/test/case/id/62937c157eb080f440a39bce
new failure (last pass: v5.10.112-cip6)



platform | arch | lab | compiler | defconfig | regressions
--------------------------+--------+---------------+----------+------------------------------+------------
hp-x360-14-G1-sona | x86_64 | lab-collabora | gcc-10 | x86_64_defcon...6-chromebook | 1

Details: https://kernelci.org/test/plan/id/62938070369ced05e9a39bd2

Results: 0 PASS, 1 FAIL, 0 SKIP
Full config: x86_64_defconfig+x86-chromebook
Compiler: gcc-10 (gcc (Debian 10.2.1-6) 10.2.1 20210110)
Plain log: https://storage.kernelci.org//cip-gitlab/ci-pavel-linux-test/v4.4-st5-297-gc0d53c2a5c03d/x86_64/x86_64_defconfig+x86-chromebook/gcc-10/lab-collabora/baseline-nfs-hp-x360-14-G1-sona.txt
HTML log: https://storage.kernelci.org//cip-gitlab/ci-pavel-linux-test/v4.4-st5-297-gc0d53c2a5c03d/x86_64/x86_64_defconfig+x86-chromebook/gcc-10/lab-collabora/baseline-nfs-hp-x360-14-G1-sona.html
Rootfs: http://storage.kernelci.org/images/rootfs/debian/bullseye/20220513.0/amd64/initrd.cpio.gz


* baseline-nfs.login: https://kernelci.org/test/case/id/62938070369ced05e9a39bd3
new failure (last pass: v5.10.112-cip6)



platform | arch | lab | compiler | defconfig | regressions
--------------------------+--------+---------------+----------+------------------------------+------------
juno-uboot | arm64 | lab-broonie | gcc-10 | defconfig | 1

Details: https://kernelci.org/test/plan/id/62937cba146415c04ca39bce

Results: 0 PASS, 1 FAIL, 0 SKIP
Full config: defconfig
Compiler: gcc-10 (aarch64-linux-gnu-gcc (Debian 10.2.1-6) 10.2.1 20210110)
Plain log: https://storage.kernelci.org//cip-gitlab/ci-pavel-linux-test/v4.4-st5-297-gc0d53c2a5c03d/arm64/defconfig/gcc-10/lab-broonie/baseline-nfs-juno-uboot.txt
HTML log: https://storage.kernelci.org//cip-gitlab/ci-pavel-linux-test/v4.4-st5-297-gc0d53c2a5c03d/arm64/defconfig/gcc-10/lab-broonie/baseline-nfs-juno-uboot.html
Rootfs: http://storage.kernelci.org/images/rootfs/debian/bullseye/20220513.0/arm64/initrd.cpio.gz


* baseline-nfs.login: https://kernelci.org/test/case/id/62937cba146415c04ca39bcf
new failure (last pass: v5.10.112-cip6)



platform | arch | lab | compiler | defconfig | regressions
--------------------------+--------+---------------+----------+------------------------------+------------
rk3288-veyron-jaq | arm | lab-collabora | gcc-10 | multi_v7_defconfig | 1

Details: https://kernelci.org/test/plan/id/629379512b9c305145a39bf9

Results: 0 PASS, 1 FAIL, 0 SKIP
Full config: multi_v7_defconfig
Compiler: gcc-10 (arm-linux-gnueabihf-gcc (Debian 10.2.1-6) 10.2.1 20210110)
Plain log: https://storage.kernelci.org//cip-gitlab/ci-pavel-linux-test/v4.4-st5-297-gc0d53c2a5c03d/arm/multi_v7_defconfig/gcc-10/lab-collabora/baseline-nfs-rk3288-veyron-jaq.txt
HTML log: https://storage.kernelci.org//cip-gitlab/ci-pavel-linux-test/v4.4-st5-297-gc0d53c2a5c03d/arm/multi_v7_defconfig/gcc-10/lab-collabora/baseline-nfs-rk3288-veyron-jaq.html
Rootfs: http://storage.kernelci.org/images/rootfs/debian/bullseye/20220513.0/armhf/initrd.cpio.gz


* baseline-nfs.login: https://kernelci.org/test/case/id/629379512b9c305145a39bfa
new failure (last pass: v5.10.112-cip6)


cip-gitlab/ci/pavel/linux-test build: 164 builds: 4 failed, 160 passed, 6 errors, 36 warnings (v4.4-st5-297-gc0d53c2a5c03d) #kernelci

kernelci.org bot <bot@...>
 

cip-gitlab/ci/pavel/linux-test build: 164 builds: 4 failed, 160 passed, 6 errors, 36 warnings (v4.4-st5-297-gc0d53c2a5c03d)

Full Build Summary: https://kernelci.org/build/cip-gitlab/branch/ci%2Fpavel%2Flinux-test/kernel/v4.4-st5-297-gc0d53c2a5c03d/

Tree: cip-gitlab
Branch: ci/pavel/linux-test
Git Describe: v4.4-st5-297-gc0d53c2a5c03d
Git Commit: c0d53c2a5c03d0b2672a56140f211b51b3e047c1
Git URL: https://gitlab.com/cip-project/cip-kernel/linux-cip.git
Built: 6 unique architectures

Build Failures Detected:

arm:
rpc_defconfig: (gcc-10) FAIL

mips:
fuloong2e_defconfig: (gcc-10) FAIL
ip27_defconfig: (gcc-10) FAIL
lemote2f_defconfig: (gcc-10) FAIL

Errors and Warnings Detected:

arc:

arm64:
defconfig (gcc-10): 1 warning
defconfig+arm64-chromebook (gcc-10): 1 warning

arm:
clps711x_defconfig (gcc-10): 1 warning
davinci_all_defconfig (gcc-10): 1 warning
lpc32xx_defconfig (gcc-10): 1 warning
mini2440_defconfig (gcc-10): 1 warning
mxs_defconfig (gcc-10): 1 warning
omap1_defconfig (gcc-10): 1 warning
rpc_defconfig (gcc-10): 2 errors
s3c2410_defconfig (gcc-10): 1 warning
s3c6400_defconfig (gcc-10): 2 warnings

i386:
i386_defconfig (gcc-10): 2 warnings

mips:
fuloong2e_defconfig (gcc-10): 2 errors
ip22_defconfig (gcc-10): 1 warning
lemote2f_defconfig (gcc-10): 2 errors
mtx1_defconfig (gcc-10): 3 warnings

x86_64:
allnoconfig (gcc-10): 4 warnings
tinyconfig (gcc-10): 3 warnings
x86_64_defconfig (gcc-10): 6 warnings
x86_64_defconfig+x86-chromebook (gcc-10): 6 warnings

Errors summary:

4 cc1: error: ‘-mloongson-mmi’ must be used with ‘-mhard-float’
1 arm-linux-gnueabihf-gcc: error: unrecognized -march target: armv3
1 arm-linux-gnueabihf-gcc: error: missing argument to ‘-march=’

Warnings summary:

7 arch/x86/kernel/process.c:456: Warning: no instruction mnemonic suffix given and no register operands; using default for `btr'
4 arch/x86/entry/entry_64.S:487: Warning: no instruction mnemonic suffix given and no register operands; using default for `btr'
4 arch/x86/entry/entry_64.S:1642: Warning: no instruction mnemonic suffix given and no register operands; using default for `sysret'
3 ld: warning: creating DT_TEXTREL in a PIE
3 drivers/tty/serial/samsung.c:1777:34: warning: array ‘s3c24xx_uart_dt_match’ assumed to have one element
2 sound/pci/echoaudio/echoaudio_dsp.c:647:9: warning: iteration 1073741824 invokes undefined behavior [-Waggressive-loop-optimizations]
2 ld: arch/x86/boot/compressed/head_64.o: warning: relocation in read-only section `.head.text'
2 drivers/net/ethernet/apm/xgene/xgene_enet_main.c:32:36: warning: array ‘xgene_enet_acpi_match’ assumed to have one element
1 sound/pci/echoaudio/echoaudio_dsp.c:658:9: warning: iteration 1073741824 invokes undefined behavior [-Waggressive-loop-optimizations]
1 ld: arch/x86/boot/compressed/head_32.o: warning: relocation in read-only section `.head.text'
1 drivers/net/ethernet/seeq/sgiseeq.c:804:26: warning: passing argument 5 of ‘dma_free_attrs’ makes pointer from integer without a cast [-Wint-conversion]
1 drivers/mmc/host/sdhci-s3c.c:429:34: warning: array ‘sdhci_s3c_dt_match’ assumed to have one element
1 drivers/gpio/gpio-omap.c:1161:34: warning: array ‘omap_gpio_match’ assumed to have one element
1 arch/arm/mach-mxs/mach-mxs.c:285:26: warning: duplicate ‘const’ declaration specifier [-Wduplicate-decl-specifier]
1 arch/arm/mach-lpc32xx/phy3250.c:215:36: warning: duplicate ‘const’ declaration specifier [-Wduplicate-decl-specifier]
1 arch/arm/mach-davinci/da8xx-dt.c:23:34: warning: duplicate ‘const’ declaration specifier [-Wduplicate-decl-specifier]
1 arch/arm/mach-clps711x/board-autcpu12.c:163:26: warning: duplicate ‘const’ declaration specifier [-Wduplicate-decl-specifier]

================================================================================

Detailed per-defconfig build reports:

--------------------------------------------------------------------------------
acs5k_tiny_defconfig (arm, gcc-10) — PASS, 0 errors, 0 warnings, 0 section mismatches

--------------------------------------------------------------------------------
allnoconfig (arm, gcc-10) — PASS, 0 errors, 0 warnings, 0 section mismatches

--------------------------------------------------------------------------------
allnoconfig (x86_64, gcc-10) — PASS, 0 errors, 4 warnings, 0 section mismatches

Warnings:
arch/x86/entry/entry_64.S:487: Warning: no instruction mnemonic suffix given and no register operands; using default for `btr'
arch/x86/entry/entry_64.S:1642: Warning: no instruction mnemonic suffix given and no register operands; using default for `sysret'
arch/x86/kernel/process.c:456: Warning: no instruction mnemonic suffix given and no register operands; using default for `btr'
arch/x86/kernel/process.c:456: Warning: no instruction mnemonic suffix given and no register operands; using default for `btr'

--------------------------------------------------------------------------------
allnoconfig (i386, gcc-10) — PASS, 0 errors, 0 warnings, 0 section mismatches

--------------------------------------------------------------------------------
allnoconfig (arc, gcc-10) — PASS, 0 errors, 0 warnings, 0 section mismatches

--------------------------------------------------------------------------------
allnoconfig (mips, gcc-10) — PASS, 0 errors, 0 warnings, 0 section mismatches

--------------------------------------------------------------------------------
am200epdkit_defconfig (arm, gcc-10) — PASS, 0 errors, 0 warnings, 0 section mismatches

--------------------------------------------------------------------------------
ar7_defconfig (mips, gcc-10) — PASS, 0 errors, 0 warnings, 0 section mismatches

--------------------------------------------------------------------------------
assabet_defconfig (arm, gcc-10) — PASS, 0 errors, 0 warnings, 0 section mismatches

--------------------------------------------------------------------------------
at91_dt_defconfig (arm, gcc-10) — PASS, 0 errors, 0 warnings, 0 section mismatches

--------------------------------------------------------------------------------
ath79_defconfig (mips, gcc-10) — PASS, 0 errors, 0 warnings, 0 section mismatches

--------------------------------------------------------------------------------
axs103_defconfig (arc, gcc-10) — PASS, 0 errors, 0 warnings, 0 section mismatches

--------------------------------------------------------------------------------
axs103_smp_defconfig (arc, gcc-10) — PASS, 0 errors, 0 warnings, 0 section mismatches

--------------------------------------------------------------------------------
badge4_defconfig (arm, gcc-10) — PASS, 0 errors, 0 warnings, 0 section mismatches

--------------------------------------------------------------------------------
bcm2835_defconfig (arm, gcc-10) — PASS, 0 errors, 0 warnings, 0 section mismatches

--------------------------------------------------------------------------------
bcm63xx_defconfig (mips, gcc-10) — PASS, 0 errors, 0 warnings, 0 section mismatches

--------------------------------------------------------------------------------
bcm_defconfig (arm, gcc-10) — PASS, 0 errors, 0 warnings, 0 section mismatches

--------------------------------------------------------------------------------
bmips_be_defconfig (mips, gcc-10) — PASS, 0 errors, 0 warnings, 0 section mismatches

--------------------------------------------------------------------------------
capcella_defconfig (mips, gcc-10) — PASS, 0 errors, 0 warnings, 0 section mismatches

--------------------------------------------------------------------------------
cavium_octeon_defconfig (mips, gcc-10) — PASS, 0 errors, 0 warnings, 0 section mismatches

--------------------------------------------------------------------------------
ci20_defconfig (mips, gcc-10) — PASS, 0 errors, 0 warnings, 0 section mismatches

--------------------------------------------------------------------------------
clps711x_defconfig (arm, gcc-10) — PASS, 0 errors, 1 warning, 0 section mismatches

Warnings:
arch/arm/mach-clps711x/board-autcpu12.c:163:26: warning: duplicate ‘const’ declaration specifier [-Wduplicate-decl-specifier]

--------------------------------------------------------------------------------
cm_x2xx_defconfig (arm, gcc-10) — PASS, 0 errors, 0 warnings, 0 section mismatches

--------------------------------------------------------------------------------
cm_x300_defconfig (arm, gcc-10) — PASS, 0 errors, 0 warnings, 0 section mismatches

--------------------------------------------------------------------------------
colibri_pxa270_defconfig (arm, gcc-10) — PASS, 0 errors, 0 warnings, 0 section mismatches

--------------------------------------------------------------------------------
colibri_pxa300_defconfig (arm, gcc-10) — PASS, 0 errors, 0 warnings, 0 section mismatches

--------------------------------------------------------------------------------
collie_defconfig (arm, gcc-10) — PASS, 0 errors, 0 warnings, 0 section mismatches

--------------------------------------------------------------------------------
corgi_defconfig (arm, gcc-10) — PASS, 0 errors, 0 warnings, 0 section mismatches

--------------------------------------------------------------------------------
davinci_all_defconfig (arm, gcc-10) — PASS, 0 errors, 1 warning, 0 section mismatches

Warnings:
arch/arm/mach-davinci/da8xx-dt.c:23:34: warning: duplicate ‘const’ declaration specifier [-Wduplicate-decl-specifier]

--------------------------------------------------------------------------------
db1xxx_defconfig (mips, gcc-10) — PASS, 0 errors, 0 warnings, 0 section mismatches

--------------------------------------------------------------------------------
defconfig (arm64, gcc-10) — PASS, 0 errors, 1 warning, 0 section mismatches

Warnings:
drivers/net/ethernet/apm/xgene/xgene_enet_main.c:32:36: warning: array ‘xgene_enet_acpi_match’ assumed to have one element

--------------------------------------------------------------------------------
defconfig+arm64-chromebook (arm64, gcc-10) — PASS, 0 errors, 1 warning, 0 section mismatches

Warnings:
drivers/net/ethernet/apm/xgene/xgene_enet_main.c:32:36: warning: array ‘xgene_enet_acpi_match’ assumed to have one element

--------------------------------------------------------------------------------
dove_defconfig (arm, gcc-10) — PASS, 0 errors, 0 warnings, 0 section mismatches

--------------------------------------------------------------------------------
e55_defconfig (mips, gcc-10) — PASS, 0 errors, 0 warnings, 0 section mismatches

--------------------------------------------------------------------------------
ebsa110_defconfig (arm, gcc-10) — PASS, 0 errors, 0 warnings, 0 section mismatches

--------------------------------------------------------------------------------
efm32_defconfig (arm, gcc-10) — PASS, 0 errors, 0 warnings, 0 section mismatches

--------------------------------------------------------------------------------
em_x270_defconfig (arm, gcc-10) — PASS, 0 errors, 0 warnings, 0 section mismatches

--------------------------------------------------------------------------------
eseries_pxa_defconfig (arm, gcc-10) — PASS, 0 errors, 0 warnings, 0 section mismatches

--------------------------------------------------------------------------------
exynos_defconfig (arm, gcc-10) — PASS, 0 errors, 0 warnings, 0 section mismatches

--------------------------------------------------------------------------------
ezx_defconfig (arm, gcc-10) — PASS, 0 errors, 0 warnings, 0 section mismatches

--------------------------------------------------------------------------------
footbridge_defconfig (arm, gcc-10) — PASS, 0 errors, 0 warnings, 0 section mismatches

--------------------------------------------------------------------------------
fuloong2e_defconfig (mips, gcc-10) — FAIL, 2 errors, 0 warnings, 0 section mismatches

Errors:
cc1: error: ‘-mloongson-mmi’ must be used with ‘-mhard-float’
cc1: error: ‘-mloongson-mmi’ must be used with ‘-mhard-float’

--------------------------------------------------------------------------------
h3600_defconfig (arm, gcc-10) — PASS, 0 errors, 0 warnings, 0 section mismatches

--------------------------------------------------------------------------------
h5000_defconfig (arm, gcc-10) — PASS, 0 errors, 0 warnings, 0 section mismatches

--------------------------------------------------------------------------------
hackkit_defconfig (arm, gcc-10) — PASS, 0 errors, 0 warnings, 0 section mismatches

--------------------------------------------------------------------------------
hisi_defconfig (arm, gcc-10) — PASS, 0 errors, 0 warnings, 0 section mismatches

--------------------------------------------------------------------------------
i386_defconfig (i386, gcc-10) — PASS, 0 errors, 2 warnings, 0 section mismatches

Warnings:
ld: arch/x86/boot/compressed/head_32.o: warning: relocation in read-only section `.head.text'
ld: warning: creating DT_TEXTREL in a PIE

--------------------------------------------------------------------------------
imote2_defconfig (arm, gcc-10) — PASS, 0 errors, 0 warnings, 0 section mismatches

--------------------------------------------------------------------------------
imx_v4_v5_defconfig (arm, gcc-10) — PASS, 0 errors, 0 warnings, 0 section mismatches

--------------------------------------------------------------------------------
imx_v6_v7_defconfig (arm, gcc-10) — PASS, 0 errors, 0 warnings, 0 section mismatches

--------------------------------------------------------------------------------
integrator_defconfig (arm, gcc-10) — PASS, 0 errors, 0 warnings, 0 section mismatches

--------------------------------------------------------------------------------
iop13xx_defconfig (arm, gcc-10) — PASS, 0 errors, 0 warnings, 0 section mismatches

--------------------------------------------------------------------------------
iop32x_defconfig (arm, gcc-10) — PASS, 0 errors, 0 warnings, 0 section mismatches

--------------------------------------------------------------------------------
iop33x_defconfig (arm, gcc-10) — PASS, 0 errors, 0 warnings, 0 section mismatches

--------------------------------------------------------------------------------
ip22_defconfig (mips, gcc-10) — PASS, 0 errors, 1 warning, 0 section mismatches

Warnings:
drivers/net/ethernet/seeq/sgiseeq.c:804:26: warning: passing argument 5 of ‘dma_free_attrs’ makes pointer from integer without a cast [-Wint-conversion]

--------------------------------------------------------------------------------
ip27_defconfig (mips, gcc-10) — FAIL, 0 errors, 0 warnings, 0 section mismatches

--------------------------------------------------------------------------------
ip32_defconfig (mips, gcc-10) — PASS, 0 errors, 0 warnings, 0 section mismatches

--------------------------------------------------------------------------------
ixp4xx_defconfig (arm, gcc-10) — PASS, 0 errors, 0 warnings, 0 section mismatches

--------------------------------------------------------------------------------
jazz_defconfig (mips, gcc-10) — PASS, 0 errors, 0 warnings, 0 section mismatches

--------------------------------------------------------------------------------
jmr3927_defconfig (mips, gcc-10) — PASS, 0 errors, 0 warnings, 0 section mismatches

--------------------------------------------------------------------------------
jornada720_defconfig (arm, gcc-10) — PASS, 0 errors, 0 warnings, 0 section mismatches

--------------------------------------------------------------------------------
keystone_defconfig (arm, gcc-10) — PASS, 0 errors, 0 warnings, 0 section mismatches

--------------------------------------------------------------------------------
ks8695_defconfig (arm, gcc-10) — PASS, 0 errors, 0 warnings, 0 section mismatches

--------------------------------------------------------------------------------
lart_defconfig (arm, gcc-10) — PASS, 0 errors, 0 warnings, 0 section mismatches

--------------------------------------------------------------------------------
lasat_defconfig (mips, gcc-10) — PASS, 0 errors, 0 warnings, 0 section mismatches

--------------------------------------------------------------------------------
lemote2f_defconfig (mips, gcc-10) — FAIL, 2 errors, 0 warnings, 0 section mismatches

Errors:
cc1: error: ‘-mloongson-mmi’ must be used with ‘-mhard-float’
cc1: error: ‘-mloongson-mmi’ must be used with ‘-mhard-float’

--------------------------------------------------------------------------------
loongson3_defconfig (mips, gcc-10) — PASS, 0 errors, 0 warnings, 0 section mismatches

--------------------------------------------------------------------------------
lpc18xx_defconfig (arm, gcc-10) — PASS, 0 errors, 0 warnings, 0 section mismatches

--------------------------------------------------------------------------------
lpc32xx_defconfig (arm, gcc-10) — PASS, 0 errors, 1 warning, 0 section mismatches

Warnings:
arch/arm/mach-lpc32xx/phy3250.c:215:36: warning: duplicate ‘const’ declaration specifier [-Wduplicate-decl-specifier]

--------------------------------------------------------------------------------
lpd270_defconfig (arm, gcc-10) — PASS, 0 errors, 0 warnings, 0 section mismatches

--------------------------------------------------------------------------------
ls1b_defconfig (mips, gcc-10) — PASS, 0 errors, 0 warnings, 0 section mismatches

--------------------------------------------------------------------------------
lubbock_defconfig (arm, gcc-10) — PASS, 0 errors, 0 warnings, 0 section mismatches

--------------------------------------------------------------------------------
magician_defconfig (arm, gcc-10) — PASS, 0 errors, 0 warnings, 0 section mismatches

--------------------------------------------------------------------------------
mainstone_defconfig (arm, gcc-10) — PASS, 0 errors, 0 warnings, 0 section mismatches

--------------------------------------------------------------------------------
malta_defconfig (mips, gcc-10) — PASS, 0 errors, 0 warnings, 0 section mismatches

--------------------------------------------------------------------------------
malta_kvm_defconfig (mips, gcc-10) — PASS, 0 errors, 0 warnings, 0 section mismatches

--------------------------------------------------------------------------------
malta_kvm_guest_defconfig (mips, gcc-10) — PASS, 0 errors, 0 warnings, 0 section mismatches

--------------------------------------------------------------------------------
malta_qemu_32r6_defconfig (mips, gcc-10) — PASS, 0 errors, 0 warnings, 0 section mismatches

--------------------------------------------------------------------------------
maltaaprp_defconfig (mips, gcc-10) — PASS, 0 errors, 0 warnings, 0 section mismatches

--------------------------------------------------------------------------------
maltasmvp_defconfig (mips, gcc-10) — PASS, 0 errors, 0 warnings, 0 section mismatches

--------------------------------------------------------------------------------
maltasmvp_eva_defconfig (mips, gcc-10) — PASS, 0 errors, 0 warnings, 0 section mismatches

--------------------------------------------------------------------------------
maltaup_xpa_defconfig (mips, gcc-10) — PASS, 0 errors, 0 warnings, 0 section mismatches

--------------------------------------------------------------------------------
markeins_defconfig (mips, gcc-10) — PASS, 0 errors, 0 warnings, 0 section mismatches

--------------------------------------------------------------------------------
mini2440_defconfig (arm, gcc-10) — PASS, 0 errors, 1 warning, 0 section mismatches

Warnings:
drivers/tty/serial/samsung.c:1777:34: warning: array ‘s3c24xx_uart_dt_match’ assumed to have one element

--------------------------------------------------------------------------------
mips_paravirt_defconfig (mips, gcc-10) — PASS, 0 errors, 0 warnings, 0 section mismatches

--------------------------------------------------------------------------------
msp71xx_defconfig (mips, gcc-10) — PASS, 0 errors, 0 warnings, 0 section mismatches

--------------------------------------------------------------------------------
mtx1_defconfig (mips, gcc-10) — PASS, 0 errors, 3 warnings, 0 section mismatches

Warnings:
sound/pci/echoaudio/echoaudio_dsp.c:647:9: warning: iteration 1073741824 invokes undefined behavior [-Waggressive-loop-optimizations]
sound/pci/echoaudio/echoaudio_dsp.c:658:9: warning: iteration 1073741824 invokes undefined behavior [-Waggressive-loop-optimizations]
sound/pci/echoaudio/echoaudio_dsp.c:647:9: warning: iteration 1073741824 invokes undefined behavior [-Waggressive-loop-optimizations]

--------------------------------------------------------------------------------
multi_v5_defconfig (arm, gcc-10) — PASS, 0 errors, 0 warnings, 0 section mismatches

--------------------------------------------------------------------------------
multi_v7_defconfig (arm, gcc-10) — PASS, 0 errors, 0 warnings, 0 section mismatches

--------------------------------------------------------------------------------
mv78xx0_defconfig (arm, gcc-10) — PASS, 0 errors, 0 warnings, 0 section mismatches

--------------------------------------------------------------------------------
mvebu_v7_defconfig (arm, gcc-10) — PASS, 0 errors, 0 warnings, 0 section mismatches

--------------------------------------------------------------------------------
mxs_defconfig (arm, gcc-10) — PASS, 0 errors, 1 warning, 0 section mismatches

Warnings:
arch/arm/mach-mxs/mach-mxs.c:285:26: warning: duplicate ‘const’ declaration specifier [-Wduplicate-decl-specifier]

--------------------------------------------------------------------------------
neponset_defconfig (arm, gcc-10) — PASS, 0 errors, 0 warnings, 0 section mismatches

--------------------------------------------------------------------------------
netwinder_defconfig (arm, gcc-10) — PASS, 0 errors, 0 warnings, 0 section mismatches

--------------------------------------------------------------------------------
netx_defconfig (arm, gcc-10) — PASS, 0 errors, 0 warnings, 0 section mismatches

--------------------------------------------------------------------------------
nhk8815_defconfig (arm, gcc-10) — PASS, 0 errors, 0 warnings, 0 section mismatches

--------------------------------------------------------------------------------
nlm_xlp_defconfig (mips, gcc-10) — PASS, 0 errors, 0 warnings, 0 section mismatches

--------------------------------------------------------------------------------
nsim_hs_defconfig (arc, gcc-10) — PASS, 0 errors, 0 warnings, 0 section mismatches

--------------------------------------------------------------------------------
nsim_hs_smp_defconfig (arc, gcc-10) — PASS, 0 errors, 0 warnings, 0 section mismatches

--------------------------------------------------------------------------------
nsimosci_hs_defconfig (arc, gcc-10) — PASS, 0 errors, 0 warnings, 0 section mismatches

--------------------------------------------------------------------------------
nsimosci_hs_smp_defconfig (arc, gcc-10) — PASS, 0 errors, 0 warnings, 0 section mismatches

--------------------------------------------------------------------------------
nuc910_defconfig (arm, gcc-10) — PASS, 0 errors, 0 warnings, 0 section mismatches

--------------------------------------------------------------------------------
nuc950_defconfig (arm, gcc-10) — PASS, 0 errors, 0 warnings, 0 section mismatches

--------------------------------------------------------------------------------
nuc960_defconfig (arm, gcc-10) — PASS, 0 errors, 0 warnings, 0 section mismatches

--------------------------------------------------------------------------------
omap1_defconfig (arm, gcc-10) — PASS, 0 errors, 1 warning, 0 section mismatches

Warnings:
drivers/gpio/gpio-omap.c:1161:34: warning: array ‘omap_gpio_match’ assumed to have one element

--------------------------------------------------------------------------------
omap2plus_defconfig (arm, gcc-10) — PASS, 0 errors, 0 warnings, 0 section mismatches

--------------------------------------------------------------------------------
orion5x_defconfig (arm, gcc-10) — PASS, 0 errors, 0 warnings, 0 section mismatches

--------------------------------------------------------------------------------
palmz72_defconfig (arm, gcc-10) — PASS, 0 errors, 0 warnings, 0 section mismatches

--------------------------------------------------------------------------------
pleb_defconfig (arm, gcc-10) — PASS, 0 errors, 0 warnings, 0 section mismatches

--------------------------------------------------------------------------------
pnx8335_stb225_defconfig (mips, gcc-10) — PASS, 0 errors, 0 warnings, 0 section mismatches

--------------------------------------------------------------------------------
prima2_defconfig (arm, gcc-10) — PASS, 0 errors, 0 warnings, 0 section mismatches

--------------------------------------------------------------------------------
pxa168_defconfig (arm, gcc-10) — PASS, 0 errors, 0 warnings, 0 section mismatches

--------------------------------------------------------------------------------
pxa255-idp_defconfig (arm, gcc-10) — PASS, 0 errors, 0 warnings, 0 section mismatches

--------------------------------------------------------------------------------
pxa3xx_defconfig (arm, gcc-10) — PASS, 0 errors, 0 warnings, 0 section mismatches

--------------------------------------------------------------------------------
pxa910_defconfig (arm, gcc-10) — PASS, 0 errors, 0 warnings, 0 section mismatches

--------------------------------------------------------------------------------
qcom_defconfig (arm, gcc-10) — PASS, 0 errors, 0 warnings, 0 section mismatches

--------------------------------------------------------------------------------
qi_lb60_defconfig (mips, gcc-10) — PASS, 0 errors, 0 warnings, 0 section mismatches

--------------------------------------------------------------------------------
raumfeld_defconfig (arm, gcc-10) — PASS, 0 errors, 0 warnings, 0 section mismatches

--------------------------------------------------------------------------------
rbtx49xx_defconfig (mips, gcc-10) — PASS, 0 errors, 0 warnings, 0 section mismatches

--------------------------------------------------------------------------------
realview-smp_defconfig (arm, gcc-10) — PASS, 0 errors, 0 warnings, 0 section mismatches

--------------------------------------------------------------------------------
realview_defconfig (arm, gcc-10) — PASS, 0 errors, 0 warnings, 0 section mismatches

--------------------------------------------------------------------------------
rpc_defconfig (arm, gcc-10) — FAIL, 2 errors, 0 warnings, 0 section mismatches

Errors:
arm-linux-gnueabihf-gcc: error: unrecognized -march target: armv3
arm-linux-gnueabihf-gcc: error: missing argument to ‘-march=’

--------------------------------------------------------------------------------
rt305x_defconfig (mips, gcc-10) — PASS, 0 errors, 0 warnings, 0 section mismatches

--------------------------------------------------------------------------------
s3c2410_defconfig (arm, gcc-10) — PASS, 0 errors, 1 warning, 0 section mismatches

Warnings:
drivers/tty/serial/samsung.c:1777:34: warning: array ‘s3c24xx_uart_dt_match’ assumed to have one element

--------------------------------------------------------------------------------
s3c6400_defconfig (arm, gcc-10) — PASS, 0 errors, 2 warnings, 0 section mismatches

Warnings:
drivers/mmc/host/sdhci-s3c.c:429:34: warning: array ‘sdhci_s3c_dt_match’ assumed to have one element
drivers/tty/serial/samsung.c:1777:34: warning: array ‘s3c24xx_uart_dt_match’ assumed to have one element

--------------------------------------------------------------------------------
sama5_defconfig (arm, gcc-10) — PASS, 0 errors, 0 warnings, 0 section mismatches

--------------------------------------------------------------------------------
sb1250_swarm_defconfig (mips, gcc-10) — PASS, 0 errors, 0 warnings, 0 section mismatches

--------------------------------------------------------------------------------
sead3_defconfig (mips, gcc-10) — PASS, 0 errors, 0 warnings, 0 section mismatches

--------------------------------------------------------------------------------
sead3micro_defconfig (mips, gcc-10) — PASS, 0 errors, 0 warnings, 0 section mismatches

--------------------------------------------------------------------------------
shannon_defconfig (arm, gcc-10) — PASS, 0 errors, 0 warnings, 0 section mismatches

--------------------------------------------------------------------------------
shmobile_defconfig (arm, gcc-10) — PASS, 0 errors, 0 warnings, 0 section mismatches

--------------------------------------------------------------------------------
simpad_defconfig (arm, gcc-10) — PASS, 0 errors, 0 warnings, 0 section mismatches

--------------------------------------------------------------------------------
socfpga_defconfig (arm, gcc-10) — PASS, 0 errors, 0 warnings, 0 section mismatches

--------------------------------------------------------------------------------
spear13xx_defconfig (arm, gcc-10) — PASS, 0 errors, 0 warnings, 0 section mismatches

--------------------------------------------------------------------------------
spear3xx_defconfig (arm, gcc-10) — PASS, 0 errors, 0 warnings, 0 section mismatches

--------------------------------------------------------------------------------
spear6xx_defconfig (arm, gcc-10) — PASS, 0 errors, 0 warnings, 0 section mismatches

--------------------------------------------------------------------------------
spitz_defconfig (arm, gcc-10) — PASS, 0 errors, 0 warnings, 0 section mismatches

--------------------------------------------------------------------------------
stm32_defconfig (arm, gcc-10) — PASS, 0 errors, 0 warnings, 0 section mismatches

--------------------------------------------------------------------------------
sunxi_defconfig (arm, gcc-10) — PASS, 0 errors, 0 warnings, 0 section mismatches

--------------------------------------------------------------------------------
tb0219_defconfig (mips, gcc-10) — PASS, 0 errors, 0 warnings, 0 section mismatches

--------------------------------------------------------------------------------
tb0226_defconfig (mips, gcc-10) — PASS, 0 errors, 0 warnings, 0 section mismatches

--------------------------------------------------------------------------------
tb0287_defconfig (mips, gcc-10) — PASS, 0 errors, 0 warnings, 0 section mismatches

--------------------------------------------------------------------------------
tct_hammer_defconfig (arm, gcc-10) — PASS, 0 errors, 0 warnings, 0 section mismatches

--------------------------------------------------------------------------------
tinyconfig (arc, gcc-10) — PASS, 0 errors, 0 warnings, 0 section mismatches

--------------------------------------------------------------------------------
tinyconfig (arm, gcc-10) — PASS, 0 errors, 0 warnings, 0 section mismatches

--------------------------------------------------------------------------------
tinyconfig (mips, gcc-10) — PASS, 0 errors, 0 warnings, 0 section mismatches

--------------------------------------------------------------------------------
tinyconfig (i386, gcc-10) — PASS, 0 errors, 0 warnings, 0 section mismatches

--------------------------------------------------------------------------------
tinyconfig (x86_64, gcc-10) — PASS, 0 errors, 3 warnings, 0 section mismatches

Warnings:
arch/x86/entry/entry_64.S:487: Warning: no instruction mnemonic suffix given and no register operands; using default for `btr'
arch/x86/entry/entry_64.S:1642: Warning: no instruction mnemonic suffix given and no register operands; using default for `sysret'
arch/x86/kernel/process.c:456: Warning: no instruction mnemonic suffix given and no register operands; using default for `btr'

--------------------------------------------------------------------------------
trizeps4_defconfig (arm, gcc-10) — PASS, 0 errors, 0 warnings, 0 section mismatches

--------------------------------------------------------------------------------
u300_defconfig (arm, gcc-10) — PASS, 0 errors, 0 warnings, 0 section mismatches

--------------------------------------------------------------------------------
u8500_defconfig (arm, gcc-10) — PASS, 0 errors, 0 warnings, 0 section mismatches

--------------------------------------------------------------------------------
vdk_hs38_defconfig (arc, gcc-10) — PASS, 0 errors, 0 warnings, 0 section mismatches

--------------------------------------------------------------------------------
vdk_hs38_smp_defconfig (arc, gcc-10) — PASS, 0 errors, 0 warnings, 0 section mismatches

--------------------------------------------------------------------------------
vexpress_defconfig (arm, gcc-10) — PASS, 0 errors, 0 warnings, 0 section mismatches

--------------------------------------------------------------------------------
vf610m4_defconfig (arm, gcc-10) — PASS, 0 errors, 0 warnings, 0 section mismatches

--------------------------------------------------------------------------------
vt8500_v6_v7_defconfig (arm, gcc-10) — PASS, 0 errors, 0 warnings, 0 section mismatches

--------------------------------------------------------------------------------
workpad_defconfig (mips, gcc-10) — PASS, 0 errors, 0 warnings, 0 section mismatches

--------------------------------------------------------------------------------
x86_64_defconfig (x86_64, gcc-10) — PASS, 0 errors, 6 warnings, 0 section mismatches

Warnings:
arch/x86/entry/entry_64.S:487: Warning: no instruction mnemonic suffix given and no register operands; using default for `btr'
arch/x86/entry/entry_64.S:1642: Warning: no instruction mnemonic suffix given and no register operands; using default for `sysret'
arch/x86/kernel/process.c:456: Warning: no instruction mnemonic suffix given and no register operands; using default for `btr'
arch/x86/kernel/process.c:456: Warning: no instruction mnemonic suffix given and no register operands; using default for `btr'
ld: arch/x86/boot/compressed/head_64.o: warning: relocation in read-only section `.head.text'
ld: warning: creating DT_TEXTREL in a PIE

--------------------------------------------------------------------------------
x86_64_defconfig+x86-chromebook (x86_64, gcc-10) — PASS, 0 errors, 6 warnings, 0 section mismatches

Warnings:
arch/x86/entry/entry_64.S:487: Warning: no instruction mnemonic suffix given and no register operands; using default for `btr'
arch/x86/entry/entry_64.S:1642: Warning: no instruction mnemonic suffix given and no register operands; using default for `sysret'
arch/x86/kernel/process.c:456: Warning: no instruction mnemonic suffix given and no register operands; using default for `btr'
arch/x86/kernel/process.c:456: Warning: no instruction mnemonic suffix given and no register operands; using default for `btr'
ld: arch/x86/boot/compressed/head_64.o: warning: relocation in read-only section `.head.text'
ld: warning: creating DT_TEXTREL in a PIE

--------------------------------------------------------------------------------
xcep_defconfig (arm, gcc-10) — PASS, 0 errors, 0 warnings, 0 section mismatches

--------------------------------------------------------------------------------
xilfpga_defconfig (mips, gcc-10) — PASS, 0 errors, 0 warnings, 0 section mismatches

--------------------------------------------------------------------------------
xway_defconfig (mips, gcc-10) — PASS, 0 errors, 0 warnings, 0 section mismatches

--------------------------------------------------------------------------------
zeus_defconfig (arm, gcc-10) — PASS, 0 errors, 0 warnings, 0 section mismatches

--------------------------------------------------------------------------------
zx_defconfig (arm, gcc-10) — PASS, 0 errors, 0 warnings, 0 section mismatches

---
For more info write to <info@...>


cip-gitlab/ci/pavel/linux-test smc: 9 runs, 2 regressions (v5.10.112-cip6) #kernelci

kernelci.org bot <bot@...>
 

cip-gitlab/ci/pavel/linux-test smc: 9 runs, 2 regressions (v5.10.112-cip6)

Regressions Summary
-------------------

platform | arch | lab | compiler | defconfig | regressions
----------------------+-------+-------------+----------+----------------------------+------------
qemu_arm64-virt-gicv3 | arm64 | lab-broonie | gcc-10 | defconfig+arm64-chromebook | 1
qemu_arm64-virt-gicv3 | arm64 | lab-broonie | gcc-10 | defconfig | 1

Details: https://kernelci.org/test/job/cip-gitlab/branch/ci%2Fpavel%2Flinux-test/kernel/v5.10.112-cip6/plan/smc/

Test: smc
Tree: cip-gitlab
Branch: ci/pavel/linux-test
Describe: v5.10.112-cip6
URL: https://gitlab.com/cip-project/cip-kernel/linux-cip.git
SHA: c8f6747dcd02a8f87731c324f4bc37bd120a8982


Test Regressions
----------------


platform | arch | lab | compiler | defconfig | regressions
----------------------+-------+-------------+----------+----------------------------+------------
qemu_arm64-virt-gicv3 | arm64 | lab-broonie | gcc-10 | defconfig+arm64-chromebook | 1

Details: https://kernelci.org/test/plan/id/629101e3f1b3a44880a39bd0

Results: 0 PASS, 1 FAIL, 0 SKIP
Full config: defconfig+arm64-chromebook
Compiler: gcc-10 (aarch64-linux-gnu-gcc (Debian 10.2.1-6) 10.2.1 20210110)
Plain log: https://storage.kernelci.org//cip-gitlab/ci-pavel-linux-test/v5.10.112-cip6/arm64/defconfig+arm64-chromebook/gcc-10/lab-broonie/smc-qemu_arm64-virt-gicv3.txt
HTML log: https://storage.kernelci.org//cip-gitlab/ci-pavel-linux-test/v5.10.112-cip6/arm64/defconfig+arm64-chromebook/gcc-10/lab-broonie/smc-qemu_arm64-virt-gicv3.html
Rootfs: http://storage.kernelci.org/images/rootfs/buildroot/buildroot-baseline/20220513.0/arm64/rootfs.cpio.gz


* smc.login: https://kernelci.org/test/case/id/629101e3f1b3a44880a39bd1
failing since 16 days (last pass: v4.19.233-516-ge5e741fbfc87, first fail: v5.10.109-cip5-384-g722204542e8a)



platform | arch | lab | compiler | defconfig | regressions
----------------------+-------+-------------+----------+----------------------------+------------
qemu_arm64-virt-gicv3 | arm64 | lab-broonie | gcc-10 | defconfig | 1

Details: https://kernelci.org/test/plan/id/629101f7a3b9a57b0da39bd3

Results: 0 PASS, 1 FAIL, 0 SKIP
Full config: defconfig
Compiler: gcc-10 (aarch64-linux-gnu-gcc (Debian 10.2.1-6) 10.2.1 20210110)
Plain log: https://storage.kernelci.org//cip-gitlab/ci-pavel-linux-test/v5.10.112-cip6/arm64/defconfig/gcc-10/lab-broonie/smc-qemu_arm64-virt-gicv3.txt
HTML log: https://storage.kernelci.org//cip-gitlab/ci-pavel-linux-test/v5.10.112-cip6/arm64/defconfig/gcc-10/lab-broonie/smc-qemu_arm64-virt-gicv3.html
Rootfs: http://storage.kernelci.org/images/rootfs/buildroot/buildroot-baseline/20220513.0/arm64/rootfs.cpio.gz


* smc.login: https://kernelci.org/test/case/id/629101f7a3b9a57b0da39bd4
failing since 16 days (last pass: v4.19.233-516-ge5e741fbfc87, first fail: v5.10.109-cip5-384-g722204542e8a)


cip-gitlab/ci/pavel/linux-test baseline-nfs: 23 runs, 3 regressions (v5.10.112-cip6) #kernelci

kernelci.org bot <bot@...>
 

cip-gitlab/ci/pavel/linux-test baseline-nfs: 23 runs, 3 regressions (v5.10.112-cip6)

Regressions Summary
-------------------

platform | arch | lab | compiler | defconfig | regressions
-----------------+-------+---------------+----------+----------------------------+------------
rk3399-gru-kevin | arm64 | lab-collabora | gcc-10 | defconfig+arm64-chromebook | 3

Details: https://kernelci.org/test/job/cip-gitlab/branch/ci%2Fpavel%2Flinux-test/kernel/v5.10.112-cip6/plan/baseline-nfs/

Test: baseline-nfs
Tree: cip-gitlab
Branch: ci/pavel/linux-test
Describe: v5.10.112-cip6
URL: https://gitlab.com/cip-project/cip-kernel/linux-cip.git
SHA: c8f6747dcd02a8f87731c324f4bc37bd120a8982


Test Regressions
----------------


platform | arch | lab | compiler | defconfig | regressions
-----------------+-------+---------------+----------+----------------------------+------------
rk3399-gru-kevin | arm64 | lab-collabora | gcc-10 | defconfig+arm64-chromebook | 3

Details: https://kernelci.org/test/plan/id/6290febf2e72f74fa2a39be4

Results: 84 PASS, 4 FAIL, 0 SKIP
Full config: defconfig+arm64-chromebook
Compiler: gcc-10 (aarch64-linux-gnu-gcc (Debian 10.2.1-6) 10.2.1 20210110)
Plain log: https://storage.kernelci.org//cip-gitlab/ci-pavel-linux-test/v5.10.112-cip6/arm64/defconfig+arm64-chromebook/gcc-10/lab-collabora/baseline-nfs-rk3399-gru-kevin.txt
HTML log: https://storage.kernelci.org//cip-gitlab/ci-pavel-linux-test/v5.10.112-cip6/arm64/defconfig+arm64-chromebook/gcc-10/lab-collabora/baseline-nfs-rk3399-gru-kevin.html
Rootfs: http://storage.kernelci.org/images/rootfs/debian/bullseye/20220513.0/arm64/initrd.cpio.gz


* baseline-nfs.bootrr.cros-ec-sensors-gyro0-probed: https://kernelci.org/test/case/id/6290febf2e72f74fa2a39c27
failing since 17 days (last pass: v4.19.233-516-ge5e741fbfc87, first fail: v5.10.109-cip5-384-g722204542e8a)

2022-05-27T16:39:14.787459 [ 34.142791] <LAVA_SIGNAL_TESTCASE TEST_CASE_ID=cros-ec-sensors-accel1-probed RESULT=fail>
2022-05-27T16:39:15.835294 /lava-6489125/1/../bin/lava-test-case
2022-05-27T16:39:15.872873 [ 35.228683] <LAVA_SIGNAL_TESTCASE TEST_CASE_ID=cros-ec-sensors-gyro0-probed RESULT=fail>

* baseline-nfs.bootrr.cros-ec-sensors-accel1-probed: https://kernelci.org/test/case/id/6290febf2e72f74fa2a39c28
failing since 17 days (last pass: v4.19.233-516-ge5e741fbfc87, first fail: v5.10.109-cip5-384-g722204542e8a)

2022-05-27T16:39:14.751571 /lava-6489125/1/../bin/lava-test-case

* baseline-nfs.bootrr.cros-ec-sensors-accel0-probed: https://kernelci.org/test/case/id/6290febf2e72f74fa2a39c29
failing since 17 days (last pass: v4.19.233-516-ge5e741fbfc87, first fail: v5.10.109-cip5-384-g722204542e8a)

2022-05-27T16:39:12.635947 [ 31.991095] <LAVA_SIGNAL_TESTCASE TEST_CASE_ID=cros-ec-sensors-driver-present RESULT=pass>
2022-05-27T16:39:13.676986 /lava-6489125/1/../bin/lava-test-case
2022-05-27T16:39:13.709676 [ 33.065601] <LAVA_SIGNAL_TESTCASE TEST_CASE_ID=cros-ec-sensors-accel0-probed RESULT=fail>


cip-gitlab/ci/pavel/linux-test baseline: 92 runs, 12 regressions (v5.10.112-cip6) #kernelci

kernelci.org bot <bot@...>
 

cip-gitlab/ci/pavel/linux-test baseline: 92 runs, 12 regressions (v5.10.112-cip6)

Regressions Summary
-------------------

platform | arch | lab | compiler | defconfig | regressions
---------------------------+-------+---------------+----------+----------------------------+------------
bcm2836-rpi-2-b | arm | lab-collabora | gcc-10 | multi_v7_defconfig | 1
da850-lcdk | arm | lab-baylibre | gcc-10 | davinci_all_defconfig | 1
fsl-ls1088a-rdb | arm64 | lab-nxp | gcc-10 | defconfig | 1
meson8b-odroidc1 | arm | lab-baylibre | gcc-10 | multi_v7_defconfig | 1
qemu_arm64-virt-gicv2 | arm64 | lab-broonie | gcc-10 | defconfig+arm64-chromebook | 1
qemu_arm64-virt-gicv2 | arm64 | lab-broonie | gcc-10 | defconfig | 1
qemu_arm64-virt-gicv2-uefi | arm64 | lab-broonie | gcc-10 | defconfig+arm64-chromebook | 1
qemu_arm64-virt-gicv2-uefi | arm64 | lab-broonie | gcc-10 | defconfig | 1
qemu_arm64-virt-gicv3 | arm64 | lab-broonie | gcc-10 | defconfig+arm64-chromebook | 1
qemu_arm64-virt-gicv3 | arm64 | lab-broonie | gcc-10 | defconfig | 1
qemu_arm64-virt-gicv3-uefi | arm64 | lab-broonie | gcc-10 | defconfig+arm64-chromebook | 1
qemu_arm64-virt-gicv3-uefi | arm64 | lab-broonie | gcc-10 | defconfig | 1

Details: https://kernelci.org/test/job/cip-gitlab/branch/ci%2Fpavel%2Flinux-test/kernel/v5.10.112-cip6/plan/baseline/

Test: baseline
Tree: cip-gitlab
Branch: ci/pavel/linux-test
Describe: v5.10.112-cip6
URL: https://gitlab.com/cip-project/cip-kernel/linux-cip.git
SHA: c8f6747dcd02a8f87731c324f4bc37bd120a8982


Test Regressions
----------------


platform | arch | lab | compiler | defconfig | regressions
---------------------------+-------+---------------+----------+----------------------------+------------
bcm2836-rpi-2-b | arm | lab-collabora | gcc-10 | multi_v7_defconfig | 1

Details: https://kernelci.org/test/plan/id/6290ff2cd57916a83ea39bda

Results: 0 PASS, 1 FAIL, 0 SKIP
Full config: multi_v7_defconfig
Compiler: gcc-10 (arm-linux-gnueabihf-gcc (Debian 10.2.1-6) 10.2.1 20210110)
Plain log: https://storage.kernelci.org//cip-gitlab/ci-pavel-linux-test/v5.10.112-cip6/arm/multi_v7_defconfig/gcc-10/lab-collabora/baseline-bcm2836-rpi-2-b.txt
HTML log: https://storage.kernelci.org//cip-gitlab/ci-pavel-linux-test/v5.10.112-cip6/arm/multi_v7_defconfig/gcc-10/lab-collabora/baseline-bcm2836-rpi-2-b.html
Rootfs: http://storage.kernelci.org/images/rootfs/buildroot/buildroot-baseline/20220513.0/armel/rootfs.cpio.gz


* baseline.login: https://kernelci.org/test/case/id/6290ff2cd57916a83ea39bdb
failing since 17 days (last pass: v4.19.233-516-ge5e741fbfc87, first fail: v5.10.109-cip5-384-g722204542e8a)



platform | arch | lab | compiler | defconfig | regressions
---------------------------+-------+---------------+----------+----------------------------+------------
da850-lcdk | arm | lab-baylibre | gcc-10 | davinci_all_defconfig | 1

Details: https://kernelci.org/test/plan/id/6290f63af50c2a4cffa39bd8

Results: 5 PASS, 1 FAIL, 1 SKIP
Full config: davinci_all_defconfig
Compiler: gcc-10 (arm-linux-gnueabihf-gcc (Debian 10.2.1-6) 10.2.1 20210110)
Plain log: https://storage.kernelci.org//cip-gitlab/ci-pavel-linux-test/v5.10.112-cip6/arm/davinci_all_defconfig/gcc-10/lab-baylibre/baseline-da850-lcdk.txt
HTML log: https://storage.kernelci.org//cip-gitlab/ci-pavel-linux-test/v5.10.112-cip6/arm/davinci_all_defconfig/gcc-10/lab-baylibre/baseline-da850-lcdk.html
Rootfs: http://storage.kernelci.org/images/rootfs/buildroot/buildroot-baseline/20220513.0/armel/rootfs.cpio.gz


* baseline.dmesg.alert: https://kernelci.org/test/case/id/6290f63af50c2a4cffa39be0
failing since 17 days (last pass: v4.19.233-516-ge5e741fbfc87, first fail: v5.10.109-cip5-384-g722204542e8a)
4 lines

2022-05-27T16:02:47.085805 kern :alert : BUG: Bad page state in process swapper pfn:c3000
2022-05-27T16:02:47.087184 kern :alert : BUG: Bad page state in process swapper pfn:c3400
2022-05-27T16:02:47.087794 kern :alert : BUG: Bad page state in process swapper pfn:c3800
2022-05-27T16:02:47.089570 kern :alert : BUG: Bad page state in process swapper pfn:c3c00
2022-05-27T16:02:47.129914 <8><LAVA_SIGNAL_TESTCASE TEST_CASE_ID=alert RESULT=fail UNITS=lines MEASUREMENT=4>



platform | arch | lab | compiler | defconfig | regressions
---------------------------+-------+---------------+----------+----------------------------+------------
fsl-ls1088a-rdb | arm64 | lab-nxp | gcc-10 | defconfig | 1

Details: https://kernelci.org/test/plan/id/6290fe50482602d320a39bd7

Results: 0 PASS, 1 FAIL, 0 SKIP
Full config: defconfig
Compiler: gcc-10 (aarch64-linux-gnu-gcc (Debian 10.2.1-6) 10.2.1 20210110)
Plain log: https://storage.kernelci.org//cip-gitlab/ci-pavel-linux-test/v5.10.112-cip6/arm64/defconfig/gcc-10/lab-nxp/baseline-fsl-ls1088a-rdb.txt
HTML log: https://storage.kernelci.org//cip-gitlab/ci-pavel-linux-test/v5.10.112-cip6/arm64/defconfig/gcc-10/lab-nxp/baseline-fsl-ls1088a-rdb.html
Rootfs: http://storage.kernelci.org/images/rootfs/buildroot/buildroot-baseline/20220513.0/arm64/rootfs.cpio.gz


* baseline.login: https://kernelci.org/test/case/id/6290fe50482602d320a39bd8
failing since 17 days (last pass: v4.19.233-516-ge5e741fbfc87, first fail: v5.10.109-cip5-384-g722204542e8a)



platform | arch | lab | compiler | defconfig | regressions
---------------------------+-------+---------------+----------+----------------------------+------------
meson8b-odroidc1 | arm | lab-baylibre | gcc-10 | multi_v7_defconfig | 1

Details: https://kernelci.org/test/plan/id/6290ff0cbfb10c1d77a39bce

Results: 0 PASS, 1 FAIL, 0 SKIP
Full config: multi_v7_defconfig
Compiler: gcc-10 (arm-linux-gnueabihf-gcc (Debian 10.2.1-6) 10.2.1 20210110)
Plain log: https://storage.kernelci.org//cip-gitlab/ci-pavel-linux-test/v5.10.112-cip6/arm/multi_v7_defconfig/gcc-10/lab-baylibre/baseline-meson8b-odroidc1.txt
HTML log: https://storage.kernelci.org//cip-gitlab/ci-pavel-linux-test/v5.10.112-cip6/arm/multi_v7_defconfig/gcc-10/lab-baylibre/baseline-meson8b-odroidc1.html
Rootfs: http://storage.kernelci.org/images/rootfs/buildroot/buildroot-baseline/20220513.0/armel/rootfs.cpio.gz


* baseline.login: https://kernelci.org/test/case/id/6290ff0cbfb10c1d77a39bcf
new failure (last pass: v4.4-st5-1797-gb2b8419761095)



platform | arch | lab | compiler | defconfig | regressions
---------------------------+-------+---------------+----------+----------------------------+------------
qemu_arm64-virt-gicv2 | arm64 | lab-broonie | gcc-10 | defconfig+arm64-chromebook | 1

Details: https://kernelci.org/test/plan/id/6290fce33c58da0d98a39bd8

Results: 0 PASS, 1 FAIL, 0 SKIP
Full config: defconfig+arm64-chromebook
Compiler: gcc-10 (aarch64-linux-gnu-gcc (Debian 10.2.1-6) 10.2.1 20210110)
Plain log: https://storage.kernelci.org//cip-gitlab/ci-pavel-linux-test/v5.10.112-cip6/arm64/defconfig+arm64-chromebook/gcc-10/lab-broonie/baseline-qemu_arm64-virt-gicv2.txt
HTML log: https://storage.kernelci.org//cip-gitlab/ci-pavel-linux-test/v5.10.112-cip6/arm64/defconfig+arm64-chromebook/gcc-10/lab-broonie/baseline-qemu_arm64-virt-gicv2.html
Rootfs: http://storage.kernelci.org/images/rootfs/buildroot/buildroot-baseline/20220513.0/arm64/rootfs.cpio.gz


* baseline.login: https://kernelci.org/test/case/id/6290fce33c58da0d98a39bd9
failing since 17 days (last pass: v4.19.233-516-ge5e741fbfc87, first fail: v5.10.109-cip5-384-g722204542e8a)



platform | arch | lab | compiler | defconfig | regressions
---------------------------+-------+---------------+----------+----------------------------+------------
qemu_arm64-virt-gicv2 | arm64 | lab-broonie | gcc-10 | defconfig | 1

Details: https://kernelci.org/test/plan/id/6290fe0f482602d320a39bcf

Results: 0 PASS, 1 FAIL, 0 SKIP
Full config: defconfig
Compiler: gcc-10 (aarch64-linux-gnu-gcc (Debian 10.2.1-6) 10.2.1 20210110)
Plain log: https://storage.kernelci.org//cip-gitlab/ci-pavel-linux-test/v5.10.112-cip6/arm64/defconfig/gcc-10/lab-broonie/baseline-qemu_arm64-virt-gicv2.txt
HTML log: https://storage.kernelci.org//cip-gitlab/ci-pavel-linux-test/v5.10.112-cip6/arm64/defconfig/gcc-10/lab-broonie/baseline-qemu_arm64-virt-gicv2.html
Rootfs: http://storage.kernelci.org/images/rootfs/buildroot/buildroot-baseline/20220513.0/arm64/rootfs.cpio.gz


* baseline.login: https://kernelci.org/test/case/id/6290fe0f482602d320a39bd0
failing since 17 days (last pass: v4.19.233-516-ge5e741fbfc87, first fail: v5.10.109-cip5-384-g722204542e8a)



platform | arch | lab | compiler | defconfig | regressions
---------------------------+-------+---------------+----------+----------------------------+------------
qemu_arm64-virt-gicv2-uefi | arm64 | lab-broonie | gcc-10 | defconfig+arm64-chromebook | 1

Details: https://kernelci.org/test/plan/id/6290fccf9c8e74debba39be0

Results: 0 PASS, 1 FAIL, 0 SKIP
Full config: defconfig+arm64-chromebook
Compiler: gcc-10 (aarch64-linux-gnu-gcc (Debian 10.2.1-6) 10.2.1 20210110)
Plain log: https://storage.kernelci.org//cip-gitlab/ci-pavel-linux-test/v5.10.112-cip6/arm64/defconfig+arm64-chromebook/gcc-10/lab-broonie/baseline-qemu_arm64-virt-gicv2-uefi.txt
HTML log: https://storage.kernelci.org//cip-gitlab/ci-pavel-linux-test/v5.10.112-cip6/arm64/defconfig+arm64-chromebook/gcc-10/lab-broonie/baseline-qemu_arm64-virt-gicv2-uefi.html
Rootfs: http://storage.kernelci.org/images/rootfs/buildroot/buildroot-baseline/20220513.0/arm64/rootfs.cpio.gz


* baseline.login: https://kernelci.org/test/case/id/6290fccf9c8e74debba39be1
failing since 17 days (last pass: v4.19.233-516-ge5e741fbfc87, first fail: v5.10.109-cip5-384-g722204542e8a)



platform | arch | lab | compiler | defconfig | regressions
---------------------------+-------+---------------+----------+----------------------------+------------
qemu_arm64-virt-gicv2-uefi | arm64 | lab-broonie | gcc-10 | defconfig | 1

Details: https://kernelci.org/test/plan/id/6290fe38550f50f651a39bd8

Results: 0 PASS, 1 FAIL, 0 SKIP
Full config: defconfig
Compiler: gcc-10 (aarch64-linux-gnu-gcc (Debian 10.2.1-6) 10.2.1 20210110)
Plain log: https://storage.kernelci.org//cip-gitlab/ci-pavel-linux-test/v5.10.112-cip6/arm64/defconfig/gcc-10/lab-broonie/baseline-qemu_arm64-virt-gicv2-uefi.txt
HTML log: https://storage.kernelci.org//cip-gitlab/ci-pavel-linux-test/v5.10.112-cip6/arm64/defconfig/gcc-10/lab-broonie/baseline-qemu_arm64-virt-gicv2-uefi.html
Rootfs: http://storage.kernelci.org/images/rootfs/buildroot/buildroot-baseline/20220513.0/arm64/rootfs.cpio.gz


* baseline.login: https://kernelci.org/test/case/id/6290fe38550f50f651a39bd9
failing since 17 days (last pass: v4.19.233-516-ge5e741fbfc87, first fail: v5.10.109-cip5-384-g722204542e8a)



platform | arch | lab | compiler | defconfig | regressions
---------------------------+-------+---------------+----------+----------------------------+------------
qemu_arm64-virt-gicv3 | arm64 | lab-broonie | gcc-10 | defconfig+arm64-chromebook | 1

Details: https://kernelci.org/test/plan/id/6290fcd019805f8fb6a39bdc

Results: 0 PASS, 1 FAIL, 0 SKIP
Full config: defconfig+arm64-chromebook
Compiler: gcc-10 (aarch64-linux-gnu-gcc (Debian 10.2.1-6) 10.2.1 20210110)
Plain log: https://storage.kernelci.org//cip-gitlab/ci-pavel-linux-test/v5.10.112-cip6/arm64/defconfig+arm64-chromebook/gcc-10/lab-broonie/baseline-qemu_arm64-virt-gicv3.txt
HTML log: https://storage.kernelci.org//cip-gitlab/ci-pavel-linux-test/v5.10.112-cip6/arm64/defconfig+arm64-chromebook/gcc-10/lab-broonie/baseline-qemu_arm64-virt-gicv3.html
Rootfs: http://storage.kernelci.org/images/rootfs/buildroot/buildroot-baseline/20220513.0/arm64/rootfs.cpio.gz


* baseline.login: https://kernelci.org/test/case/id/6290fcd019805f8fb6a39bdd
failing since 17 days (last pass: v4.19.233-516-ge5e741fbfc87, first fail: v5.10.109-cip5-384-g722204542e8a)



platform | arch | lab | compiler | defconfig | regressions
---------------------------+-------+---------------+----------+----------------------------+------------
qemu_arm64-virt-gicv3 | arm64 | lab-broonie | gcc-10 | defconfig | 1

Details: https://kernelci.org/test/plan/id/6290fcf7cc6bddbe24a39bef

Results: 0 PASS, 1 FAIL, 0 SKIP
Full config: defconfig
Compiler: gcc-10 (aarch64-linux-gnu-gcc (Debian 10.2.1-6) 10.2.1 20210110)
Plain log: https://storage.kernelci.org//cip-gitlab/ci-pavel-linux-test/v5.10.112-cip6/arm64/defconfig/gcc-10/lab-broonie/baseline-qemu_arm64-virt-gicv3.txt
HTML log: https://storage.kernelci.org//cip-gitlab/ci-pavel-linux-test/v5.10.112-cip6/arm64/defconfig/gcc-10/lab-broonie/baseline-qemu_arm64-virt-gicv3.html
Rootfs: http://storage.kernelci.org/images/rootfs/buildroot/buildroot-baseline/20220513.0/arm64/rootfs.cpio.gz


* baseline.login: https://kernelci.org/test/case/id/6290fcf7cc6bddbe24a39bf0
failing since 17 days (last pass: v4.19.233-516-ge5e741fbfc87, first fail: v5.10.109-cip5-384-g722204542e8a)



platform | arch | lab | compiler | defconfig | regressions
---------------------------+-------+---------------+----------+----------------------------+------------
qemu_arm64-virt-gicv3-uefi | arm64 | lab-broonie | gcc-10 | defconfig+arm64-chromebook | 1

Details: https://kernelci.org/test/plan/id/6290fca65671e00030a39c2b

Results: 0 PASS, 1 FAIL, 0 SKIP
Full config: defconfig+arm64-chromebook
Compiler: gcc-10 (aarch64-linux-gnu-gcc (Debian 10.2.1-6) 10.2.1 20210110)
Plain log: https://storage.kernelci.org//cip-gitlab/ci-pavel-linux-test/v5.10.112-cip6/arm64/defconfig+arm64-chromebook/gcc-10/lab-broonie/baseline-qemu_arm64-virt-gicv3-uefi.txt
HTML log: https://storage.kernelci.org//cip-gitlab/ci-pavel-linux-test/v5.10.112-cip6/arm64/defconfig+arm64-chromebook/gcc-10/lab-broonie/baseline-qemu_arm64-virt-gicv3-uefi.html
Rootfs: http://storage.kernelci.org/images/rootfs/buildroot/buildroot-baseline/20220513.0/arm64/rootfs.cpio.gz


* baseline.login: https://kernelci.org/test/case/id/6290fca65671e00030a39c2c
failing since 17 days (last pass: v4.19.233-516-ge5e741fbfc87, first fail: v5.10.109-cip5-384-g722204542e8a)



platform | arch | lab | compiler | defconfig | regressions
---------------------------+-------+---------------+----------+----------------------------+------------
qemu_arm64-virt-gicv3-uefi | arm64 | lab-broonie | gcc-10 | defconfig | 1

Details: https://kernelci.org/test/plan/id/6290fe37482602d320a39bd3

Results: 0 PASS, 1 FAIL, 0 SKIP
Full config: defconfig
Compiler: gcc-10 (aarch64-linux-gnu-gcc (Debian 10.2.1-6) 10.2.1 20210110)
Plain log: https://storage.kernelci.org//cip-gitlab/ci-pavel-linux-test/v5.10.112-cip6/arm64/defconfig/gcc-10/lab-broonie/baseline-qemu_arm64-virt-gicv3-uefi.txt
HTML log: https://storage.kernelci.org//cip-gitlab/ci-pavel-linux-test/v5.10.112-cip6/arm64/defconfig/gcc-10/lab-broonie/baseline-qemu_arm64-virt-gicv3-uefi.html
Rootfs: http://storage.kernelci.org/images/rootfs/buildroot/buildroot-baseline/20220513.0/arm64/rootfs.cpio.gz


* baseline.login: https://kernelci.org/test/case/id/6290fe37482602d320a39bd4
failing since 17 days (last pass: v4.19.233-516-ge5e741fbfc87, first fail: v5.10.109-cip5-384-g722204542e8a)


cip-gitlab/ci/pavel/linux-test baseline-cip-nfs: 6 runs, 1 regressions (v5.10.112-cip6) #kernelci

kernelci.org bot <bot@...>
 

cip-gitlab/ci/pavel/linux-test baseline-cip-nfs: 6 runs, 1 regressions (v5.10.112-cip6)

Regressions Summary
-------------------

platform | arch | lab | compiler | defconfig | regressions
-----------------+------+-------------+----------+---------------------+------------
beaglebone-black | arm | lab-broonie | gcc-10 | omap2plus_defconfig | 1

Details: https://kernelci.org/test/job/cip-gitlab/branch/ci%2Fpavel%2Flinux-test/kernel/v5.10.112-cip6/plan/baseline-cip-nfs/

Test: baseline-cip-nfs
Tree: cip-gitlab
Branch: ci/pavel/linux-test
Describe: v5.10.112-cip6
URL: https://gitlab.com/cip-project/cip-kernel/linux-cip.git
SHA: c8f6747dcd02a8f87731c324f4bc37bd120a8982


Test Regressions
----------------


platform | arch | lab | compiler | defconfig | regressions
-----------------+------+-------------+----------+---------------------+------------
beaglebone-black | arm | lab-broonie | gcc-10 | omap2plus_defconfig | 1

Details: https://kernelci.org/test/plan/id/6290f8d144e5ef16e0a39bd7

Results: 0 PASS, 1 FAIL, 0 SKIP
Full config: omap2plus_defconfig
Compiler: gcc-10 (arm-linux-gnueabihf-gcc (Debian 10.2.1-6) 10.2.1 20210110)
Plain log: https://storage.kernelci.org//cip-gitlab/ci-pavel-linux-test/v5.10.112-cip6/arm/omap2plus_defconfig/gcc-10/lab-broonie/baseline-cip-nfs-beaglebone-black.txt
HTML log: https://storage.kernelci.org//cip-gitlab/ci-pavel-linux-test/v5.10.112-cip6/arm/omap2plus_defconfig/gcc-10/lab-broonie/baseline-cip-nfs-beaglebone-black.html
Rootfs: https://storage.kernelci.org/images/rootfs/cip/20211105/qemu-arm/cip-core-image-kernelci-cip-core-buster-qemu-arm-initrd.img.gz


* baseline-cip-nfs.login: https://kernelci.org/test/case/id/6290f8d144e5ef16e0a39bd8
new failure (last pass: v4.4-st5-1797-gb2b8419761095)


cip-gitlab/ci/pavel/linux-test build: 185 builds: 3 failed, 182 passed, 4 errors, 10 warnings (v5.10.112-cip6) #kernelci

kernelci.org bot <bot@...>
 

cip-gitlab/ci/pavel/linux-test build: 185 builds: 3 failed, 182 passed, 4 errors, 10 warnings (v5.10.112-cip6)

Full Build Summary: https://kernelci.org/build/cip-gitlab/branch/ci%2Fpavel%2Flinux-test/kernel/v5.10.112-cip6/

Tree: cip-gitlab
Branch: ci/pavel/linux-test
Git Describe: v5.10.112-cip6
Git Commit: c8f6747dcd02a8f87731c324f4bc37bd120a8982
Git URL: https://gitlab.com/cip-project/cip-kernel/linux-cip.git
Built: 7 unique architectures

Build Failures Detected:

arm:
rpc_defconfig: (gcc-10) FAIL

mips:
ip27_defconfig: (gcc-10) FAIL
ip28_defconfig: (gcc-10) FAIL

Errors and Warnings Detected:

arc:

arm64:

arm:
rpc_defconfig (gcc-10): 4 errors

i386:

mips:
32r2el_defconfig (gcc-10): 1 warning
decstation_64_defconfig (gcc-10): 1 warning
decstation_defconfig (gcc-10): 1 warning
decstation_r4k_defconfig (gcc-10): 1 warning
lemote2f_defconfig (gcc-10): 1 warning
rm200_defconfig (gcc-10): 1 warning

riscv:
rv32_defconfig (gcc-10): 4 warnings

x86_64:

Errors summary:

2 arm-linux-gnueabihf-gcc: error: unrecognized -march target: armv3m
2 arm-linux-gnueabihf-gcc: error: missing argument to ‘-march=’

Warnings summary:

3 kernel/rcu/tasks.h:707:13: warning: ‘show_rcu_tasks_rude_gp_kthread’ defined but not used [-Wunused-function]
2 <stdin>:830:2: warning: #warning syscall fstat64 not implemented [-Wcpp]
2 <stdin>:1127:2: warning: #warning syscall fstatat64 not implemented [-Wcpp]
1 net/mac80211/mlme.c:4343:1: warning: the frame size of 1040 bytes is larger than 1024 bytes [-Wframe-larger-than=]
1 drivers/block/paride/bpck.c:32: warning: "PC" redefined
1 WARNING: modpost: Symbol info of vmlinux is missing. Unresolved symbol check will be entirely skipped.

Section mismatches summary:

1 WARNING: modpost: vmlinux.o(.text+0xd054): Section mismatch in reference from the function __arm_ioremap_pfn_caller() to the function .meminit.text:memblock_is_map_memory()
1 WARNING: modpost: vmlinux.o(.text+0xceb0): Section mismatch in reference from the function __arm_ioremap_pfn_caller() to the function .meminit.text:memblock_is_map_memory()
1 WARNING: modpost: vmlinux.o(.text+0xcdb8): Section mismatch in reference from the function __arm_ioremap_pfn_caller() to the function .meminit.text:memblock_is_map_memory()
1 WARNING: modpost: vmlinux.o(.text+0xcd4c): Section mismatch in reference from the function __arm_ioremap_pfn_caller() to the function .meminit.text:memblock_is_map_memory()
1 WARNING: modpost: vmlinux.o(.text+0xcb98): Section mismatch in reference from the function __arm_ioremap_pfn_caller() to the function .meminit.text:memblock_is_map_memory()
1 WARNING: modpost: vmlinux.o(.text+0xcb88): Section mismatch in reference from the function __arm_ioremap_pfn_caller() to the function .meminit.text:memblock_is_map_memory()
1 WARNING: modpost: vmlinux.o(.text+0xcb80): Section mismatch in reference from the function __arm_ioremap_pfn_caller() to the function .meminit.text:memblock_is_map_memory()
1 WARNING: modpost: vmlinux.o(.text+0xcb60): Section mismatch in reference from the function __arm_ioremap_pfn_caller() to the function .meminit.text:memblock_is_map_memory()
1 WARNING: modpost: vmlinux.o(.text+0xcabc): Section mismatch in reference from the function __arm_ioremap_pfn_caller() to the function .meminit.text:memblock_is_map_memory()
1 WARNING: modpost: vmlinux.o(.text+0xc900): Section mismatch in reference from the function __arm_ioremap_pfn_caller() to the function .meminit.text:memblock_is_map_memory()
1 WARNING: modpost: vmlinux.o(.text+0xb918): Section mismatch in reference from the function __arm_ioremap_pfn_caller() to the function .meminit.text:memblock_is_map_memory()
1 WARNING: modpost: vmlinux.o(.text+0x8068): Section mismatch in reference from the function __arm_ioremap_pfn_caller() to the function .meminit.text:memblock_is_map_memory()
1 WARNING: modpost: vmlinux.o(.text+0x7684): Section mismatch in reference from the function __arm_ioremap_pfn_caller() to the function .meminit.text:memblock_is_map_memory()

================================================================================

Detailed per-defconfig build reports:

--------------------------------------------------------------------------------
32r2el_defconfig (mips, gcc-10) — PASS, 0 errors, 1 warning, 0 section mismatches

Warnings:
WARNING: modpost: Symbol info of vmlinux is missing. Unresolved symbol check will be entirely skipped.

--------------------------------------------------------------------------------
allnoconfig (arc, gcc-10) — PASS, 0 errors, 0 warnings, 0 section mismatches

--------------------------------------------------------------------------------
allnoconfig (x86_64, gcc-10) — PASS, 0 errors, 0 warnings, 0 section mismatches

--------------------------------------------------------------------------------
allnoconfig (i386, gcc-10) — PASS, 0 errors, 0 warnings, 0 section mismatches

--------------------------------------------------------------------------------
am200epdkit_defconfig (arm, gcc-10) — PASS, 0 errors, 0 warnings, 0 section mismatches

--------------------------------------------------------------------------------
ar7_defconfig (mips, gcc-10) — PASS, 0 errors, 0 warnings, 0 section mismatches

--------------------------------------------------------------------------------
aspeed_g4_defconfig (arm, gcc-10) — PASS, 0 errors, 0 warnings, 0 section mismatches

--------------------------------------------------------------------------------
aspeed_g5_defconfig (arm, gcc-10) — PASS, 0 errors, 0 warnings, 0 section mismatches

--------------------------------------------------------------------------------
assabet_defconfig (arm, gcc-10) — PASS, 0 errors, 0 warnings, 0 section mismatches

Section mismatches:
WARNING: modpost: vmlinux.o(.text+0xcb80): Section mismatch in reference from the function __arm_ioremap_pfn_caller() to the function .meminit.text:memblock_is_map_memory()

--------------------------------------------------------------------------------
at91_dt_defconfig (arm, gcc-10) — PASS, 0 errors, 0 warnings, 0 section mismatches

--------------------------------------------------------------------------------
ath25_defconfig (mips, gcc-10) — PASS, 0 errors, 0 warnings, 0 section mismatches

--------------------------------------------------------------------------------
ath79_defconfig (mips, gcc-10) — PASS, 0 errors, 0 warnings, 0 section mismatches

--------------------------------------------------------------------------------
axm55xx_defconfig (arm, gcc-10) — PASS, 0 errors, 0 warnings, 0 section mismatches

--------------------------------------------------------------------------------
axs103_defconfig (arc, gcc-10) — PASS, 0 errors, 0 warnings, 0 section mismatches

--------------------------------------------------------------------------------
axs103_smp_defconfig (arc, gcc-10) — PASS, 0 errors, 0 warnings, 0 section mismatches

--------------------------------------------------------------------------------
badge4_defconfig (arm, gcc-10) — PASS, 0 errors, 0 warnings, 0 section mismatches

Section mismatches:
WARNING: modpost: vmlinux.o(.text+0xcd4c): Section mismatch in reference from the function __arm_ioremap_pfn_caller() to the function .meminit.text:memblock_is_map_memory()

--------------------------------------------------------------------------------
bcm2835_defconfig (arm, gcc-10) — PASS, 0 errors, 0 warnings, 0 section mismatches

--------------------------------------------------------------------------------
bcm47xx_defconfig (mips, gcc-10) — PASS, 0 errors, 0 warnings, 0 section mismatches

--------------------------------------------------------------------------------
bcm63xx_defconfig (mips, gcc-10) — PASS, 0 errors, 0 warnings, 0 section mismatches

--------------------------------------------------------------------------------
bigsur_defconfig (mips, gcc-10) — PASS, 0 errors, 0 warnings, 0 section mismatches

--------------------------------------------------------------------------------
bmips_be_defconfig (mips, gcc-10) — PASS, 0 errors, 0 warnings, 0 section mismatches

--------------------------------------------------------------------------------
bmips_stb_defconfig (mips, gcc-10) — PASS, 0 errors, 0 warnings, 0 section mismatches

--------------------------------------------------------------------------------
capcella_defconfig (mips, gcc-10) — PASS, 0 errors, 0 warnings, 0 section mismatches

--------------------------------------------------------------------------------
cavium_octeon_defconfig (mips, gcc-10) — PASS, 0 errors, 0 warnings, 0 section mismatches

--------------------------------------------------------------------------------
cerfcube_defconfig (arm, gcc-10) — PASS, 0 errors, 0 warnings, 0 section mismatches

Section mismatches:
WARNING: modpost: vmlinux.o(.text+0x7684): Section mismatch in reference from the function __arm_ioremap_pfn_caller() to the function .meminit.text:memblock_is_map_memory()

--------------------------------------------------------------------------------
ci20_defconfig (mips, gcc-10) — PASS, 0 errors, 0 warnings, 0 section mismatches

--------------------------------------------------------------------------------
cm_x300_defconfig (arm, gcc-10) — PASS, 0 errors, 0 warnings, 0 section mismatches

--------------------------------------------------------------------------------
cobalt_defconfig (mips, gcc-10) — PASS, 0 errors, 0 warnings, 0 section mismatches

--------------------------------------------------------------------------------
colibri_pxa270_defconfig (arm, gcc-10) — PASS, 0 errors, 0 warnings, 0 section mismatches

--------------------------------------------------------------------------------
colibri_pxa300_defconfig (arm, gcc-10) — PASS, 0 errors, 0 warnings, 0 section mismatches

--------------------------------------------------------------------------------
collie_defconfig (arm, gcc-10) — PASS, 0 errors, 0 warnings, 0 section mismatches

Section mismatches:
WARNING: modpost: vmlinux.o(.text+0xb918): Section mismatch in reference from the function __arm_ioremap_pfn_caller() to the function .meminit.text:memblock_is_map_memory()

--------------------------------------------------------------------------------
corgi_defconfig (arm, gcc-10) — PASS, 0 errors, 0 warnings, 0 section mismatches

--------------------------------------------------------------------------------
cu1000-neo_defconfig (mips, gcc-10) — PASS, 0 errors, 0 warnings, 0 section mismatches

--------------------------------------------------------------------------------
cu1830-neo_defconfig (mips, gcc-10) — PASS, 0 errors, 0 warnings, 0 section mismatches

--------------------------------------------------------------------------------
davinci_all_defconfig (arm, gcc-10) — PASS, 0 errors, 0 warnings, 0 section mismatches

--------------------------------------------------------------------------------
db1xxx_defconfig (mips, gcc-10) — PASS, 0 errors, 0 warnings, 0 section mismatches

--------------------------------------------------------------------------------
decstation_64_defconfig (mips, gcc-10) — PASS, 0 errors, 1 warning, 0 section mismatches

Warnings:
kernel/rcu/tasks.h:707:13: warning: ‘show_rcu_tasks_rude_gp_kthread’ defined but not used [-Wunused-function]

--------------------------------------------------------------------------------
decstation_defconfig (mips, gcc-10) — PASS, 0 errors, 1 warning, 0 section mismatches

Warnings:
kernel/rcu/tasks.h:707:13: warning: ‘show_rcu_tasks_rude_gp_kthread’ defined but not used [-Wunused-function]

--------------------------------------------------------------------------------
decstation_r4k_defconfig (mips, gcc-10) — PASS, 0 errors, 1 warning, 0 section mismatches

Warnings:
kernel/rcu/tasks.h:707:13: warning: ‘show_rcu_tasks_rude_gp_kthread’ defined but not used [-Wunused-function]

--------------------------------------------------------------------------------
defconfig (riscv, gcc-10) — PASS, 0 errors, 0 warnings, 0 section mismatches

--------------------------------------------------------------------------------
defconfig (arm64, gcc-10) — PASS, 0 errors, 0 warnings, 0 section mismatches

--------------------------------------------------------------------------------
defconfig+arm64-chromebook (arm64, gcc-10) — PASS, 0 errors, 0 warnings, 0 section mismatches

--------------------------------------------------------------------------------
dove_defconfig (arm, gcc-10) — PASS, 0 errors, 0 warnings, 0 section mismatches

--------------------------------------------------------------------------------
e55_defconfig (mips, gcc-10) — PASS, 0 errors, 0 warnings, 0 section mismatches

--------------------------------------------------------------------------------
ebsa110_defconfig (arm, gcc-10) — PASS, 0 errors, 0 warnings, 0 section mismatches

--------------------------------------------------------------------------------
efm32_defconfig (arm, gcc-10) — PASS, 0 errors, 0 warnings, 0 section mismatches

--------------------------------------------------------------------------------
ep93xx_defconfig (arm, gcc-10) — PASS, 0 errors, 0 warnings, 0 section mismatches

Section mismatches:
WARNING: modpost: vmlinux.o(.text+0x8068): Section mismatch in reference from the function __arm_ioremap_pfn_caller() to the function .meminit.text:memblock_is_map_memory()

--------------------------------------------------------------------------------
eseries_pxa_defconfig (arm, gcc-10) — PASS, 0 errors, 0 warnings, 0 section mismatches

--------------------------------------------------------------------------------
exynos_defconfig (arm, gcc-10) — PASS, 0 errors, 0 warnings, 0 section mismatches

--------------------------------------------------------------------------------
ezx_defconfig (arm, gcc-10) — PASS, 0 errors, 0 warnings, 0 section mismatches

--------------------------------------------------------------------------------
footbridge_defconfig (arm, gcc-10) — PASS, 0 errors, 0 warnings, 0 section mismatches

--------------------------------------------------------------------------------
fuloong2e_defconfig (mips, gcc-10) — PASS, 0 errors, 0 warnings, 0 section mismatches

--------------------------------------------------------------------------------
gcw0_defconfig (mips, gcc-10) — PASS, 0 errors, 0 warnings, 0 section mismatches

--------------------------------------------------------------------------------
gemini_defconfig (arm, gcc-10) — PASS, 0 errors, 0 warnings, 0 section mismatches

--------------------------------------------------------------------------------
gpr_defconfig (mips, gcc-10) — PASS, 0 errors, 0 warnings, 0 section mismatches

--------------------------------------------------------------------------------
h3600_defconfig (arm, gcc-10) — PASS, 0 errors, 0 warnings, 0 section mismatches

Section mismatches:
WARNING: modpost: vmlinux.o(.text+0xcb98): Section mismatch in reference from the function __arm_ioremap_pfn_caller() to the function .meminit.text:memblock_is_map_memory()

--------------------------------------------------------------------------------
h5000_defconfig (arm, gcc-10) — PASS, 0 errors, 0 warnings, 0 section mismatches

--------------------------------------------------------------------------------
hackkit_defconfig (arm, gcc-10) — PASS, 0 errors, 0 warnings, 0 section mismatches

Section mismatches:
WARNING: modpost: vmlinux.o(.text+0xceb0): Section mismatch in reference from the function __arm_ioremap_pfn_caller() to the function .meminit.text:memblock_is_map_memory()

--------------------------------------------------------------------------------
haps_hs_defconfig (arc, gcc-10) — PASS, 0 errors, 0 warnings, 0 section mismatches

--------------------------------------------------------------------------------
haps_hs_smp_defconfig (arc, gcc-10) — PASS, 0 errors, 0 warnings, 0 section mismatches

--------------------------------------------------------------------------------
hisi_defconfig (arm, gcc-10) — PASS, 0 errors, 0 warnings, 0 section mismatches

--------------------------------------------------------------------------------
hsdk_defconfig (arc, gcc-10) — PASS, 0 errors, 0 warnings, 0 section mismatches

--------------------------------------------------------------------------------
i386_defconfig (i386, gcc-10) — PASS, 0 errors, 0 warnings, 0 section mismatches

--------------------------------------------------------------------------------
imote2_defconfig (arm, gcc-10) — PASS, 0 errors, 0 warnings, 0 section mismatches

--------------------------------------------------------------------------------
imx_v4_v5_defconfig (arm, gcc-10) — PASS, 0 errors, 0 warnings, 0 section mismatches

--------------------------------------------------------------------------------
imx_v6_v7_defconfig (arm, gcc-10) — PASS, 0 errors, 0 warnings, 0 section mismatches

--------------------------------------------------------------------------------
integrator_defconfig (arm, gcc-10) — PASS, 0 errors, 0 warnings, 0 section mismatches

--------------------------------------------------------------------------------
iop32x_defconfig (arm, gcc-10) — PASS, 0 errors, 0 warnings, 0 section mismatches

--------------------------------------------------------------------------------
ip22_defconfig (mips, gcc-10) — PASS, 0 errors, 0 warnings, 0 section mismatches

--------------------------------------------------------------------------------
ip27_defconfig (mips, gcc-10) — FAIL, 0 errors, 0 warnings, 0 section mismatches

--------------------------------------------------------------------------------
ip28_defconfig (mips, gcc-10) — FAIL, 0 errors, 0 warnings, 0 section mismatches

--------------------------------------------------------------------------------
ip32_defconfig (mips, gcc-10) — PASS, 0 errors, 0 warnings, 0 section mismatches

--------------------------------------------------------------------------------
ixp4xx_defconfig (arm, gcc-10) — PASS, 0 errors, 0 warnings, 0 section mismatches

--------------------------------------------------------------------------------
jazz_defconfig (mips, gcc-10) — PASS, 0 errors, 0 warnings, 0 section mismatches

--------------------------------------------------------------------------------
jmr3927_defconfig (mips, gcc-10) — PASS, 0 errors, 0 warnings, 0 section mismatches

--------------------------------------------------------------------------------
jornada720_defconfig (arm, gcc-10) — PASS, 0 errors, 0 warnings, 0 section mismatches

Section mismatches:
WARNING: modpost: vmlinux.o(.text+0xcabc): Section mismatch in reference from the function __arm_ioremap_pfn_caller() to the function .meminit.text:memblock_is_map_memory()

--------------------------------------------------------------------------------
keystone_defconfig (arm, gcc-10) — PASS, 0 errors, 0 warnings, 0 section mismatches

--------------------------------------------------------------------------------
lart_defconfig (arm, gcc-10) — PASS, 0 errors, 0 warnings, 0 section mismatches

Section mismatches:
WARNING: modpost: vmlinux.o(.text+0xcb88): Section mismatch in reference from the function __arm_ioremap_pfn_caller() to the function .meminit.text:memblock_is_map_memory()

--------------------------------------------------------------------------------
lemote2f_defconfig (mips, gcc-10) — PASS, 0 errors, 1 warning, 0 section mismatches

Warnings:
net/mac80211/mlme.c:4343:1: warning: the frame size of 1040 bytes is larger than 1024 bytes [-Wframe-larger-than=]

--------------------------------------------------------------------------------
loongson1b_defconfig (mips, gcc-10) — PASS, 0 errors, 0 warnings, 0 section mismatches

--------------------------------------------------------------------------------
loongson1c_defconfig (mips, gcc-10) — PASS, 0 errors, 0 warnings, 0 section mismatches

--------------------------------------------------------------------------------
loongson3_defconfig (mips, gcc-10) — PASS, 0 errors, 0 warnings, 0 section mismatches

--------------------------------------------------------------------------------
lpc18xx_defconfig (arm, gcc-10) — PASS, 0 errors, 0 warnings, 0 section mismatches

--------------------------------------------------------------------------------
lpc32xx_defconfig (arm, gcc-10) — PASS, 0 errors, 0 warnings, 0 section mismatches

--------------------------------------------------------------------------------
lpd270_defconfig (arm, gcc-10) — PASS, 0 errors, 0 warnings, 0 section mismatches

--------------------------------------------------------------------------------
lubbock_defconfig (arm, gcc-10) — PASS, 0 errors, 0 warnings, 0 section mismatches

--------------------------------------------------------------------------------
magician_defconfig (arm, gcc-10) — PASS, 0 errors, 0 warnings, 0 section mismatches

--------------------------------------------------------------------------------
mainstone_defconfig (arm, gcc-10) — PASS, 0 errors, 0 warnings, 0 section mismatches

--------------------------------------------------------------------------------
malta_defconfig (mips, gcc-10) — PASS, 0 errors, 0 warnings, 0 section mismatches

--------------------------------------------------------------------------------
malta_kvm_defconfig (mips, gcc-10) — PASS, 0 errors, 0 warnings, 0 section mismatches

--------------------------------------------------------------------------------
malta_kvm_guest_defconfig (mips, gcc-10) — PASS, 0 errors, 0 warnings, 0 section mismatches

--------------------------------------------------------------------------------
malta_qemu_32r6_defconfig (mips, gcc-10) — PASS, 0 errors, 0 warnings, 0 section mismatches

--------------------------------------------------------------------------------
maltaaprp_defconfig (mips, gcc-10) — PASS, 0 errors, 0 warnings, 0 section mismatches

--------------------------------------------------------------------------------
maltasmvp_defconfig (mips, gcc-10) — PASS, 0 errors, 0 warnings, 0 section mismatches

--------------------------------------------------------------------------------
maltasmvp_eva_defconfig (mips, gcc-10) — PASS, 0 errors, 0 warnings, 0 section mismatches

--------------------------------------------------------------------------------
maltaup_defconfig (mips, gcc-10) — PASS, 0 errors, 0 warnings, 0 section mismatches

--------------------------------------------------------------------------------
maltaup_xpa_defconfig (mips, gcc-10) — PASS, 0 errors, 0 warnings, 0 section mismatches

--------------------------------------------------------------------------------
milbeaut_m10v_defconfig (arm, gcc-10) — PASS, 0 errors, 0 warnings, 0 section mismatches

--------------------------------------------------------------------------------
mini2440_defconfig (arm, gcc-10) — PASS, 0 errors, 0 warnings, 0 section mismatches

--------------------------------------------------------------------------------
mmp2_defconfig (arm, gcc-10) — PASS, 0 errors, 0 warnings, 0 section mismatches

--------------------------------------------------------------------------------
moxart_defconfig (arm, gcc-10) — PASS, 0 errors, 0 warnings, 0 section mismatches

--------------------------------------------------------------------------------
mpc30x_defconfig (mips, gcc-10) — PASS, 0 errors, 0 warnings, 0 section mismatches

--------------------------------------------------------------------------------
mps2_defconfig (arm, gcc-10) — PASS, 0 errors, 0 warnings, 0 section mismatches

--------------------------------------------------------------------------------
mtx1_defconfig (mips, gcc-10) — PASS, 0 errors, 0 warnings, 0 section mismatches

--------------------------------------------------------------------------------
multi_v4t_defconfig (arm, gcc-10) — PASS, 0 errors, 0 warnings, 0 section mismatches

--------------------------------------------------------------------------------
multi_v5_defconfig (arm, gcc-10) — PASS, 0 errors, 0 warnings, 0 section mismatches

--------------------------------------------------------------------------------
multi_v7_defconfig (arm, gcc-10) — PASS, 0 errors, 0 warnings, 0 section mismatches

--------------------------------------------------------------------------------
mvebu_v5_defconfig (arm, gcc-10) — PASS, 0 errors, 0 warnings, 0 section mismatches

--------------------------------------------------------------------------------
mvebu_v7_defconfig (arm, gcc-10) — PASS, 0 errors, 0 warnings, 0 section mismatches

--------------------------------------------------------------------------------
mxs_defconfig (arm, gcc-10) — PASS, 0 errors, 0 warnings, 0 section mismatches

--------------------------------------------------------------------------------
neponset_defconfig (arm, gcc-10) — PASS, 0 errors, 0 warnings, 0 section mismatches

Section mismatches:
WARNING: modpost: vmlinux.o(.text+0xcdb8): Section mismatch in reference from the function __arm_ioremap_pfn_caller() to the function .meminit.text:memblock_is_map_memory()

--------------------------------------------------------------------------------
netwinder_defconfig (arm, gcc-10) — PASS, 0 errors, 0 warnings, 0 section mismatches

--------------------------------------------------------------------------------
nhk8815_defconfig (arm, gcc-10) — PASS, 0 errors, 0 warnings, 0 section mismatches

--------------------------------------------------------------------------------
nlm_xlp_defconfig (mips, gcc-10) — PASS, 0 errors, 0 warnings, 0 section mismatches

--------------------------------------------------------------------------------
nlm_xlr_defconfig (mips, gcc-10) — PASS, 0 errors, 0 warnings, 0 section mismatches

--------------------------------------------------------------------------------
nommu_k210_defconfig (riscv, gcc-10) — PASS, 0 errors, 0 warnings, 0 section mismatches

--------------------------------------------------------------------------------
nsimosci_hs_defconfig (arc, gcc-10) — PASS, 0 errors, 0 warnings, 0 section mismatches

--------------------------------------------------------------------------------
nsimosci_hs_smp_defconfig (arc, gcc-10) — PASS, 0 errors, 0 warnings, 0 section mismatches

--------------------------------------------------------------------------------
omap1_defconfig (arm, gcc-10) — PASS, 0 errors, 0 warnings, 0 section mismatches

--------------------------------------------------------------------------------
omap2plus_defconfig (arm, gcc-10) — PASS, 0 errors, 0 warnings, 0 section mismatches

--------------------------------------------------------------------------------
omega2p_defconfig (mips, gcc-10) — PASS, 0 errors, 0 warnings, 0 section mismatches

--------------------------------------------------------------------------------
orion5x_defconfig (arm, gcc-10) — PASS, 0 errors, 0 warnings, 0 section mismatches

--------------------------------------------------------------------------------
oxnas_v6_defconfig (arm, gcc-10) — PASS, 0 errors, 0 warnings, 0 section mismatches

--------------------------------------------------------------------------------
palmz72_defconfig (arm, gcc-10) — PASS, 0 errors, 0 warnings, 0 section mismatches

--------------------------------------------------------------------------------
pcm027_defconfig (arm, gcc-10) — PASS, 0 errors, 0 warnings, 0 section mismatches

--------------------------------------------------------------------------------
pic32mzda_defconfig (mips, gcc-10) — PASS, 0 errors, 0 warnings, 0 section mismatches

--------------------------------------------------------------------------------
pistachio_defconfig (mips, gcc-10) — PASS, 0 errors, 0 warnings, 0 section mismatches

--------------------------------------------------------------------------------
pleb_defconfig (arm, gcc-10) — PASS, 0 errors, 0 warnings, 0 section mismatches

Section mismatches:
WARNING: modpost: vmlinux.o(.text+0xc900): Section mismatch in reference from the function __arm_ioremap_pfn_caller() to the function .meminit.text:memblock_is_map_memory()

--------------------------------------------------------------------------------
prima2_defconfig (arm, gcc-10) — PASS, 0 errors, 0 warnings, 0 section mismatches

--------------------------------------------------------------------------------
pxa168_defconfig (arm, gcc-10) — PASS, 0 errors, 0 warnings, 0 section mismatches

--------------------------------------------------------------------------------
pxa255-idp_defconfig (arm, gcc-10) — PASS, 0 errors, 0 warnings, 0 section mismatches

--------------------------------------------------------------------------------
pxa3xx_defconfig (arm, gcc-10) — PASS, 0 errors, 0 warnings, 0 section mismatches

--------------------------------------------------------------------------------
pxa910_defconfig (arm, gcc-10) — PASS, 0 errors, 0 warnings, 0 section mismatches

--------------------------------------------------------------------------------
pxa_defconfig (arm, gcc-10) — PASS, 0 errors, 0 warnings, 0 section mismatches

--------------------------------------------------------------------------------
qcom_defconfig (arm, gcc-10) — PASS, 0 errors, 0 warnings, 0 section mismatches

--------------------------------------------------------------------------------
qi_lb60_defconfig (mips, gcc-10) — PASS, 0 errors, 0 warnings, 0 section mismatches

--------------------------------------------------------------------------------
rb532_defconfig (mips, gcc-10) — PASS, 0 errors, 0 warnings, 0 section mismatches

--------------------------------------------------------------------------------
rbtx49xx_defconfig (mips, gcc-10) — PASS, 0 errors, 0 warnings, 0 section mismatches

--------------------------------------------------------------------------------
realview_defconfig (arm, gcc-10) — PASS, 0 errors, 0 warnings, 0 section mismatches

--------------------------------------------------------------------------------
rm200_defconfig (mips, gcc-10) — PASS, 0 errors, 1 warning, 0 section mismatches

Warnings:
drivers/block/paride/bpck.c:32: warning: "PC" redefined

--------------------------------------------------------------------------------
rpc_defconfig (arm, gcc-10) — FAIL, 4 errors, 0 warnings, 0 section mismatches

Errors:
arm-linux-gnueabihf-gcc: error: unrecognized -march target: armv3m
arm-linux-gnueabihf-gcc: error: missing argument to ‘-march=’
arm-linux-gnueabihf-gcc: error: unrecognized -march target: armv3m
arm-linux-gnueabihf-gcc: error: missing argument to ‘-march=’

--------------------------------------------------------------------------------
rs90_defconfig (mips, gcc-10) — PASS, 0 errors, 0 warnings, 0 section mismatches

--------------------------------------------------------------------------------
rt305x_defconfig (mips, gcc-10) — PASS, 0 errors, 0 warnings, 0 section mismatches

--------------------------------------------------------------------------------
rv32_defconfig (riscv, gcc-10) — PASS, 0 errors, 4 warnings, 0 section mismatches

Warnings:
<stdin>:830:2: warning: #warning syscall fstat64 not implemented [-Wcpp]
<stdin>:1127:2: warning: #warning syscall fstatat64 not implemented [-Wcpp]
<stdin>:830:2: warning: #warning syscall fstat64 not implemented [-Wcpp]
<stdin>:1127:2: warning: #warning syscall fstatat64 not implemented [-Wcpp]

--------------------------------------------------------------------------------
s3c2410_defconfig (arm, gcc-10) — PASS, 0 errors, 0 warnings, 0 section mismatches

--------------------------------------------------------------------------------
s3c6400_defconfig (arm, gcc-10) — PASS, 0 errors, 0 warnings, 0 section mismatches

--------------------------------------------------------------------------------
s5pv210_defconfig (arm, gcc-10) — PASS, 0 errors, 0 warnings, 0 section mismatches

--------------------------------------------------------------------------------
sama5_defconfig (arm, gcc-10) — PASS, 0 errors, 0 warnings, 0 section mismatches

--------------------------------------------------------------------------------
sb1250_swarm_defconfig (mips, gcc-10) — PASS, 0 errors, 0 warnings, 0 section mismatches

--------------------------------------------------------------------------------
shannon_defconfig (arm, gcc-10) — PASS, 0 errors, 0 warnings, 0 section mismatches

Section mismatches:
WARNING: modpost: vmlinux.o(.text+0xcb60): Section mismatch in reference from the function __arm_ioremap_pfn_caller() to the function .meminit.text:memblock_is_map_memory()

--------------------------------------------------------------------------------
shmobile_defconfig (arm, gcc-10) — PASS, 0 errors, 0 warnings, 0 section mismatches

--------------------------------------------------------------------------------
simpad_defconfig (arm, gcc-10) — PASS, 0 errors, 0 warnings, 0 section mismatches

Section mismatches:
WARNING: modpost: vmlinux.o(.text+0xd054): Section mismatch in reference from the function __arm_ioremap_pfn_caller() to the function .meminit.text:memblock_is_map_memory()

--------------------------------------------------------------------------------
socfpga_defconfig (arm, gcc-10) — PASS, 0 errors, 0 warnings, 0 section mismatches

--------------------------------------------------------------------------------
spear13xx_defconfig (arm, gcc-10) — PASS, 0 errors, 0 warnings, 0 section mismatches

--------------------------------------------------------------------------------
spear3xx_defconfig (arm, gcc-10) — PASS, 0 errors, 0 warnings, 0 section mismatches

--------------------------------------------------------------------------------
spear6xx_defconfig (arm, gcc-10) — PASS, 0 errors, 0 warnings, 0 section mismatches

--------------------------------------------------------------------------------
spitz_defconfig (arm, gcc-10) — PASS, 0 errors, 0 warnings, 0 section mismatches

--------------------------------------------------------------------------------
stm32_defconfig (arm, gcc-10) — PASS, 0 errors, 0 warnings, 0 section mismatches

--------------------------------------------------------------------------------
sunxi_defconfig (arm, gcc-10) — PASS, 0 errors, 0 warnings, 0 section mismatches

--------------------------------------------------------------------------------
tango4_defconfig (arm, gcc-10) — PASS, 0 errors, 0 warnings, 0 section mismatches

--------------------------------------------------------------------------------
tb0219_defconfig (mips, gcc-10) — PASS, 0 errors, 0 warnings, 0 section mismatches

--------------------------------------------------------------------------------
tb0226_defconfig (mips, gcc-10) — PASS, 0 errors, 0 warnings, 0 section mismatches

--------------------------------------------------------------------------------
tb0287_defconfig (mips, gcc-10) — PASS, 0 errors, 0 warnings, 0 section mismatches

--------------------------------------------------------------------------------
tct_hammer_defconfig (arm, gcc-10) — PASS, 0 errors, 0 warnings, 0 section mismatches

--------------------------------------------------------------------------------
tegra_defconfig (arm, gcc-10) — PASS, 0 errors, 0 warnings, 0 section mismatches

--------------------------------------------------------------------------------
tinyconfig (i386, gcc-10) — PASS, 0 errors, 0 warnings, 0 section mismatches

--------------------------------------------------------------------------------
tinyconfig (arc, gcc-10) — PASS, 0 errors, 0 warnings, 0 section mismatches

--------------------------------------------------------------------------------
tinyconfig (x86_64, gcc-10) — PASS, 0 errors, 0 warnings, 0 section mismatches

--------------------------------------------------------------------------------
trizeps4_defconfig (arm, gcc-10) — PASS, 0 errors, 0 warnings, 0 section mismatches

--------------------------------------------------------------------------------
u300_defconfig (arm, gcc-10) — PASS, 0 errors, 0 warnings, 0 section mismatches

--------------------------------------------------------------------------------
u8500_defconfig (arm, gcc-10) — PASS, 0 errors, 0 warnings, 0 section mismatches

--------------------------------------------------------------------------------
vdk_hs38_defconfig (arc, gcc-10) — PASS, 0 errors, 0 warnings, 0 section mismatches

--------------------------------------------------------------------------------
vdk_hs38_smp_defconfig (arc, gcc-10) — PASS, 0 errors, 0 warnings, 0 section mismatches

--------------------------------------------------------------------------------
versatile_defconfig (arm, gcc-10) — PASS, 0 errors, 0 warnings, 0 section mismatches

--------------------------------------------------------------------------------
vexpress_defconfig (arm, gcc-10) — PASS, 0 errors, 0 warnings, 0 section mismatches

--------------------------------------------------------------------------------
vf610m4_defconfig (arm, gcc-10) — PASS, 0 errors, 0 warnings, 0 section mismatches

--------------------------------------------------------------------------------
viper_defconfig (arm, gcc-10) — PASS, 0 errors, 0 warnings, 0 section mismatches

--------------------------------------------------------------------------------
vocore2_defconfig (mips, gcc-10) — PASS, 0 errors, 0 warnings, 0 section mismatches

--------------------------------------------------------------------------------
vt8500_v6_v7_defconfig (arm, gcc-10) — PASS, 0 errors, 0 warnings, 0 section mismatches

--------------------------------------------------------------------------------
workpad_defconfig (mips, gcc-10) — PASS, 0 errors, 0 warnings, 0 section mismatches

--------------------------------------------------------------------------------
x86_64_defconfig (x86_64, gcc-10) — PASS, 0 errors, 0 warnings, 0 section mismatches

--------------------------------------------------------------------------------
x86_64_defconfig+x86-chromebook (x86_64, gcc-10) — PASS, 0 errors, 0 warnings, 0 section mismatches

--------------------------------------------------------------------------------
xcep_defconfig (arm, gcc-10) — PASS, 0 errors, 0 warnings, 0 section mismatches

--------------------------------------------------------------------------------
zeus_defconfig (arm, gcc-10) — PASS, 0 errors, 0 warnings, 0 section mismatches

--------------------------------------------------------------------------------
zx_defconfig (arm, gcc-10) — PASS, 0 errors, 0 warnings, 0 section mismatches

---
For more info write to <info@...>


Re: [isar-cip-core][PATCH] Update README.swupdate.md for bullseye & 5.10

Jan Kiszka
 

On 25.05.22 19:34, Hannah Kiekens wrote:
On Wed, May 25, 2022 at 1:41 PM Jan Kiszka <jan.kiszka@...
<mailto:jan.kiszka@...>> wrote:

Hehe, someone actually read AND tried the manual :). Thanks for caring!

Would be good to list some reasoning for switching to bullseye here.
Buster should still work, "just" not with 4.19 anymore.

In fact, we should think about making bullseye default in kas-cip.yml.


There is no real reason why I am switching to bullseye.
This combination worked great, what it was before did not
Right, and that is likely only because the current combination chooses
kernel 4.19 which is no longer working since 05dd963a.

This patch is currently doing the rounds at our site for evaluating/demo
isar-cip-core, I needed a working, easy to follow guide for regular
techies.  I am not sure if the technical details matter in this case
 
For that particular purpose, it does not. However, we should try to
structure the document in a way that it can be easier maintained or is
less likely to out-date where possible.


5.10 becomes default when selecting bullseye, so you could drop that
option.

It's probably also worth noting that some of the build configuration
issues are "resolved" now via "kas-container menu" and its dependency
encoding. But it is still clearer to describe the actual configuration
the way it's done here.


Sorry, it's not entirely clear if you want me to modify this patch or not.
Was kind of thinking out loudly. Let's make it more concert now:

- describe the requirements, here kernel >= 5.10
- suggest to use "kas-container menu", besides providing a concrete
call of "kas-container build ..."

Meanwhile, I've created a patch to switch defaults to bullseye [1].

Thanks,
Jan

[1]
https://lore.kernel.org/cip-dev/9c68811b-c8df-6f80-d314-b379b131ab8c@siemens.com/T/#u

--
Siemens AG, Technology
Competence Center Embedded Linux


CIP IRC weekly meeting today on libera.chat

Jan Kiszka
 

Hi all,

Kindly be reminded to attend the weekly meeting through IRC to discuss
technical topics with CIP kernel today. Our channel is the following:

irc:irc.libera.chat:6667/cip

The IRC meeting is scheduled to UTC (GMT) 12:00:

https://www.timeanddate.com/worldclock/meetingdetails.html?year=2022&month=5&day=26&hour=12&min=0&sec=0&p1=224&p2=179&p3=136&p4=37&p5=241&p6=248

USWest USEast UK DE TW JP
05:00 08:00 13:00 14:00 20:00 21:00

Last meeting minutes:
https://ircbot.wl.linuxfoundation.org/meetings/cip/2022/05/cip.2022-05-19-12.00.log.html

* Action items
1. Resolve/filter irrelevant failures of KernelCI for 4.4-cip - patersonc & alicefm
* Kernel maintenance updates
* Kernel testing
* AOB

Jan


[isar-cip-core][PATCH] Switch to bullseye by default

Jan Kiszka
 

From: Jan Kiszka <jan.kiszka@...>

For new projects, this is clearly the better choice. So, move our
defaults forward. A separate kas option is introduced to allow explicit
selections without relying on defaults.

CI is kept with its existing focus on buster images. This can be updated
separately later on.

Signed-off-by: Jan Kiszka <jan.kiszka@...>
---
.gitlab-ci.yml | 1 +
Kconfig | 3 ++-
kas-cip.yml | 4 ++--
kas/opt/buster.yml | 15 +++++++++++++++
4 files changed, 20 insertions(+), 3 deletions(-)
create mode 100644 kas/opt/buster.yml

diff --git a/.gitlab-ci.yml b/.gitlab-ci.yml
index e2ed919..8545a66 100644
--- a/.gitlab-ci.yml
+++ b/.gitlab-ci.yml
@@ -35,6 +35,7 @@ default:
- if [ "${extension}" != "base" ]; then base_yaml="${base_yaml}:kas/opt/${extension}.yml"; fi
- if [ "${wic_targz}" = "enable" ]; then base_yaml="${base_yaml}:kas/opt/wic-targz-img.yml"; fi
- if [ "${targz}" = "enable" ]; then base_yaml="${base_yaml}:kas/opt/targz-img.yml"; fi
+ - if [ "${release}" = "buster" ]; then base_yaml="${base_yaml}:kas/opt/buster.yml"; fi
- if [ "${release}" = "bullseye" ]; then base_yaml="${base_yaml}:kas/opt/bullseye.yml"; fi
- echo "Building ${base_yaml}"
- kas build ${base_yaml}
diff --git a/Kconfig b/Kconfig
index 651a726..9c89008 100644
--- a/Kconfig
+++ b/Kconfig
@@ -80,7 +80,7 @@ comment "Debian distribution options"

choice
prompt "Debian Release"
- default DEBIAN_BUSTER
+ default DEBIAN_BULLSEYE

config DEBIAN_BUSTER
bool "buster (10)"
@@ -92,6 +92,7 @@ endchoice

config KAS_INCLUDE_DEBIAN
string
+ default "kas/opt/buster.yml" if DEBIAN_BUSTER
default "kas/opt/bullseye.yml" if DEBIAN_BULLSEYE

comment "Image features"
diff --git a/kas-cip.yml b/kas-cip.yml
index fce176b..48de066 100644
--- a/kas-cip.yml
+++ b/kas-cip.yml
@@ -1,7 +1,7 @@
#
# CIP Core, generic profile
#
-# Copyright (c) Siemens AG, 2019
+# Copyright (c) Siemens AG, 2019-2022
#
# Authors:
# Jan Kiszka <jan.kiszka@...>
@@ -12,7 +12,7 @@
header:
version: 10

-distro: cip-core-buster
+distro: cip-core-bullseye
target: cip-core-image

build_system: isar
diff --git a/kas/opt/buster.yml b/kas/opt/buster.yml
new file mode 100644
index 0000000..a762163
--- /dev/null
+++ b/kas/opt/buster.yml
@@ -0,0 +1,15 @@
+#
+# CIP Core, generic profile
+#
+# Copyright (c) Siemens AG, 2022
+#
+# Authors:
+# Jan Kiszka <jan.kiszka@...>
+#
+# SPDX-License-Identifier: MIT
+#
+
+header:
+ version: 10
+
+distro: cip-core-buster
--
2.35.3


New CVE entries this week

Masami Ichikawa
 

Hi !

It's this week's CVE report.

This week reported 6 new CVEs and 3 updated CVEs.

* New CVEs

CVE-2022-1729: perf: Fix sys_perf_event_open() race against self

CVSS v3 score is not assigned.

Introduced by commit f63a8da ("perf: Fix event->ctx locking") that was
merged in 4.0-rc1.
This race condition bug allows a local user privilege escalation.
To set kernel.perf_event_paranoid >= 3, effectively rendering the
vulnerability harmless.

The mainline and stable kernels were fixed.

Fixed status
mainline: [3ac6487e584a1eb54071dbe1212e05b884136704]
stable/4.14: [dee63319e2d1abd5d37a89de046ccf32ca8a8451]
stable/4.19: [6cdd53a49aa7413e53c14ece27d826f0b628b18a]
stable/4.9: [a1466528d8ae5d9a3bb29781f0098fa3476e9e1c]
stable/5.10: [3ee8e109c3c316073a3e0f83ec0769c7ee8a7375]
stable/5.15: [e085354dde254bc6c83ee604ea66c2b36f9f9067]
stable/5.17: [22fb2974224c9836eeaf0d24fdd481fcdaa0aea8]
stable/5.4: [dd0ea88b0a0f913f82500e988ef38158a9ad9885]

CVE-2022-1789: KVM: x86/mmu: fix NULL pointer dereference on guest INVPCID

CVSS v3 score is not assigned.

Null pointer dereference bug was found in kvm_mmu_invpcid_gva() in
arch/x86/kvm/mmu/mmu.c.
4.4 is vulnerable too. Patch needs to be modified to apply 4.4.

Fixed status
mainline: [9f46c187e2e680ecd9de7983e4d081c3391acc76]

CVE-2021-33135: A vulnerability in x86/SGX driver which will allow a
local attacker to do local DoS.

CVSS v3 score is 5.5 MEDIUM.

Uncontrolled resource consumption in the Linux kernel drivers for
Intel(R) SGX may allow an authenticated user to potentially enable
denial of service via local access.

This bug was introduced by the commit 1728ab5 (x86/sgx: Add a page
reclaimer) was merged in 5.11-rc1. Earlier than 5.11-rc1 kernels
aren't affected by this vulnerability.

Fixed status
mainline: [08999b2489b4c9b939d7483dbd03702ee4576d96]
stable/5.15: [ce91f0f023adfc239b44261f6dccb4a883d44d92]

CVE-2022-1786: io_uring: always use original task when preparing req identity

CVSS v3 score is not assigned.

A freeing memory bug was found in the io_uring module. This bug allows
an attacker to escalate privilege.
The reporter describes this bug affects 5.10 and 5.11. The mainline
was fixed in commit 4379bf8 ("io_uring: remove io_identity") which was
merged in 5.12-rc1-dontuse.

Fixed status
mainline: [4379bf8bd70b5de6bba7d53015b0c36c57a634ee]
stable/5.10: [29f077d070519a88a793fbc70f1e6484dc6d9e35]

CVE-2022-1836: floppy: disable FDRAWCMD by default

CVSS v3 score is not assigned.

An UAF bug was found in the floppy driver. This bug potentially will
leds local DoS, kernel information leak.
The mainline and all stable kernels were fixed.

Fixed status
mainline: [233087ca063686964a53c829d547c7571e3f67bf]
stable/4.14: [b7fa84ae1171a3c5ea5d710899080a6e63cfe084]
stable/4.19: [0e535976774504af36fab1dfb54f3d4d6cc577a9]
stable/4.9: [0dd02ff72c6daf4e7800fb5dd1109fbacdde97dc]
stable/5.10: [54c028cfc49624bfc27a571b94edecc79bbaaab4]
stable/5.15: [e52da8e4632f9c8fe78bf1c5881ce6871c7e08f3]
stable/5.17: [d91ca05d52fabf68c0376bcfeed1a52be68a8e1b]
stable/5.4: [7dea5913000c6a2974a00d9af8e7ffb54e47eac1]

CVE-2022-21499: lockdown: also lock down previous kgdb use

CVSS v3 score is not assigned.

Using gdb or kgdb, it will be able to read/write kernel memory even
though the lockdown feature is enabled.
The lockdown feature was introduced in 5.4. Earlier than 5.4 kernels
aren't affected by this issue.

The mainline and all stable kernels were fixed.

Fixed status
mainline: [eadb2f47a3ced5c64b23b90fd2a3463f63726066]
stable/5.15: [69c5d307dce1560fafcb852f39d7a1bf5e266641]
stable/5.17: [281d356a035132f2603724ee0f04767d70e2e98e]

* Updated CVEs

CVE-2022-0854: swiotlb information leak with DMA_FROM_DEVICE

4.19 and 5.10 were fixed this week.

Fixed status
mainline: [ddbd89deb7d32b1fbb879f48d68fda1a8ac58e8e,
aa6f8dcbab473f3a3c7454b74caa46d36cdc5d13]
stable/4.19: [8d9ac1b6665c73f23e963775f85d99679fd8e192,
06cb238b0f7ac1669cb06390704c61794724c191]
stable/5.10: [d4d975e7921079f877f828099bb8260af335508f,
f3f2247ac31cb71d1f05f56536df5946c6652f4a]
stable/5.15: [7403f4118ab94be837ab9d770507537a8057bc63,
2c1f97af38be151527380796d31d3c9adb054bf9]
stable/5.16: [270475d6d2410ec66e971bf181afe1958dad565e,
62b27d925655999350d0ea775a025919fd88d27f]

CVE-2022-1652: A concurrency use-after-free in bad_flp_intr

All stable kernels were fixed this week.

Fixed status
mainline: [f71f01394f742fc4558b3f9f4c7ef4c4cf3b07c8]
stable/4.14: [dc650d53bad770f169e498f1231671c51b0b321d]
stable/4.19: [3392d8711ad9e5b688999c948fd36d798c0d075d]
stable/4.9: [2adafe1c646b462c755e99216f966927eec96059]
stable/5.10: [911b36267855501f7f80a75927c128c0ac03fe58]
stable/5.15: [fc2bee93e31bbba920e9eeba76af72264ced066f]
stable/5.17: [88887ced7803132ed357a42d050560a2fb5c7ce6]
stable/5.4: [67e2b62461b5d02a1e63103e8a02c0bca75e26c7]

CVE-2022-28893: SUNRPC: Ensure we flush any closed sockets before xs_xprt_free()

5.4 was fixed this week. The mainline and all stable kernels were fixed.

Fixed status
mainline: [f00432063db1a0db484e85193eccc6845435b80e]
stable/5.10: [e68b60ae29de10c7bd7636e227164a8dbe305a82]
stable/5.15: [54f6834b283d9b4d070b0639d9ef5e1d156fe7b0]
stable/5.16: [7a0921a23cae42e9fa5ce964f6907181b6dc80d8]
stable/5.17: [d21287d8a4589dd8513038f887ece980fbc399cf]
stable/5.4: [2f8f6c393b11b5da059b1fc10a69fc2f2b6c446a]

Currently tracking CVEs

CVE-2021-31615: Unencrypted Bluetooth Low Energy baseband links in
Bluetooth Core Specifications 4.0 through 5.2

There is no fix information.

CVE-2020-26556: kernel: malleable commitment Bluetooth Mesh Provisioning

No fix information.

CVE-2020-26557: kernel: predictable Authvalue in Bluetooth Mesh
Provisioning Leads to MITM

No fix information.

CVE-2020-26559: kernel: Authvalue leak in Bluetooth Mesh Provisioning

No fix information.

CVE-2020-26560: kernel: impersonation attack in Bluetooth Mesh Provisioning

No fix information.

Regards,
--
Masami Ichikawa
Cybertrust Japan Co., Ltd.

Email :masami.ichikawa@...
:masami.ichikawa@...

141 - 160 of 8596