Date   

cip/linux-5.10.y-cip ltp-pty: 6 runs, 5 regressions (v5.10.112-cip6) #kernelci

kernelci.org bot <bot@...>
 

cip/linux-5.10.y-cip ltp-pty: 6 runs, 5 regressions (v5.10.112-cip6)

Regressions Summary
-------------------

platform | arch | lab | compiler | defconfig | regressions
--------------------------+--------+---------------+----------+------------------------------+------------
asus-C433TA-AJ0005-rammus | x86_64 | lab-collabora | gcc-10 | x86_64_defcon...6-chromebook | 1
asus-C523NA-A20057-coral | x86_64 | lab-collabora | gcc-10 | x86_64_defcon...6-chromebook | 1
r8a774a1-hihope-rzg2m-ex | arm64 | lab-cip | gcc-10 | defconfig+arm64-chromebook | 1
r8a774a1-hihope-rzg2m-ex | arm64 | lab-cip | gcc-10 | defconfig | 1
rk3399-gru-kevin | arm64 | lab-collabora | gcc-10 | defconfig+arm64-chromebook | 1

Details: https://kernelci.org/test/job/cip/branch/linux-5.10.y-cip/kernel/v5.10.112-cip6/plan/ltp-pty/

Test: ltp-pty
Tree: cip
Branch: linux-5.10.y-cip
Describe: v5.10.112-cip6
URL: https://git.kernel.org/pub/scm/linux/kernel/git/cip/linux-cip.git
SHA: c8f6747dcd02a8f87731c324f4bc37bd120a8982

Test suite revisions:
ltp-tests
URL: https://github.com/linux-test-project/ltp.git
SHA: 4e132c1f9e14f9eaeb4f9875eee3f97a4a1ac987


Test Regressions
----------------


platform | arch | lab | compiler | defconfig | regressions
--------------------------+--------+---------------+----------+------------------------------+------------
asus-C433TA-AJ0005-rammus | x86_64 | lab-collabora | gcc-10 | x86_64_defcon...6-chromebook | 1

Details: https://kernelci.org/test/plan/id/6266b197896d16b128ff9459

Results: 0 PASS, 1 FAIL, 0 SKIP
Full config: x86_64_defconfig+x86-chromebook
Compiler: gcc-10 (gcc (Debian 10.2.1-6) 10.2.1 20210110)
Plain log: https://storage.kernelci.org//cip/linux-5.10.y-cip/v5.10.112-cip6/x86_64/x86_64_defconfig+x86-chromebook/gcc-10/lab-collabora/ltp-pty-asus-C433TA-AJ0005-rammus.txt
HTML log: https://storage.kernelci.org//cip/linux-5.10.y-cip/v5.10.112-cip6/x86_64/x86_64_defconfig+x86-chromebook/gcc-10/lab-collabora/ltp-pty-asus-C433TA-AJ0005-rammus.html
Rootfs: http://storage.kernelci.org/images/rootfs/debian/bullseye-ltp/20220422.0/amd64/initrd.cpio.gz


* ltp-pty.login: https://kernelci.org/test/case/id/6266b197896d16b128ff945a
failing since 27 days (last pass: v5.10.83-cip1-151-ga4163710a1dc, first fail: v5.10.106-cip4)



platform | arch | lab | compiler | defconfig | regressions
--------------------------+--------+---------------+----------+------------------------------+------------
asus-C523NA-A20057-coral | x86_64 | lab-collabora | gcc-10 | x86_64_defcon...6-chromebook | 1

Details: https://kernelci.org/test/plan/id/6266b5b63914ad3cebff9594

Results: 0 PASS, 1 FAIL, 0 SKIP
Full config: x86_64_defconfig+x86-chromebook
Compiler: gcc-10 (gcc (Debian 10.2.1-6) 10.2.1 20210110)
Plain log: https://storage.kernelci.org//cip/linux-5.10.y-cip/v5.10.112-cip6/x86_64/x86_64_defconfig+x86-chromebook/gcc-10/lab-collabora/ltp-pty-asus-C523NA-A20057-coral.txt
HTML log: https://storage.kernelci.org//cip/linux-5.10.y-cip/v5.10.112-cip6/x86_64/x86_64_defconfig+x86-chromebook/gcc-10/lab-collabora/ltp-pty-asus-C523NA-A20057-coral.html
Rootfs: http://storage.kernelci.org/images/rootfs/debian/bullseye-ltp/20220422.0/amd64/initrd.cpio.gz


* ltp-pty.login: https://kernelci.org/test/case/id/6266b5b63914ad3cebff9595
failing since 27 days (last pass: v5.10.83-cip1-151-ga4163710a1dc, first fail: v5.10.106-cip4)



platform | arch | lab | compiler | defconfig | regressions
--------------------------+--------+---------------+----------+------------------------------+------------
r8a774a1-hihope-rzg2m-ex | arm64 | lab-cip | gcc-10 | defconfig+arm64-chromebook | 1

Details: https://kernelci.org/test/plan/id/6266b7572a960e928eff9480

Results: 0 PASS, 1 FAIL, 0 SKIP
Full config: defconfig+arm64-chromebook
Compiler: gcc-10 (aarch64-linux-gnu-gcc (Debian 10.2.1-6) 10.2.1 20210110)
Plain log: https://storage.kernelci.org//cip/linux-5.10.y-cip/v5.10.112-cip6/arm64/defconfig+arm64-chromebook/gcc-10/lab-cip/ltp-pty-r8a774a1-hihope-rzg2m-ex.txt
HTML log: https://storage.kernelci.org//cip/linux-5.10.y-cip/v5.10.112-cip6/arm64/defconfig+arm64-chromebook/gcc-10/lab-cip/ltp-pty-r8a774a1-hihope-rzg2m-ex.html
Rootfs: http://storage.kernelci.org/images/rootfs/debian/bullseye-ltp/20220422.0/arm64/initrd.cpio.gz


* ltp-pty.login: https://kernelci.org/test/case/id/6266b7572a960e928eff9481
failing since 27 days (last pass: v5.10.83-cip1-178-g2cf1d12aab81, first fail: v5.10.106-cip4)



platform | arch | lab | compiler | defconfig | regressions
--------------------------+--------+---------------+----------+------------------------------+------------
r8a774a1-hihope-rzg2m-ex | arm64 | lab-cip | gcc-10 | defconfig | 1

Details: https://kernelci.org/test/plan/id/6266bce13176774becff94fa

Results: 0 PASS, 1 FAIL, 0 SKIP
Full config: defconfig
Compiler: gcc-10 (aarch64-linux-gnu-gcc (Debian 10.2.1-6) 10.2.1 20210110)
Plain log: https://storage.kernelci.org//cip/linux-5.10.y-cip/v5.10.112-cip6/arm64/defconfig/gcc-10/lab-cip/ltp-pty-r8a774a1-hihope-rzg2m-ex.txt
HTML log: https://storage.kernelci.org//cip/linux-5.10.y-cip/v5.10.112-cip6/arm64/defconfig/gcc-10/lab-cip/ltp-pty-r8a774a1-hihope-rzg2m-ex.html
Rootfs: http://storage.kernelci.org/images/rootfs/debian/bullseye-ltp/20220422.0/arm64/initrd.cpio.gz


* ltp-pty.login: https://kernelci.org/test/case/id/6266bce13176774becff94fb
failing since 27 days (last pass: v5.10.83-cip1-178-g2cf1d12aab81, first fail: v5.10.106-cip4)



platform | arch | lab | compiler | defconfig | regressions
--------------------------+--------+---------------+----------+------------------------------+------------
rk3399-gru-kevin | arm64 | lab-collabora | gcc-10 | defconfig+arm64-chromebook | 1

Details: https://kernelci.org/test/plan/id/6266b166e14769db25ff9475

Results: 0 PASS, 1 FAIL, 0 SKIP
Full config: defconfig+arm64-chromebook
Compiler: gcc-10 (aarch64-linux-gnu-gcc (Debian 10.2.1-6) 10.2.1 20210110)
Plain log: https://storage.kernelci.org//cip/linux-5.10.y-cip/v5.10.112-cip6/arm64/defconfig+arm64-chromebook/gcc-10/lab-collabora/ltp-pty-rk3399-gru-kevin.txt
HTML log: https://storage.kernelci.org//cip/linux-5.10.y-cip/v5.10.112-cip6/arm64/defconfig+arm64-chromebook/gcc-10/lab-collabora/ltp-pty-rk3399-gru-kevin.html
Rootfs: http://storage.kernelci.org/images/rootfs/debian/bullseye-ltp/20220422.0/arm64/initrd.cpio.gz


* ltp-pty.login: https://kernelci.org/test/case/id/6266b166e14769db25ff9476
failing since 27 days (last pass: v5.10.83-cip1-178-g2cf1d12aab81, first fail: v5.10.106-cip4)


cip/linux-5.10.y-cip ltp-mm: 6 runs, 2 regressions (v5.10.112-cip6) #kernelci

kernelci.org bot <bot@...>
 

cip/linux-5.10.y-cip ltp-mm: 6 runs, 2 regressions (v5.10.112-cip6)

Regressions Summary
-------------------

platform | arch | lab | compiler | defconfig | regressions
-------------------------+-------+---------+----------+----------------------------+------------
r8a774a1-hihope-rzg2m-ex | arm64 | lab-cip | gcc-10 | defconfig+arm64-chromebook | 1
r8a774a1-hihope-rzg2m-ex | arm64 | lab-cip | gcc-10 | defconfig | 1

Details: https://kernelci.org/test/job/cip/branch/linux-5.10.y-cip/kernel/v5.10.112-cip6/plan/ltp-mm/

Test: ltp-mm
Tree: cip
Branch: linux-5.10.y-cip
Describe: v5.10.112-cip6
URL: https://git.kernel.org/pub/scm/linux/kernel/git/cip/linux-cip.git
SHA: c8f6747dcd02a8f87731c324f4bc37bd120a8982

Test suite revisions:
ltp-tests
URL: https://github.com/linux-test-project/ltp.git
SHA: 4e132c1f9e14f9eaeb4f9875eee3f97a4a1ac987


Test Regressions
----------------


platform | arch | lab | compiler | defconfig | regressions
-------------------------+-------+---------+----------+----------------------------+------------
r8a774a1-hihope-rzg2m-ex | arm64 | lab-cip | gcc-10 | defconfig+arm64-chromebook | 1

Details: https://kernelci.org/test/plan/id/6266bb18dc91d89fa6ff9492

Results: 0 PASS, 1 FAIL, 0 SKIP
Full config: defconfig+arm64-chromebook
Compiler: gcc-10 (aarch64-linux-gnu-gcc (Debian 10.2.1-6) 10.2.1 20210110)
Plain log: https://storage.kernelci.org//cip/linux-5.10.y-cip/v5.10.112-cip6/arm64/defconfig+arm64-chromebook/gcc-10/lab-cip/ltp-mm-r8a774a1-hihope-rzg2m-ex.txt
HTML log: https://storage.kernelci.org//cip/linux-5.10.y-cip/v5.10.112-cip6/arm64/defconfig+arm64-chromebook/gcc-10/lab-cip/ltp-mm-r8a774a1-hihope-rzg2m-ex.html
Rootfs: http://storage.kernelci.org/images/rootfs/debian/bullseye-ltp/20220422.0/arm64/initrd.cpio.gz


* ltp-mm.login: https://kernelci.org/test/case/id/6266bb18dc91d89fa6ff9493
failing since 103 days (last pass: v5.10.83-cip1-74-g842fbb4554b8, first fail: v5.10.83-cip1-89-ga7f9ee34265b)



platform | arch | lab | compiler | defconfig | regressions
-------------------------+-------+---------+----------+----------------------------+------------
r8a774a1-hihope-rzg2m-ex | arm64 | lab-cip | gcc-10 | defconfig | 1

Details: https://kernelci.org/test/plan/id/6266c1063416784b3bff9467

Results: 0 PASS, 1 FAIL, 0 SKIP
Full config: defconfig
Compiler: gcc-10 (aarch64-linux-gnu-gcc (Debian 10.2.1-6) 10.2.1 20210110)
Plain log: https://storage.kernelci.org//cip/linux-5.10.y-cip/v5.10.112-cip6/arm64/defconfig/gcc-10/lab-cip/ltp-mm-r8a774a1-hihope-rzg2m-ex.txt
HTML log: https://storage.kernelci.org//cip/linux-5.10.y-cip/v5.10.112-cip6/arm64/defconfig/gcc-10/lab-cip/ltp-mm-r8a774a1-hihope-rzg2m-ex.html
Rootfs: http://storage.kernelci.org/images/rootfs/debian/bullseye-ltp/20220422.0/arm64/initrd.cpio.gz


* ltp-mm.login: https://kernelci.org/test/case/id/6266c1063416784b3bff9468
failing since 103 days (last pass: v5.10.83-cip1-74-g842fbb4554b8, first fail: v5.10.83-cip1-89-ga7f9ee34265b)


cip/linux-5.10.y-cip ltp-fcntl-locktests: 6 runs, 1 regressions (v5.10.112-cip6) #kernelci

kernelci.org bot <bot@...>
 

cip/linux-5.10.y-cip ltp-fcntl-locktests: 6 runs, 1 regressions (v5.10.112-cip6)

Regressions Summary
-------------------

platform | arch | lab | compiler | defconfig | regressions
-----------------+-------+---------------+----------+----------------------------+------------
rk3399-gru-kevin | arm64 | lab-collabora | gcc-10 | defconfig+arm64-chromebook | 1

Details: https://kernelci.org/test/job/cip/branch/linux-5.10.y-cip/kernel/v5.10.112-cip6/plan/ltp-fcntl-locktests/

Test: ltp-fcntl-locktests
Tree: cip
Branch: linux-5.10.y-cip
Describe: v5.10.112-cip6
URL: https://git.kernel.org/pub/scm/linux/kernel/git/cip/linux-cip.git
SHA: c8f6747dcd02a8f87731c324f4bc37bd120a8982

Test suite revisions:
ltp-tests
URL: https://github.com/linux-test-project/ltp.git
SHA: 4e132c1f9e14f9eaeb4f9875eee3f97a4a1ac987


Test Regressions
----------------


platform | arch | lab | compiler | defconfig | regressions
-----------------+-------+---------------+----------+----------------------------+------------
rk3399-gru-kevin | arm64 | lab-collabora | gcc-10 | defconfig+arm64-chromebook | 1

Details: https://kernelci.org/test/plan/id/6266aee442532b7fdbff947d

Results: 0 PASS, 1 FAIL, 0 SKIP
Full config: defconfig+arm64-chromebook
Compiler: gcc-10 (aarch64-linux-gnu-gcc (Debian 10.2.1-6) 10.2.1 20210110)
Plain log: https://storage.kernelci.org//cip/linux-5.10.y-cip/v5.10.112-cip6/arm64/defconfig+arm64-chromebook/gcc-10/lab-collabora/ltp-fcntl-locktests-rk3399-gru-kevin.txt
HTML log: https://storage.kernelci.org//cip/linux-5.10.y-cip/v5.10.112-cip6/arm64/defconfig+arm64-chromebook/gcc-10/lab-collabora/ltp-fcntl-locktests-rk3399-gru-kevin.html
Rootfs: http://storage.kernelci.org/images/rootfs/debian/bullseye-ltp/20220422.0/arm64/initrd.cpio.gz


* ltp-fcntl-locktests.login: https://kernelci.org/test/case/id/6266aee442532b7fdbff947e
new failure (last pass: v5.10.106-cip4-66-gc8c4cc5cdb54c)


cip/linux-5.10.y-cip kselftest-seccomp: 5 runs, 3 regressions (v5.10.112-cip6) #kernelci

kernelci.org bot <bot@...>
 

cip/linux-5.10.y-cip kselftest-seccomp: 5 runs, 3 regressions (v5.10.112-cip6)

Regressions Summary
-------------------

platform | arch | lab | compiler | defconfig | regressions
--------------------------+--------+---------------+----------+------------------------------+------------
asus-C433TA-AJ0005-rammus | x86_64 | lab-collabora | gcc-10 | x86_64_defcon...ok+kselftest | 1
asus-C523NA-A20057-coral | x86_64 | lab-collabora | gcc-10 | x86_64_defcon...ok+kselftest | 1
hp-11A-G6-EE-grunt | x86_64 | lab-collabora | gcc-10 | x86_64_defcon...ok+kselftest | 1

Details: https://kernelci.org/test/job/cip/branch/linux-5.10.y-cip/kernel/v5.10.112-cip6/plan/kselftest-seccomp/

Test: kselftest-seccomp
Tree: cip
Branch: linux-5.10.y-cip
Describe: v5.10.112-cip6
URL: https://git.kernel.org/pub/scm/linux/kernel/git/cip/linux-cip.git
SHA: c8f6747dcd02a8f87731c324f4bc37bd120a8982


Test Regressions
----------------


platform | arch | lab | compiler | defconfig | regressions
--------------------------+--------+---------------+----------+------------------------------+------------
asus-C433TA-AJ0005-rammus | x86_64 | lab-collabora | gcc-10 | x86_64_defcon...ok+kselftest | 1

Details: https://kernelci.org/test/plan/id/6266ae965106035435ff9462

Results: 83 PASS, 4 FAIL, 8 SKIP
Full config: x86_64_defconfig+x86-chromebook+kselftest
Compiler: gcc-10 (gcc (Debian 10.2.1-6) 10.2.1 20210110)
Plain log: https://storage.kernelci.org//cip/linux-5.10.y-cip/v5.10.112-cip6/x86_64/x86_64_defconfig+x86-chromebook+kselftest/gcc-10/lab-collabora/kselftest-seccomp-asus-C433TA-AJ0005-rammus.txt
HTML log: https://storage.kernelci.org//cip/linux-5.10.y-cip/v5.10.112-cip6/x86_64/x86_64_defconfig+x86-chromebook+kselftest/gcc-10/lab-collabora/kselftest-seccomp-asus-C433TA-AJ0005-rammus.html
Rootfs: http://storage.kernelci.org/images/rootfs/debian/bullseye-kselftest/20220422.0/amd64/initrd.cpio.gz


* kselftest-seccomp.seccomp_seccomp_bpf_TSYNC_siblings_fail_prctl: https://kernelci.org/test/case/id/6266ae965106035435ff9469
failing since 27 days (last pass: v5.10.100-cip2, first fail: v5.10.106-cip4)



platform | arch | lab | compiler | defconfig | regressions
--------------------------+--------+---------------+----------+------------------------------+------------
asus-C523NA-A20057-coral | x86_64 | lab-collabora | gcc-10 | x86_64_defcon...ok+kselftest | 1

Details: https://kernelci.org/test/plan/id/6266b1d13e60e86a00ff9480

Results: 83 PASS, 4 FAIL, 8 SKIP
Full config: x86_64_defconfig+x86-chromebook+kselftest
Compiler: gcc-10 (gcc (Debian 10.2.1-6) 10.2.1 20210110)
Plain log: https://storage.kernelci.org//cip/linux-5.10.y-cip/v5.10.112-cip6/x86_64/x86_64_defconfig+x86-chromebook+kselftest/gcc-10/lab-collabora/kselftest-seccomp-asus-C523NA-A20057-coral.txt
HTML log: https://storage.kernelci.org//cip/linux-5.10.y-cip/v5.10.112-cip6/x86_64/x86_64_defconfig+x86-chromebook+kselftest/gcc-10/lab-collabora/kselftest-seccomp-asus-C523NA-A20057-coral.html
Rootfs: http://storage.kernelci.org/images/rootfs/debian/bullseye-kselftest/20220422.0/amd64/initrd.cpio.gz


* kselftest-seccomp.seccomp_seccomp_bpf_TSYNC_siblings_fail_prctl: https://kernelci.org/test/case/id/6266b1d13e60e86a00ff9486
failing since 27 days (last pass: v5.10.100-cip2, first fail: v5.10.106-cip4)



platform | arch | lab | compiler | defconfig | regressions
--------------------------+--------+---------------+----------+------------------------------+------------
hp-11A-G6-EE-grunt | x86_64 | lab-collabora | gcc-10 | x86_64_defcon...ok+kselftest | 1

Details: https://kernelci.org/test/plan/id/6266c0ecf6dcdc25a6ff945d

Results: 83 PASS, 4 FAIL, 8 SKIP
Full config: x86_64_defconfig+x86-chromebook+kselftest
Compiler: gcc-10 (gcc (Debian 10.2.1-6) 10.2.1 20210110)
Plain log: https://storage.kernelci.org//cip/linux-5.10.y-cip/v5.10.112-cip6/x86_64/x86_64_defconfig+x86-chromebook+kselftest/gcc-10/lab-collabora/kselftest-seccomp-hp-11A-G6-EE-grunt.txt
HTML log: https://storage.kernelci.org//cip/linux-5.10.y-cip/v5.10.112-cip6/x86_64/x86_64_defconfig+x86-chromebook+kselftest/gcc-10/lab-collabora/kselftest-seccomp-hp-11A-G6-EE-grunt.html
Rootfs: http://storage.kernelci.org/images/rootfs/debian/bullseye-kselftest/20220422.0/amd64/initrd.cpio.gz


* kselftest-seccomp.seccomp_seccomp_bpf_TSYNC_siblings_fail_prctl: https://kernelci.org/test/case/id/6266c0ecf6dcdc25a6ff9464
failing since 27 days (last pass: v5.10.100-cip2, first fail: v5.10.106-cip4)


cip/linux-5.10.y-cip baseline: 129 runs, 3 regressions (v5.10.112-cip6) #kernelci

kernelci.org bot <bot@...>
 

cip/linux-5.10.y-cip baseline: 129 runs, 3 regressions (v5.10.112-cip6)

Regressions Summary
-------------------

platform | arch | lab | compiler | defconfig | regressions
-------------------------+-------+---------------+----------+----------------------------+------------
imx6q-var-dt6customboard | arm | lab-baylibre | gcc-10 | multi_v7_defconfig | 2
rk3399-gru-kevin | arm64 | lab-collabora | gcc-10 | defconfig+arm64-chromebook | 1

Details: https://kernelci.org/test/job/cip/branch/linux-5.10.y-cip/kernel/v5.10.112-cip6/plan/baseline/

Test: baseline
Tree: cip
Branch: linux-5.10.y-cip
Describe: v5.10.112-cip6
URL: https://git.kernel.org/pub/scm/linux/kernel/git/cip/linux-cip.git
SHA: c8f6747dcd02a8f87731c324f4bc37bd120a8982


Test Regressions
----------------


platform | arch | lab | compiler | defconfig | regressions
-------------------------+-------+---------------+----------+----------------------------+------------
imx6q-var-dt6customboard | arm | lab-baylibre | gcc-10 | multi_v7_defconfig | 2

Details: https://kernelci.org/test/plan/id/6266afd30045c3b92aff949c

Results: 4 PASS, 2 FAIL, 1 SKIP
Full config: multi_v7_defconfig
Compiler: gcc-10 (arm-linux-gnueabihf-gcc (Debian 10.2.1-6) 10.2.1 20210110)
Plain log: https://storage.kernelci.org//cip/linux-5.10.y-cip/v5.10.112-cip6/arm/multi_v7_defconfig/gcc-10/lab-baylibre/baseline-imx6q-var-dt6customboard.txt
HTML log: https://storage.kernelci.org//cip/linux-5.10.y-cip/v5.10.112-cip6/arm/multi_v7_defconfig/gcc-10/lab-baylibre/baseline-imx6q-var-dt6customboard.html
Rootfs: http://storage.kernelci.org/images/rootfs/buildroot/buildroot-baseline/20220422.0/armel/rootfs.cpio.gz


* baseline.dmesg.emerg: https://kernelci.org/test/case/id/6266afd30045c3b92aff949f
new failure (last pass: v5.10.106-cip4-66-gc8c4cc5cdb54c)
26 lines

2022-04-25T14:27:20.771542 kern :emerg : Internal error: : 1 [#1] SMP ARM
2022-04-25T14:27:20.771813 kern :emerg : Process kworker/1:7 (pid: 69, stack limit = 0x(ptrval))
2022-04-25T14:27:20.772036 kern :emerg : Stack: (0xc30ddeb0 to<8>[ 16.700919] <LAVA_SIGNAL_TESTCASE TEST_CASE_ID=emerg RESULT=fail UNITS=lines MEASUREMENT=26>
2022-04-25T14:27:20.772267 0xc30de000)

* baseline.dmesg.alert: https://kernelci.org/test/case/id/6266afd30045c3b92aff94a0
new failure (last pass: v5.10.106-cip4-66-gc8c4cc5cdb54c)
4 lines

2022-04-25T14:27:20.689929 kern :alert : 8<--- cut here ---
2022-04-25T14:27:20.718846 kern :alert : Unhandled fault: alignment exception (0x001) at 0xcec60217
2022-04-25T14:27:20.719196 kern :alert : pgd = (ptrval)
2022-04-25T14:27:20.722008 kern :alert : [<8>[ 16.654455] <LAVA_SIGNAL_TESTCASE TEST_CASE_ID=alert RESULT=fail UNITS=lines MEASUREMENT=4>
2022-04-25T14:27:20.722299 cec60217] *pgd=1ec1141e(bad)



platform | arch | lab | compiler | defconfig | regressions
-------------------------+-------+---------------+----------+----------------------------+------------
rk3399-gru-kevin | arm64 | lab-collabora | gcc-10 | defconfig+arm64-chromebook | 1

Details: https://kernelci.org/test/plan/id/6266af801386332324ff947f

Results: 90 PASS, 2 FAIL, 0 SKIP
Full config: defconfig+arm64-chromebook
Compiler: gcc-10 (aarch64-linux-gnu-gcc (Debian 10.2.1-6) 10.2.1 20210110)
Plain log: https://storage.kernelci.org//cip/linux-5.10.y-cip/v5.10.112-cip6/arm64/defconfig+arm64-chromebook/gcc-10/lab-collabora/baseline-rk3399-gru-kevin.txt
HTML log: https://storage.kernelci.org//cip/linux-5.10.y-cip/v5.10.112-cip6/arm64/defconfig+arm64-chromebook/gcc-10/lab-collabora/baseline-rk3399-gru-kevin.html
Rootfs: http://storage.kernelci.org/images/rootfs/buildroot/buildroot-baseline/20220422.0/arm64/rootfs.cpio.gz


* baseline.bootrr.rockchip-i2s1-probed: https://kernelci.org/test/case/id/6266af801386332324ff94a4
failing since 27 days (last pass: v5.10.83-cip1-178-g2cf1d12aab81, first fail: v5.10.106-cip4)

2022-04-25T14:26:00.293287 /lava-6171413/1/../bin/lava-test-case
2022-04-25T14:26:00.303756 <8>[ 33.608522] <LAVA_SIGNAL_TESTCASE TEST_CASE_ID=rockchip-i2s1-probed RESULT=fail>


cip/linux-5.10.y-cip baseline-nfs: 23 runs, 1 regressions (v5.10.112-cip6) #kernelci

kernelci.org bot <bot@...>
 

cip/linux-5.10.y-cip baseline-nfs: 23 runs, 1 regressions (v5.10.112-cip6)

Regressions Summary
-------------------

platform | arch | lab | compiler | defconfig | regressions
-----------------+-------+---------------+----------+----------------------------+------------
rk3399-gru-kevin | arm64 | lab-collabora | gcc-10 | defconfig+arm64-chromebook | 1

Details: https://kernelci.org/test/job/cip/branch/linux-5.10.y-cip/kernel/v5.10.112-cip6/plan/baseline-nfs/

Test: baseline-nfs
Tree: cip
Branch: linux-5.10.y-cip
Describe: v5.10.112-cip6
URL: https://git.kernel.org/pub/scm/linux/kernel/git/cip/linux-cip.git
SHA: c8f6747dcd02a8f87731c324f4bc37bd120a8982


Test Regressions
----------------


platform | arch | lab | compiler | defconfig | regressions
-----------------+-------+---------------+----------+----------------------------+------------
rk3399-gru-kevin | arm64 | lab-collabora | gcc-10 | defconfig+arm64-chromebook | 1

Details: https://kernelci.org/test/plan/id/6266b14b87db828697ff9467

Results: 84 PASS, 4 FAIL, 0 SKIP
Full config: defconfig+arm64-chromebook
Compiler: gcc-10 (aarch64-linux-gnu-gcc (Debian 10.2.1-6) 10.2.1 20210110)
Plain log: https://storage.kernelci.org//cip/linux-5.10.y-cip/v5.10.112-cip6/arm64/defconfig+arm64-chromebook/gcc-10/lab-collabora/baseline-nfs-rk3399-gru-kevin.txt
HTML log: https://storage.kernelci.org//cip/linux-5.10.y-cip/v5.10.112-cip6/arm64/defconfig+arm64-chromebook/gcc-10/lab-collabora/baseline-nfs-rk3399-gru-kevin.html
Rootfs: http://storage.kernelci.org/images/rootfs/debian/bullseye/20220422.0/arm64/initrd.cpio.gz


* baseline-nfs.bootrr.rockchip-i2s1-probed: https://kernelci.org/test/case/id/6266b14b87db828697ff9488
failing since 27 days (last pass: v5.10.83-cip1-178-g2cf1d12aab81, first fail: v5.10.106-cip4)

2022-04-25T14:33:30.551381 /lava-6171419/1/../bin/lava-test-case
2022-04-25T14:33:30.578149 <8>[ 96.759756] <LAVA_SIGNAL_TESTCASE TEST_CASE_ID=rockchip-i2s1-probed RESULT=fail>


cip/linux-5.10.y-cip build: 189 builds: 3 failed, 186 passed, 4 errors, 10 warnings (v5.10.112-cip6) #kernelci

kernelci.org bot <bot@...>
 

cip/linux-5.10.y-cip build: 189 builds: 3 failed, 186 passed, 4 errors, 10 warnings (v5.10.112-cip6)

Full Build Summary: https://kernelci.org/build/cip/branch/linux-5.10.y-cip/kernel/v5.10.112-cip6/

Tree: cip
Branch: linux-5.10.y-cip
Git Describe: v5.10.112-cip6
Git Commit: c8f6747dcd02a8f87731c324f4bc37bd120a8982
Git URL: https://git.kernel.org/pub/scm/linux/kernel/git/cip/linux-cip.git
Built: 7 unique architectures

Build Failures Detected:

arm:
rpc_defconfig: (gcc-10) FAIL

mips:
ip27_defconfig: (gcc-10) FAIL
ip28_defconfig: (gcc-10) FAIL

Errors and Warnings Detected:

arc:

arm64:

arm:
rpc_defconfig (gcc-10): 4 errors

i386:

mips:
32r2el_defconfig (gcc-10): 1 warning
decstation_64_defconfig (gcc-10): 1 warning
decstation_defconfig (gcc-10): 1 warning
decstation_r4k_defconfig (gcc-10): 1 warning
lemote2f_defconfig (gcc-10): 1 warning
rm200_defconfig (gcc-10): 1 warning

riscv:
rv32_defconfig (gcc-10): 4 warnings

x86_64:

Errors summary:

2 arm-linux-gnueabihf-gcc: error: unrecognized -march target: armv3m
2 arm-linux-gnueabihf-gcc: error: missing argument to ‘-march=’

Warnings summary:

3 kernel/rcu/tasks.h:707:13: warning: ‘show_rcu_tasks_rude_gp_kthread’ defined but not used [-Wunused-function]
2 <stdin>:830:2: warning: #warning syscall fstat64 not implemented [-Wcpp]
2 <stdin>:1127:2: warning: #warning syscall fstatat64 not implemented [-Wcpp]
1 net/mac80211/mlme.c:4343:1: warning: the frame size of 1040 bytes is larger than 1024 bytes [-Wframe-larger-than=]
1 drivers/block/paride/bpck.c:32: warning: "PC" redefined
1 WARNING: modpost: Symbol info of vmlinux is missing. Unresolved symbol check will be entirely skipped.

Section mismatches summary:

1 WARNING: modpost: vmlinux.o(.text+0xd054): Section mismatch in reference from the function __arm_ioremap_pfn_caller() to the function .meminit.text:memblock_is_map_memory()
1 WARNING: modpost: vmlinux.o(.text+0xceb0): Section mismatch in reference from the function __arm_ioremap_pfn_caller() to the function .meminit.text:memblock_is_map_memory()
1 WARNING: modpost: vmlinux.o(.text+0xcdb8): Section mismatch in reference from the function __arm_ioremap_pfn_caller() to the function .meminit.text:memblock_is_map_memory()
1 WARNING: modpost: vmlinux.o(.text+0xcd4c): Section mismatch in reference from the function __arm_ioremap_pfn_caller() to the function .meminit.text:memblock_is_map_memory()
1 WARNING: modpost: vmlinux.o(.text+0xcb98): Section mismatch in reference from the function __arm_ioremap_pfn_caller() to the function .meminit.text:memblock_is_map_memory()
1 WARNING: modpost: vmlinux.o(.text+0xcb88): Section mismatch in reference from the function __arm_ioremap_pfn_caller() to the function .meminit.text:memblock_is_map_memory()
1 WARNING: modpost: vmlinux.o(.text+0xcb80): Section mismatch in reference from the function __arm_ioremap_pfn_caller() to the function .meminit.text:memblock_is_map_memory()
1 WARNING: modpost: vmlinux.o(.text+0xcb60): Section mismatch in reference from the function __arm_ioremap_pfn_caller() to the function .meminit.text:memblock_is_map_memory()
1 WARNING: modpost: vmlinux.o(.text+0xcabc): Section mismatch in reference from the function __arm_ioremap_pfn_caller() to the function .meminit.text:memblock_is_map_memory()
1 WARNING: modpost: vmlinux.o(.text+0xc900): Section mismatch in reference from the function __arm_ioremap_pfn_caller() to the function .meminit.text:memblock_is_map_memory()
1 WARNING: modpost: vmlinux.o(.text+0xb918): Section mismatch in reference from the function __arm_ioremap_pfn_caller() to the function .meminit.text:memblock_is_map_memory()
1 WARNING: modpost: vmlinux.o(.text+0x8068): Section mismatch in reference from the function __arm_ioremap_pfn_caller() to the function .meminit.text:memblock_is_map_memory()
1 WARNING: modpost: vmlinux.o(.text+0x7684): Section mismatch in reference from the function __arm_ioremap_pfn_caller() to the function .meminit.text:memblock_is_map_memory()

================================================================================

Detailed per-defconfig build reports:

--------------------------------------------------------------------------------
32r2el_defconfig (mips, gcc-10) — PASS, 0 errors, 1 warning, 0 section mismatches

Warnings:
WARNING: modpost: Symbol info of vmlinux is missing. Unresolved symbol check will be entirely skipped.

--------------------------------------------------------------------------------
allnoconfig (i386, gcc-10) — PASS, 0 errors, 0 warnings, 0 section mismatches

--------------------------------------------------------------------------------
allnoconfig (arc, gcc-10) — PASS, 0 errors, 0 warnings, 0 section mismatches

--------------------------------------------------------------------------------
allnoconfig (x86_64, gcc-10) — PASS, 0 errors, 0 warnings, 0 section mismatches

--------------------------------------------------------------------------------
am200epdkit_defconfig (arm, gcc-10) — PASS, 0 errors, 0 warnings, 0 section mismatches

--------------------------------------------------------------------------------
ar7_defconfig (mips, gcc-10) — PASS, 0 errors, 0 warnings, 0 section mismatches

--------------------------------------------------------------------------------
aspeed_g4_defconfig (arm, gcc-10) — PASS, 0 errors, 0 warnings, 0 section mismatches

--------------------------------------------------------------------------------
aspeed_g5_defconfig (arm, gcc-10) — PASS, 0 errors, 0 warnings, 0 section mismatches

--------------------------------------------------------------------------------
assabet_defconfig (arm, gcc-10) — PASS, 0 errors, 0 warnings, 0 section mismatches

Section mismatches:
WARNING: modpost: vmlinux.o(.text+0xcb80): Section mismatch in reference from the function __arm_ioremap_pfn_caller() to the function .meminit.text:memblock_is_map_memory()

--------------------------------------------------------------------------------
at91_dt_defconfig (arm, gcc-10) — PASS, 0 errors, 0 warnings, 0 section mismatches

--------------------------------------------------------------------------------
ath25_defconfig (mips, gcc-10) — PASS, 0 errors, 0 warnings, 0 section mismatches

--------------------------------------------------------------------------------
ath79_defconfig (mips, gcc-10) — PASS, 0 errors, 0 warnings, 0 section mismatches

--------------------------------------------------------------------------------
axm55xx_defconfig (arm, gcc-10) — PASS, 0 errors, 0 warnings, 0 section mismatches

--------------------------------------------------------------------------------
axs103_defconfig (arc, gcc-10) — PASS, 0 errors, 0 warnings, 0 section mismatches

--------------------------------------------------------------------------------
axs103_smp_defconfig (arc, gcc-10) — PASS, 0 errors, 0 warnings, 0 section mismatches

--------------------------------------------------------------------------------
badge4_defconfig (arm, gcc-10) — PASS, 0 errors, 0 warnings, 0 section mismatches

Section mismatches:
WARNING: modpost: vmlinux.o(.text+0xcd4c): Section mismatch in reference from the function __arm_ioremap_pfn_caller() to the function .meminit.text:memblock_is_map_memory()

--------------------------------------------------------------------------------
bcm2835_defconfig (arm, gcc-10) — PASS, 0 errors, 0 warnings, 0 section mismatches

--------------------------------------------------------------------------------
bcm47xx_defconfig (mips, gcc-10) — PASS, 0 errors, 0 warnings, 0 section mismatches

--------------------------------------------------------------------------------
bcm63xx_defconfig (mips, gcc-10) — PASS, 0 errors, 0 warnings, 0 section mismatches

--------------------------------------------------------------------------------
bigsur_defconfig (mips, gcc-10) — PASS, 0 errors, 0 warnings, 0 section mismatches

--------------------------------------------------------------------------------
bmips_be_defconfig (mips, gcc-10) — PASS, 0 errors, 0 warnings, 0 section mismatches

--------------------------------------------------------------------------------
bmips_stb_defconfig (mips, gcc-10) — PASS, 0 errors, 0 warnings, 0 section mismatches

--------------------------------------------------------------------------------
capcella_defconfig (mips, gcc-10) — PASS, 0 errors, 0 warnings, 0 section mismatches

--------------------------------------------------------------------------------
cavium_octeon_defconfig (mips, gcc-10) — PASS, 0 errors, 0 warnings, 0 section mismatches

--------------------------------------------------------------------------------
cerfcube_defconfig (arm, gcc-10) — PASS, 0 errors, 0 warnings, 0 section mismatches

Section mismatches:
WARNING: modpost: vmlinux.o(.text+0x7684): Section mismatch in reference from the function __arm_ioremap_pfn_caller() to the function .meminit.text:memblock_is_map_memory()

--------------------------------------------------------------------------------
ci20_defconfig (mips, gcc-10) — PASS, 0 errors, 0 warnings, 0 section mismatches

--------------------------------------------------------------------------------
cm_x300_defconfig (arm, gcc-10) — PASS, 0 errors, 0 warnings, 0 section mismatches

--------------------------------------------------------------------------------
cobalt_defconfig (mips, gcc-10) — PASS, 0 errors, 0 warnings, 0 section mismatches

--------------------------------------------------------------------------------
colibri_pxa270_defconfig (arm, gcc-10) — PASS, 0 errors, 0 warnings, 0 section mismatches

--------------------------------------------------------------------------------
colibri_pxa300_defconfig (arm, gcc-10) — PASS, 0 errors, 0 warnings, 0 section mismatches

--------------------------------------------------------------------------------
collie_defconfig (arm, gcc-10) — PASS, 0 errors, 0 warnings, 0 section mismatches

Section mismatches:
WARNING: modpost: vmlinux.o(.text+0xb918): Section mismatch in reference from the function __arm_ioremap_pfn_caller() to the function .meminit.text:memblock_is_map_memory()

--------------------------------------------------------------------------------
corgi_defconfig (arm, gcc-10) — PASS, 0 errors, 0 warnings, 0 section mismatches

--------------------------------------------------------------------------------
cu1000-neo_defconfig (mips, gcc-10) — PASS, 0 errors, 0 warnings, 0 section mismatches

--------------------------------------------------------------------------------
cu1830-neo_defconfig (mips, gcc-10) — PASS, 0 errors, 0 warnings, 0 section mismatches

--------------------------------------------------------------------------------
davinci_all_defconfig (arm, gcc-10) — PASS, 0 errors, 0 warnings, 0 section mismatches

--------------------------------------------------------------------------------
db1xxx_defconfig (mips, gcc-10) — PASS, 0 errors, 0 warnings, 0 section mismatches

--------------------------------------------------------------------------------
decstation_64_defconfig (mips, gcc-10) — PASS, 0 errors, 1 warning, 0 section mismatches

Warnings:
kernel/rcu/tasks.h:707:13: warning: ‘show_rcu_tasks_rude_gp_kthread’ defined but not used [-Wunused-function]

--------------------------------------------------------------------------------
decstation_defconfig (mips, gcc-10) — PASS, 0 errors, 1 warning, 0 section mismatches

Warnings:
kernel/rcu/tasks.h:707:13: warning: ‘show_rcu_tasks_rude_gp_kthread’ defined but not used [-Wunused-function]

--------------------------------------------------------------------------------
decstation_r4k_defconfig (mips, gcc-10) — PASS, 0 errors, 1 warning, 0 section mismatches

Warnings:
kernel/rcu/tasks.h:707:13: warning: ‘show_rcu_tasks_rude_gp_kthread’ defined but not used [-Wunused-function]

--------------------------------------------------------------------------------
defconfig (riscv, gcc-10) — PASS, 0 errors, 0 warnings, 0 section mismatches

--------------------------------------------------------------------------------
defconfig (arm64, gcc-10) — PASS, 0 errors, 0 warnings, 0 section mismatches

--------------------------------------------------------------------------------
defconfig+arm64-chromebook (arm64, gcc-10) — PASS, 0 errors, 0 warnings, 0 section mismatches

--------------------------------------------------------------------------------
defconfig+arm64-chromebook+kselftest (arm64, gcc-10) — PASS, 0 errors, 0 warnings, 0 section mismatches

--------------------------------------------------------------------------------
dove_defconfig (arm, gcc-10) — PASS, 0 errors, 0 warnings, 0 section mismatches

--------------------------------------------------------------------------------
e55_defconfig (mips, gcc-10) — PASS, 0 errors, 0 warnings, 0 section mismatches

--------------------------------------------------------------------------------
ebsa110_defconfig (arm, gcc-10) — PASS, 0 errors, 0 warnings, 0 section mismatches

--------------------------------------------------------------------------------
efm32_defconfig (arm, gcc-10) — PASS, 0 errors, 0 warnings, 0 section mismatches

--------------------------------------------------------------------------------
ep93xx_defconfig (arm, gcc-10) — PASS, 0 errors, 0 warnings, 0 section mismatches

Section mismatches:
WARNING: modpost: vmlinux.o(.text+0x8068): Section mismatch in reference from the function __arm_ioremap_pfn_caller() to the function .meminit.text:memblock_is_map_memory()

--------------------------------------------------------------------------------
eseries_pxa_defconfig (arm, gcc-10) — PASS, 0 errors, 0 warnings, 0 section mismatches

--------------------------------------------------------------------------------
exynos_defconfig (arm, gcc-10) — PASS, 0 errors, 0 warnings, 0 section mismatches

--------------------------------------------------------------------------------
ezx_defconfig (arm, gcc-10) — PASS, 0 errors, 0 warnings, 0 section mismatches

--------------------------------------------------------------------------------
footbridge_defconfig (arm, gcc-10) — PASS, 0 errors, 0 warnings, 0 section mismatches

--------------------------------------------------------------------------------
fuloong2e_defconfig (mips, gcc-10) — PASS, 0 errors, 0 warnings, 0 section mismatches

--------------------------------------------------------------------------------
gcw0_defconfig (mips, gcc-10) — PASS, 0 errors, 0 warnings, 0 section mismatches

--------------------------------------------------------------------------------
gemini_defconfig (arm, gcc-10) — PASS, 0 errors, 0 warnings, 0 section mismatches

--------------------------------------------------------------------------------
gpr_defconfig (mips, gcc-10) — PASS, 0 errors, 0 warnings, 0 section mismatches

--------------------------------------------------------------------------------
h3600_defconfig (arm, gcc-10) — PASS, 0 errors, 0 warnings, 0 section mismatches

Section mismatches:
WARNING: modpost: vmlinux.o(.text+0xcb98): Section mismatch in reference from the function __arm_ioremap_pfn_caller() to the function .meminit.text:memblock_is_map_memory()

--------------------------------------------------------------------------------
h5000_defconfig (arm, gcc-10) — PASS, 0 errors, 0 warnings, 0 section mismatches

--------------------------------------------------------------------------------
hackkit_defconfig (arm, gcc-10) — PASS, 0 errors, 0 warnings, 0 section mismatches

Section mismatches:
WARNING: modpost: vmlinux.o(.text+0xceb0): Section mismatch in reference from the function __arm_ioremap_pfn_caller() to the function .meminit.text:memblock_is_map_memory()

--------------------------------------------------------------------------------
haps_hs_defconfig (arc, gcc-10) — PASS, 0 errors, 0 warnings, 0 section mismatches

--------------------------------------------------------------------------------
haps_hs_smp_defconfig (arc, gcc-10) — PASS, 0 errors, 0 warnings, 0 section mismatches

--------------------------------------------------------------------------------
hisi_defconfig (arm, gcc-10) — PASS, 0 errors, 0 warnings, 0 section mismatches

--------------------------------------------------------------------------------
hsdk_defconfig (arc, gcc-10) — PASS, 0 errors, 0 warnings, 0 section mismatches

--------------------------------------------------------------------------------
i386_defconfig (i386, gcc-10) — PASS, 0 errors, 0 warnings, 0 section mismatches

--------------------------------------------------------------------------------
imote2_defconfig (arm, gcc-10) — PASS, 0 errors, 0 warnings, 0 section mismatches

--------------------------------------------------------------------------------
imx_v4_v5_defconfig (arm, gcc-10) — PASS, 0 errors, 0 warnings, 0 section mismatches

--------------------------------------------------------------------------------
imx_v6_v7_defconfig (arm, gcc-10) — PASS, 0 errors, 0 warnings, 0 section mismatches

--------------------------------------------------------------------------------
integrator_defconfig (arm, gcc-10) — PASS, 0 errors, 0 warnings, 0 section mismatches

--------------------------------------------------------------------------------
iop32x_defconfig (arm, gcc-10) — PASS, 0 errors, 0 warnings, 0 section mismatches

--------------------------------------------------------------------------------
ip22_defconfig (mips, gcc-10) — PASS, 0 errors, 0 warnings, 0 section mismatches

--------------------------------------------------------------------------------
ip27_defconfig (mips, gcc-10) — FAIL, 0 errors, 0 warnings, 0 section mismatches

--------------------------------------------------------------------------------
ip28_defconfig (mips, gcc-10) — FAIL, 0 errors, 0 warnings, 0 section mismatches

--------------------------------------------------------------------------------
ip32_defconfig (mips, gcc-10) — PASS, 0 errors, 0 warnings, 0 section mismatches

--------------------------------------------------------------------------------
ixp4xx_defconfig (arm, gcc-10) — PASS, 0 errors, 0 warnings, 0 section mismatches

--------------------------------------------------------------------------------
jazz_defconfig (mips, gcc-10) — PASS, 0 errors, 0 warnings, 0 section mismatches

--------------------------------------------------------------------------------
jmr3927_defconfig (mips, gcc-10) — PASS, 0 errors, 0 warnings, 0 section mismatches

--------------------------------------------------------------------------------
jornada720_defconfig (arm, gcc-10) — PASS, 0 errors, 0 warnings, 0 section mismatches

Section mismatches:
WARNING: modpost: vmlinux.o(.text+0xcabc): Section mismatch in reference from the function __arm_ioremap_pfn_caller() to the function .meminit.text:memblock_is_map_memory()

--------------------------------------------------------------------------------
keystone_defconfig (arm, gcc-10) — PASS, 0 errors, 0 warnings, 0 section mismatches

--------------------------------------------------------------------------------
lart_defconfig (arm, gcc-10) — PASS, 0 errors, 0 warnings, 0 section mismatches

Section mismatches:
WARNING: modpost: vmlinux.o(.text+0xcb88): Section mismatch in reference from the function __arm_ioremap_pfn_caller() to the function .meminit.text:memblock_is_map_memory()

--------------------------------------------------------------------------------
lemote2f_defconfig (mips, gcc-10) — PASS, 0 errors, 1 warning, 0 section mismatches

Warnings:
net/mac80211/mlme.c:4343:1: warning: the frame size of 1040 bytes is larger than 1024 bytes [-Wframe-larger-than=]

--------------------------------------------------------------------------------
loongson1b_defconfig (mips, gcc-10) — PASS, 0 errors, 0 warnings, 0 section mismatches

--------------------------------------------------------------------------------
loongson1c_defconfig (mips, gcc-10) — PASS, 0 errors, 0 warnings, 0 section mismatches

--------------------------------------------------------------------------------
loongson3_defconfig (mips, gcc-10) — PASS, 0 errors, 0 warnings, 0 section mismatches

--------------------------------------------------------------------------------
lpc18xx_defconfig (arm, gcc-10) — PASS, 0 errors, 0 warnings, 0 section mismatches

--------------------------------------------------------------------------------
lpc32xx_defconfig (arm, gcc-10) — PASS, 0 errors, 0 warnings, 0 section mismatches

--------------------------------------------------------------------------------
lpd270_defconfig (arm, gcc-10) — PASS, 0 errors, 0 warnings, 0 section mismatches

--------------------------------------------------------------------------------
lubbock_defconfig (arm, gcc-10) — PASS, 0 errors, 0 warnings, 0 section mismatches

--------------------------------------------------------------------------------
magician_defconfig (arm, gcc-10) — PASS, 0 errors, 0 warnings, 0 section mismatches

--------------------------------------------------------------------------------
mainstone_defconfig (arm, gcc-10) — PASS, 0 errors, 0 warnings, 0 section mismatches

--------------------------------------------------------------------------------
malta_defconfig (mips, gcc-10) — PASS, 0 errors, 0 warnings, 0 section mismatches

--------------------------------------------------------------------------------
malta_kvm_defconfig (mips, gcc-10) — PASS, 0 errors, 0 warnings, 0 section mismatches

--------------------------------------------------------------------------------
malta_kvm_guest_defconfig (mips, gcc-10) — PASS, 0 errors, 0 warnings, 0 section mismatches

--------------------------------------------------------------------------------
malta_qemu_32r6_defconfig (mips, gcc-10) — PASS, 0 errors, 0 warnings, 0 section mismatches

--------------------------------------------------------------------------------
maltaaprp_defconfig (mips, gcc-10) — PASS, 0 errors, 0 warnings, 0 section mismatches

--------------------------------------------------------------------------------
maltasmvp_defconfig (mips, gcc-10) — PASS, 0 errors, 0 warnings, 0 section mismatches

--------------------------------------------------------------------------------
maltasmvp_eva_defconfig (mips, gcc-10) — PASS, 0 errors, 0 warnings, 0 section mismatches

--------------------------------------------------------------------------------
maltaup_defconfig (mips, gcc-10) — PASS, 0 errors, 0 warnings, 0 section mismatches

--------------------------------------------------------------------------------
maltaup_xpa_defconfig (mips, gcc-10) — PASS, 0 errors, 0 warnings, 0 section mismatches

--------------------------------------------------------------------------------
milbeaut_m10v_defconfig (arm, gcc-10) — PASS, 0 errors, 0 warnings, 0 section mismatches

--------------------------------------------------------------------------------
mini2440_defconfig (arm, gcc-10) — PASS, 0 errors, 0 warnings, 0 section mismatches

--------------------------------------------------------------------------------
mmp2_defconfig (arm, gcc-10) — PASS, 0 errors, 0 warnings, 0 section mismatches

--------------------------------------------------------------------------------
moxart_defconfig (arm, gcc-10) — PASS, 0 errors, 0 warnings, 0 section mismatches

--------------------------------------------------------------------------------
mpc30x_defconfig (mips, gcc-10) — PASS, 0 errors, 0 warnings, 0 section mismatches

--------------------------------------------------------------------------------
mps2_defconfig (arm, gcc-10) — PASS, 0 errors, 0 warnings, 0 section mismatches

--------------------------------------------------------------------------------
mtx1_defconfig (mips, gcc-10) — PASS, 0 errors, 0 warnings, 0 section mismatches

--------------------------------------------------------------------------------
multi_v4t_defconfig (arm, gcc-10) — PASS, 0 errors, 0 warnings, 0 section mismatches

--------------------------------------------------------------------------------
multi_v5_defconfig (arm, gcc-10) — PASS, 0 errors, 0 warnings, 0 section mismatches

--------------------------------------------------------------------------------
multi_v7_defconfig (arm, gcc-10) — PASS, 0 errors, 0 warnings, 0 section mismatches

--------------------------------------------------------------------------------
multi_v7_defconfig+kselftest (arm, gcc-10) — PASS, 0 errors, 0 warnings, 0 section mismatches

--------------------------------------------------------------------------------
mvebu_v5_defconfig (arm, gcc-10) — PASS, 0 errors, 0 warnings, 0 section mismatches

--------------------------------------------------------------------------------
mvebu_v7_defconfig (arm, gcc-10) — PASS, 0 errors, 0 warnings, 0 section mismatches

--------------------------------------------------------------------------------
mxs_defconfig (arm, gcc-10) — PASS, 0 errors, 0 warnings, 0 section mismatches

--------------------------------------------------------------------------------
neponset_defconfig (arm, gcc-10) — PASS, 0 errors, 0 warnings, 0 section mismatches

Section mismatches:
WARNING: modpost: vmlinux.o(.text+0xcdb8): Section mismatch in reference from the function __arm_ioremap_pfn_caller() to the function .meminit.text:memblock_is_map_memory()

--------------------------------------------------------------------------------
netwinder_defconfig (arm, gcc-10) — PASS, 0 errors, 0 warnings, 0 section mismatches

--------------------------------------------------------------------------------
nhk8815_defconfig (arm, gcc-10) — PASS, 0 errors, 0 warnings, 0 section mismatches

--------------------------------------------------------------------------------
nlm_xlp_defconfig (mips, gcc-10) — PASS, 0 errors, 0 warnings, 0 section mismatches

--------------------------------------------------------------------------------
nlm_xlr_defconfig (mips, gcc-10) — PASS, 0 errors, 0 warnings, 0 section mismatches

--------------------------------------------------------------------------------
nommu_k210_defconfig (riscv, gcc-10) — PASS, 0 errors, 0 warnings, 0 section mismatches

--------------------------------------------------------------------------------
nsimosci_hs_defconfig (arc, gcc-10) — PASS, 0 errors, 0 warnings, 0 section mismatches

--------------------------------------------------------------------------------
nsimosci_hs_smp_defconfig (arc, gcc-10) — PASS, 0 errors, 0 warnings, 0 section mismatches

--------------------------------------------------------------------------------
omap1_defconfig (arm, gcc-10) — PASS, 0 errors, 0 warnings, 0 section mismatches

--------------------------------------------------------------------------------
omap2plus_defconfig (arm, gcc-10) — PASS, 0 errors, 0 warnings, 0 section mismatches

--------------------------------------------------------------------------------
omega2p_defconfig (mips, gcc-10) — PASS, 0 errors, 0 warnings, 0 section mismatches

--------------------------------------------------------------------------------
orion5x_defconfig (arm, gcc-10) — PASS, 0 errors, 0 warnings, 0 section mismatches

--------------------------------------------------------------------------------
oxnas_v6_defconfig (arm, gcc-10) — PASS, 0 errors, 0 warnings, 0 section mismatches

--------------------------------------------------------------------------------
palmz72_defconfig (arm, gcc-10) — PASS, 0 errors, 0 warnings, 0 section mismatches

--------------------------------------------------------------------------------
pcm027_defconfig (arm, gcc-10) — PASS, 0 errors, 0 warnings, 0 section mismatches

--------------------------------------------------------------------------------
pic32mzda_defconfig (mips, gcc-10) — PASS, 0 errors, 0 warnings, 0 section mismatches

--------------------------------------------------------------------------------
pistachio_defconfig (mips, gcc-10) — PASS, 0 errors, 0 warnings, 0 section mismatches

--------------------------------------------------------------------------------
pleb_defconfig (arm, gcc-10) — PASS, 0 errors, 0 warnings, 0 section mismatches

Section mismatches:
WARNING: modpost: vmlinux.o(.text+0xc900): Section mismatch in reference from the function __arm_ioremap_pfn_caller() to the function .meminit.text:memblock_is_map_memory()

--------------------------------------------------------------------------------
prima2_defconfig (arm, gcc-10) — PASS, 0 errors, 0 warnings, 0 section mismatches

--------------------------------------------------------------------------------
pxa168_defconfig (arm, gcc-10) — PASS, 0 errors, 0 warnings, 0 section mismatches

--------------------------------------------------------------------------------
pxa255-idp_defconfig (arm, gcc-10) — PASS, 0 errors, 0 warnings, 0 section mismatches

--------------------------------------------------------------------------------
pxa3xx_defconfig (arm, gcc-10) — PASS, 0 errors, 0 warnings, 0 section mismatches

--------------------------------------------------------------------------------
pxa910_defconfig (arm, gcc-10) — PASS, 0 errors, 0 warnings, 0 section mismatches

--------------------------------------------------------------------------------
pxa_defconfig (arm, gcc-10) — PASS, 0 errors, 0 warnings, 0 section mismatches

--------------------------------------------------------------------------------
qcom_defconfig (arm, gcc-10) — PASS, 0 errors, 0 warnings, 0 section mismatches

--------------------------------------------------------------------------------
qi_lb60_defconfig (mips, gcc-10) — PASS, 0 errors, 0 warnings, 0 section mismatches

--------------------------------------------------------------------------------
rb532_defconfig (mips, gcc-10) — PASS, 0 errors, 0 warnings, 0 section mismatches

--------------------------------------------------------------------------------
rbtx49xx_defconfig (mips, gcc-10) — PASS, 0 errors, 0 warnings, 0 section mismatches

--------------------------------------------------------------------------------
realview_defconfig (arm, gcc-10) — PASS, 0 errors, 0 warnings, 0 section mismatches

--------------------------------------------------------------------------------
rm200_defconfig (mips, gcc-10) — PASS, 0 errors, 1 warning, 0 section mismatches

Warnings:
drivers/block/paride/bpck.c:32: warning: "PC" redefined

--------------------------------------------------------------------------------
rpc_defconfig (arm, gcc-10) — FAIL, 4 errors, 0 warnings, 0 section mismatches

Errors:
arm-linux-gnueabihf-gcc: error: unrecognized -march target: armv3m
arm-linux-gnueabihf-gcc: error: missing argument to ‘-march=’
arm-linux-gnueabihf-gcc: error: unrecognized -march target: armv3m
arm-linux-gnueabihf-gcc: error: missing argument to ‘-march=’

--------------------------------------------------------------------------------
rs90_defconfig (mips, gcc-10) — PASS, 0 errors, 0 warnings, 0 section mismatches

--------------------------------------------------------------------------------
rt305x_defconfig (mips, gcc-10) — PASS, 0 errors, 0 warnings, 0 section mismatches

--------------------------------------------------------------------------------
rv32_defconfig (riscv, gcc-10) — PASS, 0 errors, 4 warnings, 0 section mismatches

Warnings:
<stdin>:830:2: warning: #warning syscall fstat64 not implemented [-Wcpp]
<stdin>:1127:2: warning: #warning syscall fstatat64 not implemented [-Wcpp]
<stdin>:830:2: warning: #warning syscall fstat64 not implemented [-Wcpp]
<stdin>:1127:2: warning: #warning syscall fstatat64 not implemented [-Wcpp]

--------------------------------------------------------------------------------
s3c2410_defconfig (arm, gcc-10) — PASS, 0 errors, 0 warnings, 0 section mismatches

--------------------------------------------------------------------------------
s3c6400_defconfig (arm, gcc-10) — PASS, 0 errors, 0 warnings, 0 section mismatches

--------------------------------------------------------------------------------
s5pv210_defconfig (arm, gcc-10) — PASS, 0 errors, 0 warnings, 0 section mismatches

--------------------------------------------------------------------------------
sama5_defconfig (arm, gcc-10) — PASS, 0 errors, 0 warnings, 0 section mismatches

--------------------------------------------------------------------------------
sb1250_swarm_defconfig (mips, gcc-10) — PASS, 0 errors, 0 warnings, 0 section mismatches

--------------------------------------------------------------------------------
shannon_defconfig (arm, gcc-10) — PASS, 0 errors, 0 warnings, 0 section mismatches

Section mismatches:
WARNING: modpost: vmlinux.o(.text+0xcb60): Section mismatch in reference from the function __arm_ioremap_pfn_caller() to the function .meminit.text:memblock_is_map_memory()

--------------------------------------------------------------------------------
shmobile_defconfig (arm, gcc-10) — PASS, 0 errors, 0 warnings, 0 section mismatches

--------------------------------------------------------------------------------
simpad_defconfig (arm, gcc-10) — PASS, 0 errors, 0 warnings, 0 section mismatches

Section mismatches:
WARNING: modpost: vmlinux.o(.text+0xd054): Section mismatch in reference from the function __arm_ioremap_pfn_caller() to the function .meminit.text:memblock_is_map_memory()

--------------------------------------------------------------------------------
socfpga_defconfig (arm, gcc-10) — PASS, 0 errors, 0 warnings, 0 section mismatches

--------------------------------------------------------------------------------
spear13xx_defconfig (arm, gcc-10) — PASS, 0 errors, 0 warnings, 0 section mismatches

--------------------------------------------------------------------------------
spear3xx_defconfig (arm, gcc-10) — PASS, 0 errors, 0 warnings, 0 section mismatches

--------------------------------------------------------------------------------
spear6xx_defconfig (arm, gcc-10) — PASS, 0 errors, 0 warnings, 0 section mismatches

--------------------------------------------------------------------------------
spitz_defconfig (arm, gcc-10) — PASS, 0 errors, 0 warnings, 0 section mismatches

--------------------------------------------------------------------------------
stm32_defconfig (arm, gcc-10) — PASS, 0 errors, 0 warnings, 0 section mismatches

--------------------------------------------------------------------------------
sunxi_defconfig (arm, gcc-10) — PASS, 0 errors, 0 warnings, 0 section mismatches

--------------------------------------------------------------------------------
tango4_defconfig (arm, gcc-10) — PASS, 0 errors, 0 warnings, 0 section mismatches

--------------------------------------------------------------------------------
tb0219_defconfig (mips, gcc-10) — PASS, 0 errors, 0 warnings, 0 section mismatches

--------------------------------------------------------------------------------
tb0226_defconfig (mips, gcc-10) — PASS, 0 errors, 0 warnings, 0 section mismatches

--------------------------------------------------------------------------------
tb0287_defconfig (mips, gcc-10) — PASS, 0 errors, 0 warnings, 0 section mismatches

--------------------------------------------------------------------------------
tct_hammer_defconfig (arm, gcc-10) — PASS, 0 errors, 0 warnings, 0 section mismatches

--------------------------------------------------------------------------------
tegra_defconfig (arm, gcc-10) — PASS, 0 errors, 0 warnings, 0 section mismatches

--------------------------------------------------------------------------------
tinyconfig (x86_64, gcc-10) — PASS, 0 errors, 0 warnings, 0 section mismatches

--------------------------------------------------------------------------------
tinyconfig (arc, gcc-10) — PASS, 0 errors, 0 warnings, 0 section mismatches

--------------------------------------------------------------------------------
tinyconfig (i386, gcc-10) — PASS, 0 errors, 0 warnings, 0 section mismatches

--------------------------------------------------------------------------------
trizeps4_defconfig (arm, gcc-10) — PASS, 0 errors, 0 warnings, 0 section mismatches

--------------------------------------------------------------------------------
u300_defconfig (arm, gcc-10) — PASS, 0 errors, 0 warnings, 0 section mismatches

--------------------------------------------------------------------------------
u8500_defconfig (arm, gcc-10) — PASS, 0 errors, 0 warnings, 0 section mismatches

--------------------------------------------------------------------------------
vdk_hs38_defconfig (arc, gcc-10) — PASS, 0 errors, 0 warnings, 0 section mismatches

--------------------------------------------------------------------------------
vdk_hs38_smp_defconfig (arc, gcc-10) — PASS, 0 errors, 0 warnings, 0 section mismatches

--------------------------------------------------------------------------------
versatile_defconfig (arm, gcc-10) — PASS, 0 errors, 0 warnings, 0 section mismatches

--------------------------------------------------------------------------------
vexpress_defconfig (arm, gcc-10) — PASS, 0 errors, 0 warnings, 0 section mismatches

--------------------------------------------------------------------------------
vf610m4_defconfig (arm, gcc-10) — PASS, 0 errors, 0 warnings, 0 section mismatches

--------------------------------------------------------------------------------
viper_defconfig (arm, gcc-10) — PASS, 0 errors, 0 warnings, 0 section mismatches

--------------------------------------------------------------------------------
vocore2_defconfig (mips, gcc-10) — PASS, 0 errors, 0 warnings, 0 section mismatches

--------------------------------------------------------------------------------
vt8500_v6_v7_defconfig (arm, gcc-10) — PASS, 0 errors, 0 warnings, 0 section mismatches

--------------------------------------------------------------------------------
workpad_defconfig (mips, gcc-10) — PASS, 0 errors, 0 warnings, 0 section mismatches

--------------------------------------------------------------------------------
x86_64_defconfig (x86_64, gcc-10) — PASS, 0 errors, 0 warnings, 0 section mismatches

--------------------------------------------------------------------------------
x86_64_defconfig+kselftest (x86_64, gcc-10) — PASS, 0 errors, 0 warnings, 0 section mismatches

--------------------------------------------------------------------------------
x86_64_defconfig+x86-chromebook (x86_64, gcc-10) — PASS, 0 errors, 0 warnings, 0 section mismatches

--------------------------------------------------------------------------------
x86_64_defconfig+x86-chromebook+kselftest (x86_64, gcc-10) — PASS, 0 errors, 0 warnings, 0 section mismatches

--------------------------------------------------------------------------------
xcep_defconfig (arm, gcc-10) — PASS, 0 errors, 0 warnings, 0 section mismatches

--------------------------------------------------------------------------------
zeus_defconfig (arm, gcc-10) — PASS, 0 errors, 0 warnings, 0 section mismatches

--------------------------------------------------------------------------------
zx_defconfig (arm, gcc-10) — PASS, 0 errors, 0 warnings, 0 section mismatches

---
For more info write to <info@...>


cip/linux-4.19.y-cip build: 120 builds: 120 failed, 0 passed, 2 errors, 22 warnings (v4.19.239-cip72) #kernelci

kernelci.org bot <bot@...>
 

cip/linux-4.19.y-cip build: 120 builds: 120 failed, 0 passed, 2 errors, 22 warnings (v4.19.239-cip72)

Full Build Summary: https://kernelci.org/build/cip/branch/linux-4.19.y-cip/kernel/v4.19.239-cip72/

Tree: cip
Branch: linux-4.19.y-cip
Git Describe: v4.19.239-cip72
Git Commit: fdf770b2db8080de95dcf74cc7547319034a4a56
Git URL: https://git.kernel.org/pub/scm/linux/kernel/git/cip/linux-cip.git
Built: 3 unique architectures

Build Failures Detected:

arm64:
cip://4.19.y-cip/arm64/qemu_arm64_defconfig: (gcc-10) FAIL
defconfig: (gcc-10) FAIL
defconfig+arm64-chromebook: (gcc-10) FAIL

arm:
acs5k_defconfig: (gcc-10) FAIL
acs5k_tiny_defconfig: (gcc-10) FAIL
am200epdkit_defconfig: (gcc-10) FAIL
aspeed_g4_defconfig: (gcc-10) FAIL
aspeed_g5_defconfig: (gcc-10) FAIL
assabet_defconfig: (gcc-10) FAIL
at91_dt_defconfig: (gcc-10) FAIL
axm55xx_defconfig: (gcc-10) FAIL
badge4_defconfig: (gcc-10) FAIL
bcm2835_defconfig: (gcc-10) FAIL
cerfcube_defconfig: (gcc-10) FAIL
cip://4.19.y-cip/arm/qemu_arm_defconfig: (gcc-10) FAIL
cm_x2xx_defconfig: (gcc-10) FAIL
cm_x300_defconfig: (gcc-10) FAIL
colibri_pxa270_defconfig: (gcc-10) FAIL
colibri_pxa300_defconfig: (gcc-10) FAIL
collie_defconfig: (gcc-10) FAIL
corgi_defconfig: (gcc-10) FAIL
davinci_all_defconfig: (gcc-10) FAIL
dove_defconfig: (gcc-10) FAIL
ebsa110_defconfig: (gcc-10) FAIL
efm32_defconfig: (gcc-10) FAIL
em_x270_defconfig: (gcc-10) FAIL
ep93xx_defconfig: (gcc-10) FAIL
eseries_pxa_defconfig: (gcc-10) FAIL
exynos_defconfig: (gcc-10) FAIL
ezx_defconfig: (gcc-10) FAIL
footbridge_defconfig: (gcc-10) FAIL
gemini_defconfig: (gcc-10) FAIL
h3600_defconfig: (gcc-10) FAIL
h5000_defconfig: (gcc-10) FAIL
hackkit_defconfig: (gcc-10) FAIL
hisi_defconfig: (gcc-10) FAIL
imote2_defconfig: (gcc-10) FAIL
imx_v4_v5_defconfig: (gcc-10) FAIL
imx_v6_v7_defconfig: (gcc-10) FAIL
integrator_defconfig: (gcc-10) FAIL
iop13xx_defconfig: (gcc-10) FAIL
iop32x_defconfig: (gcc-10) FAIL
iop33x_defconfig: (gcc-10) FAIL
ixp4xx_defconfig: (gcc-10) FAIL
jornada720_defconfig: (gcc-10) FAIL
keystone_defconfig: (gcc-10) FAIL
ks8695_defconfig: (gcc-10) FAIL
lart_defconfig: (gcc-10) FAIL
lpc18xx_defconfig: (gcc-10) FAIL
lpc32xx_defconfig: (gcc-10) FAIL
lpd270_defconfig: (gcc-10) FAIL
lubbock_defconfig: (gcc-10) FAIL
magician_defconfig: (gcc-10) FAIL
mainstone_defconfig: (gcc-10) FAIL
mini2440_defconfig: (gcc-10) FAIL
mmp2_defconfig: (gcc-10) FAIL
moxart_defconfig: (gcc-10) FAIL
mps2_defconfig: (gcc-10) FAIL
multi_v4t_defconfig: (gcc-10) FAIL
multi_v5_defconfig: (gcc-10) FAIL
multi_v7_defconfig: (gcc-10) FAIL
mvebu_v5_defconfig: (gcc-10) FAIL
mvebu_v7_defconfig: (gcc-10) FAIL
mxs_defconfig: (gcc-10) FAIL
neponset_defconfig: (gcc-10) FAIL
netwinder_defconfig: (gcc-10) FAIL
netx_defconfig: (gcc-10) FAIL
nhk8815_defconfig: (gcc-10) FAIL
nuc910_defconfig: (gcc-10) FAIL
nuc950_defconfig: (gcc-10) FAIL
nuc960_defconfig: (gcc-10) FAIL
omap1_defconfig: (gcc-10) FAIL
omap2plus_defconfig: (gcc-10) FAIL
orion5x_defconfig: (gcc-10) FAIL
oxnas_v6_defconfig: (gcc-10) FAIL
palmz72_defconfig: (gcc-10) FAIL
pcm027_defconfig: (gcc-10) FAIL
pleb_defconfig: (gcc-10) FAIL
prima2_defconfig: (gcc-10) FAIL
pxa168_defconfig: (gcc-10) FAIL
pxa255-idp_defconfig: (gcc-10) FAIL
pxa3xx_defconfig: (gcc-10) FAIL
pxa910_defconfig: (gcc-10) FAIL
pxa_defconfig: (gcc-10) FAIL
qcom_defconfig: (gcc-10) FAIL
raumfeld_defconfig: (gcc-10) FAIL
realview_defconfig: (gcc-10) FAIL
rpc_defconfig: (gcc-10) FAIL
s3c2410_defconfig: (gcc-10) FAIL
s3c6400_defconfig: (gcc-10) FAIL
s5pv210_defconfig: (gcc-10) FAIL
sama5_defconfig: (gcc-10) FAIL
shannon_defconfig: (gcc-10) FAIL
shmobile_defconfig: (gcc-10) FAIL
simpad_defconfig: (gcc-10) FAIL
socfpga_defconfig: (gcc-10) FAIL
spear13xx_defconfig: (gcc-10) FAIL
spear3xx_defconfig: (gcc-10) FAIL
spear6xx_defconfig: (gcc-10) FAIL
spitz_defconfig: (gcc-10) FAIL
stm32_defconfig: (gcc-10) FAIL
sunxi_defconfig: (gcc-10) FAIL
tango4_defconfig: (gcc-10) FAIL
tct_hammer_defconfig: (gcc-10) FAIL
tegra_defconfig: (gcc-10) FAIL
trizeps4_defconfig: (gcc-10) FAIL
u300_defconfig: (gcc-10) FAIL
u8500_defconfig: (gcc-10) FAIL
versatile_defconfig: (gcc-10) FAIL
vexpress_defconfig: (gcc-10) FAIL
vf610m4_defconfig: (gcc-10) FAIL
viper_defconfig: (gcc-10) FAIL
vt8500_v6_v7_defconfig: (gcc-10) FAIL
xcep_defconfig: (gcc-10) FAIL
zeus_defconfig: (gcc-10) FAIL
zx_defconfig: (gcc-10) FAIL

x86_64:
allnoconfig: (gcc-10) FAIL
cip://4.19.y-cip/x86/cip_qemu_defconfig: (gcc-10) FAIL
x86_64_defconfig: (gcc-10) FAIL
x86_64_defconfig+x86-chromebook: (gcc-10) FAIL

Errors and Warnings Detected:

arm64:
cip://4.19.y-cip/arm64/qemu_arm64_defconfig (gcc-10): 3 warnings
defconfig (gcc-10): 3 warnings
defconfig+arm64-chromebook (gcc-10): 3 warnings

arm:
omap1_defconfig (gcc-10): 1 warning
rpc_defconfig (gcc-10): 2 errors

x86_64:
allnoconfig (gcc-10): 3 warnings
cip://4.19.y-cip/x86/cip_qemu_defconfig (gcc-10): 3 warnings
x86_64_defconfig (gcc-10): 3 warnings
x86_64_defconfig+x86-chromebook (gcc-10): 3 warnings

Errors summary:

1 arm-linux-gnueabihf-gcc: error: unrecognized -march target: armv3
1 arm-linux-gnueabihf-gcc: error: missing argument to ‘-march=’

Warnings summary:

9 aarch64-linux-gnu-ld: warning: -z norelro ignored
4 ld: warning: creating DT_TEXTREL in a PIE
4 ld: arch/x86/boot/compressed/head_64.o: warning: relocation in read-only section `.head.text'
4 arch/x86/entry/entry_64.S:1738: Warning: no instruction mnemonic suffix given and no register operands; using default for `sysret'
1 drivers/gpio/gpio-omap.c:1233:34: warning: array ‘omap_gpio_match’ assumed to have one element

================================================================================

Detailed per-defconfig build reports:

--------------------------------------------------------------------------------
acs5k_defconfig (arm, gcc-10) — FAIL, 0 errors, 0 warnings, 0 section mismatches

--------------------------------------------------------------------------------
acs5k_tiny_defconfig (arm, gcc-10) — FAIL, 0 errors, 0 warnings, 0 section mismatches

--------------------------------------------------------------------------------
allnoconfig (x86_64, gcc-10) — FAIL, 0 errors, 3 warnings, 0 section mismatches

Warnings:
arch/x86/entry/entry_64.S:1738: Warning: no instruction mnemonic suffix given and no register operands; using default for `sysret'
ld: arch/x86/boot/compressed/head_64.o: warning: relocation in read-only section `.head.text'
ld: warning: creating DT_TEXTREL in a PIE

--------------------------------------------------------------------------------
am200epdkit_defconfig (arm, gcc-10) — FAIL, 0 errors, 0 warnings, 0 section mismatches

--------------------------------------------------------------------------------
aspeed_g4_defconfig (arm, gcc-10) — FAIL, 0 errors, 0 warnings, 0 section mismatches

--------------------------------------------------------------------------------
aspeed_g5_defconfig (arm, gcc-10) — FAIL, 0 errors, 0 warnings, 0 section mismatches

--------------------------------------------------------------------------------
assabet_defconfig (arm, gcc-10) — FAIL, 0 errors, 0 warnings, 0 section mismatches

--------------------------------------------------------------------------------
at91_dt_defconfig (arm, gcc-10) — FAIL, 0 errors, 0 warnings, 0 section mismatches

--------------------------------------------------------------------------------
axm55xx_defconfig (arm, gcc-10) — FAIL, 0 errors, 0 warnings, 0 section mismatches

--------------------------------------------------------------------------------
badge4_defconfig (arm, gcc-10) — FAIL, 0 errors, 0 warnings, 0 section mismatches

--------------------------------------------------------------------------------
bcm2835_defconfig (arm, gcc-10) — FAIL, 0 errors, 0 warnings, 0 section mismatches

--------------------------------------------------------------------------------
cerfcube_defconfig (arm, gcc-10) — FAIL, 0 errors, 0 warnings, 0 section mismatches

--------------------------------------------------------------------------------
cip://4.19.y-cip/arm/qemu_arm_defconfig (arm, gcc-10) — FAIL, 0 errors, 0 warnings, 0 section mismatches

--------------------------------------------------------------------------------
cip://4.19.y-cip/arm64/qemu_arm64_defconfig (arm64, gcc-10) — FAIL, 0 errors, 3 warnings, 0 section mismatches

Warnings:
aarch64-linux-gnu-ld: warning: -z norelro ignored
aarch64-linux-gnu-ld: warning: -z norelro ignored
aarch64-linux-gnu-ld: warning: -z norelro ignored

--------------------------------------------------------------------------------
cip://4.19.y-cip/x86/cip_qemu_defconfig (x86_64, gcc-10) — FAIL, 0 errors, 3 warnings, 0 section mismatches

Warnings:
arch/x86/entry/entry_64.S:1738: Warning: no instruction mnemonic suffix given and no register operands; using default for `sysret'
ld: arch/x86/boot/compressed/head_64.o: warning: relocation in read-only section `.head.text'
ld: warning: creating DT_TEXTREL in a PIE

--------------------------------------------------------------------------------
cm_x2xx_defconfig (arm, gcc-10) — FAIL, 0 errors, 0 warnings, 0 section mismatches

--------------------------------------------------------------------------------
cm_x300_defconfig (arm, gcc-10) — FAIL, 0 errors, 0 warnings, 0 section mismatches

--------------------------------------------------------------------------------
colibri_pxa270_defconfig (arm, gcc-10) — FAIL, 0 errors, 0 warnings, 0 section mismatches

--------------------------------------------------------------------------------
colibri_pxa300_defconfig (arm, gcc-10) — FAIL, 0 errors, 0 warnings, 0 section mismatches

--------------------------------------------------------------------------------
collie_defconfig (arm, gcc-10) — FAIL, 0 errors, 0 warnings, 0 section mismatches

--------------------------------------------------------------------------------
corgi_defconfig (arm, gcc-10) — FAIL, 0 errors, 0 warnings, 0 section mismatches

--------------------------------------------------------------------------------
davinci_all_defconfig (arm, gcc-10) — FAIL, 0 errors, 0 warnings, 0 section mismatches

--------------------------------------------------------------------------------
defconfig (arm64, gcc-10) — FAIL, 0 errors, 3 warnings, 0 section mismatches

Warnings:
aarch64-linux-gnu-ld: warning: -z norelro ignored
aarch64-linux-gnu-ld: warning: -z norelro ignored
aarch64-linux-gnu-ld: warning: -z norelro ignored

--------------------------------------------------------------------------------
defconfig+arm64-chromebook (arm64, gcc-10) — FAIL, 0 errors, 3 warnings, 0 section mismatches

Warnings:
aarch64-linux-gnu-ld: warning: -z norelro ignored
aarch64-linux-gnu-ld: warning: -z norelro ignored
aarch64-linux-gnu-ld: warning: -z norelro ignored

--------------------------------------------------------------------------------
dove_defconfig (arm, gcc-10) — FAIL, 0 errors, 0 warnings, 0 section mismatches

--------------------------------------------------------------------------------
ebsa110_defconfig (arm, gcc-10) — FAIL, 0 errors, 0 warnings, 0 section mismatches

--------------------------------------------------------------------------------
efm32_defconfig (arm, gcc-10) — FAIL, 0 errors, 0 warnings, 0 section mismatches

--------------------------------------------------------------------------------
em_x270_defconfig (arm, gcc-10) — FAIL, 0 errors, 0 warnings, 0 section mismatches

--------------------------------------------------------------------------------
ep93xx_defconfig (arm, gcc-10) — FAIL, 0 errors, 0 warnings, 0 section mismatches

--------------------------------------------------------------------------------
eseries_pxa_defconfig (arm, gcc-10) — FAIL, 0 errors, 0 warnings, 0 section mismatches

--------------------------------------------------------------------------------
exynos_defconfig (arm, gcc-10) — FAIL, 0 errors, 0 warnings, 0 section mismatches

--------------------------------------------------------------------------------
ezx_defconfig (arm, gcc-10) — FAIL, 0 errors, 0 warnings, 0 section mismatches

--------------------------------------------------------------------------------
footbridge_defconfig (arm, gcc-10) — FAIL, 0 errors, 0 warnings, 0 section mismatches

--------------------------------------------------------------------------------
gemini_defconfig (arm, gcc-10) — FAIL, 0 errors, 0 warnings, 0 section mismatches

--------------------------------------------------------------------------------
h3600_defconfig (arm, gcc-10) — FAIL, 0 errors, 0 warnings, 0 section mismatches

--------------------------------------------------------------------------------
h5000_defconfig (arm, gcc-10) — FAIL, 0 errors, 0 warnings, 0 section mismatches

--------------------------------------------------------------------------------
hackkit_defconfig (arm, gcc-10) — FAIL, 0 errors, 0 warnings, 0 section mismatches

--------------------------------------------------------------------------------
hisi_defconfig (arm, gcc-10) — FAIL, 0 errors, 0 warnings, 0 section mismatches

--------------------------------------------------------------------------------
imote2_defconfig (arm, gcc-10) — FAIL, 0 errors, 0 warnings, 0 section mismatches

--------------------------------------------------------------------------------
imx_v4_v5_defconfig (arm, gcc-10) — FAIL, 0 errors, 0 warnings, 0 section mismatches

--------------------------------------------------------------------------------
imx_v6_v7_defconfig (arm, gcc-10) — FAIL, 0 errors, 0 warnings, 0 section mismatches

--------------------------------------------------------------------------------
integrator_defconfig (arm, gcc-10) — FAIL, 0 errors, 0 warnings, 0 section mismatches

--------------------------------------------------------------------------------
iop13xx_defconfig (arm, gcc-10) — FAIL, 0 errors, 0 warnings, 0 section mismatches

--------------------------------------------------------------------------------
iop32x_defconfig (arm, gcc-10) — FAIL, 0 errors, 0 warnings, 0 section mismatches

--------------------------------------------------------------------------------
iop33x_defconfig (arm, gcc-10) — FAIL, 0 errors, 0 warnings, 0 section mismatches

--------------------------------------------------------------------------------
ixp4xx_defconfig (arm, gcc-10) — FAIL, 0 errors, 0 warnings, 0 section mismatches

--------------------------------------------------------------------------------
jornada720_defconfig (arm, gcc-10) — FAIL, 0 errors, 0 warnings, 0 section mismatches

--------------------------------------------------------------------------------
keystone_defconfig (arm, gcc-10) — FAIL, 0 errors, 0 warnings, 0 section mismatches

--------------------------------------------------------------------------------
ks8695_defconfig (arm, gcc-10) — FAIL, 0 errors, 0 warnings, 0 section mismatches

--------------------------------------------------------------------------------
lart_defconfig (arm, gcc-10) — FAIL, 0 errors, 0 warnings, 0 section mismatches

--------------------------------------------------------------------------------
lpc18xx_defconfig (arm, gcc-10) — FAIL, 0 errors, 0 warnings, 0 section mismatches

--------------------------------------------------------------------------------
lpc32xx_defconfig (arm, gcc-10) — FAIL, 0 errors, 0 warnings, 0 section mismatches

--------------------------------------------------------------------------------
lpd270_defconfig (arm, gcc-10) — FAIL, 0 errors, 0 warnings, 0 section mismatches

--------------------------------------------------------------------------------
lubbock_defconfig (arm, gcc-10) — FAIL, 0 errors, 0 warnings, 0 section mismatches

--------------------------------------------------------------------------------
magician_defconfig (arm, gcc-10) — FAIL, 0 errors, 0 warnings, 0 section mismatches

--------------------------------------------------------------------------------
mainstone_defconfig (arm, gcc-10) — FAIL, 0 errors, 0 warnings, 0 section mismatches

--------------------------------------------------------------------------------
mini2440_defconfig (arm, gcc-10) — FAIL, 0 errors, 0 warnings, 0 section mismatches

--------------------------------------------------------------------------------
mmp2_defconfig (arm, gcc-10) — FAIL, 0 errors, 0 warnings, 0 section mismatches

--------------------------------------------------------------------------------
moxart_defconfig (arm, gcc-10) — FAIL, 0 errors, 0 warnings, 0 section mismatches

--------------------------------------------------------------------------------
mps2_defconfig (arm, gcc-10) — FAIL, 0 errors, 0 warnings, 0 section mismatches

--------------------------------------------------------------------------------
multi_v4t_defconfig (arm, gcc-10) — FAIL, 0 errors, 0 warnings, 0 section mismatches

--------------------------------------------------------------------------------
multi_v5_defconfig (arm, gcc-10) — FAIL, 0 errors, 0 warnings, 0 section mismatches

--------------------------------------------------------------------------------
multi_v7_defconfig (arm, gcc-10) — FAIL, 0 errors, 0 warnings, 0 section mismatches

--------------------------------------------------------------------------------
mvebu_v5_defconfig (arm, gcc-10) — FAIL, 0 errors, 0 warnings, 0 section mismatches

--------------------------------------------------------------------------------
mvebu_v7_defconfig (arm, gcc-10) — FAIL, 0 errors, 0 warnings, 0 section mismatches

--------------------------------------------------------------------------------
mxs_defconfig (arm, gcc-10) — FAIL, 0 errors, 0 warnings, 0 section mismatches

--------------------------------------------------------------------------------
neponset_defconfig (arm, gcc-10) — FAIL, 0 errors, 0 warnings, 0 section mismatches

--------------------------------------------------------------------------------
netwinder_defconfig (arm, gcc-10) — FAIL, 0 errors, 0 warnings, 0 section mismatches

--------------------------------------------------------------------------------
netx_defconfig (arm, gcc-10) — FAIL, 0 errors, 0 warnings, 0 section mismatches

--------------------------------------------------------------------------------
nhk8815_defconfig (arm, gcc-10) — FAIL, 0 errors, 0 warnings, 0 section mismatches

--------------------------------------------------------------------------------
nuc910_defconfig (arm, gcc-10) — FAIL, 0 errors, 0 warnings, 0 section mismatches

--------------------------------------------------------------------------------
nuc950_defconfig (arm, gcc-10) — FAIL, 0 errors, 0 warnings, 0 section mismatches

--------------------------------------------------------------------------------
nuc960_defconfig (arm, gcc-10) — FAIL, 0 errors, 0 warnings, 0 section mismatches

--------------------------------------------------------------------------------
omap1_defconfig (arm, gcc-10) — FAIL, 0 errors, 1 warning, 0 section mismatches

Warnings:
drivers/gpio/gpio-omap.c:1233:34: warning: array ‘omap_gpio_match’ assumed to have one element

--------------------------------------------------------------------------------
omap2plus_defconfig (arm, gcc-10) — FAIL, 0 errors, 0 warnings, 0 section mismatches

--------------------------------------------------------------------------------
orion5x_defconfig (arm, gcc-10) — FAIL, 0 errors, 0 warnings, 0 section mismatches

--------------------------------------------------------------------------------
oxnas_v6_defconfig (arm, gcc-10) — FAIL, 0 errors, 0 warnings, 0 section mismatches

--------------------------------------------------------------------------------
palmz72_defconfig (arm, gcc-10) — FAIL, 0 errors, 0 warnings, 0 section mismatches

--------------------------------------------------------------------------------
pcm027_defconfig (arm, gcc-10) — FAIL, 0 errors, 0 warnings, 0 section mismatches

--------------------------------------------------------------------------------
pleb_defconfig (arm, gcc-10) — FAIL, 0 errors, 0 warnings, 0 section mismatches

--------------------------------------------------------------------------------
prima2_defconfig (arm, gcc-10) — FAIL, 0 errors, 0 warnings, 0 section mismatches

--------------------------------------------------------------------------------
pxa168_defconfig (arm, gcc-10) — FAIL, 0 errors, 0 warnings, 0 section mismatches

--------------------------------------------------------------------------------
pxa255-idp_defconfig (arm, gcc-10) — FAIL, 0 errors, 0 warnings, 0 section mismatches

--------------------------------------------------------------------------------
pxa3xx_defconfig (arm, gcc-10) — FAIL, 0 errors, 0 warnings, 0 section mismatches

--------------------------------------------------------------------------------
pxa910_defconfig (arm, gcc-10) — FAIL, 0 errors, 0 warnings, 0 section mismatches

--------------------------------------------------------------------------------
pxa_defconfig (arm, gcc-10) — FAIL, 0 errors, 0 warnings, 0 section mismatches

--------------------------------------------------------------------------------
qcom_defconfig (arm, gcc-10) — FAIL, 0 errors, 0 warnings, 0 section mismatches

--------------------------------------------------------------------------------
raumfeld_defconfig (arm, gcc-10) — FAIL, 0 errors, 0 warnings, 0 section mismatches

--------------------------------------------------------------------------------
realview_defconfig (arm, gcc-10) — FAIL, 0 errors, 0 warnings, 0 section mismatches

--------------------------------------------------------------------------------
rpc_defconfig (arm, gcc-10) — FAIL, 2 errors, 0 warnings, 0 section mismatches

Errors:
arm-linux-gnueabihf-gcc: error: unrecognized -march target: armv3
arm-linux-gnueabihf-gcc: error: missing argument to ‘-march=’

--------------------------------------------------------------------------------
s3c2410_defconfig (arm, gcc-10) — FAIL, 0 errors, 0 warnings, 0 section mismatches

--------------------------------------------------------------------------------
s3c6400_defconfig (arm, gcc-10) — FAIL, 0 errors, 0 warnings, 0 section mismatches

--------------------------------------------------------------------------------
s5pv210_defconfig (arm, gcc-10) — FAIL, 0 errors, 0 warnings, 0 section mismatches

--------------------------------------------------------------------------------
sama5_defconfig (arm, gcc-10) — FAIL, 0 errors, 0 warnings, 0 section mismatches

--------------------------------------------------------------------------------
shannon_defconfig (arm, gcc-10) — FAIL, 0 errors, 0 warnings, 0 section mismatches

--------------------------------------------------------------------------------
shmobile_defconfig (arm, gcc-10) — FAIL, 0 errors, 0 warnings, 0 section mismatches

--------------------------------------------------------------------------------
simpad_defconfig (arm, gcc-10) — FAIL, 0 errors, 0 warnings, 0 section mismatches

--------------------------------------------------------------------------------
socfpga_defconfig (arm, gcc-10) — FAIL, 0 errors, 0 warnings, 0 section mismatches

--------------------------------------------------------------------------------
spear13xx_defconfig (arm, gcc-10) — FAIL, 0 errors, 0 warnings, 0 section mismatches

--------------------------------------------------------------------------------
spear3xx_defconfig (arm, gcc-10) — FAIL, 0 errors, 0 warnings, 0 section mismatches

--------------------------------------------------------------------------------
spear6xx_defconfig (arm, gcc-10) — FAIL, 0 errors, 0 warnings, 0 section mismatches

--------------------------------------------------------------------------------
spitz_defconfig (arm, gcc-10) — FAIL, 0 errors, 0 warnings, 0 section mismatches

--------------------------------------------------------------------------------
stm32_defconfig (arm, gcc-10) — FAIL, 0 errors, 0 warnings, 0 section mismatches

--------------------------------------------------------------------------------
sunxi_defconfig (arm, gcc-10) — FAIL, 0 errors, 0 warnings, 0 section mismatches

--------------------------------------------------------------------------------
tango4_defconfig (arm, gcc-10) — FAIL, 0 errors, 0 warnings, 0 section mismatches

--------------------------------------------------------------------------------
tct_hammer_defconfig (arm, gcc-10) — FAIL, 0 errors, 0 warnings, 0 section mismatches

--------------------------------------------------------------------------------
tegra_defconfig (arm, gcc-10) — FAIL, 0 errors, 0 warnings, 0 section mismatches

--------------------------------------------------------------------------------
trizeps4_defconfig (arm, gcc-10) — FAIL, 0 errors, 0 warnings, 0 section mismatches

--------------------------------------------------------------------------------
u300_defconfig (arm, gcc-10) — FAIL, 0 errors, 0 warnings, 0 section mismatches

--------------------------------------------------------------------------------
u8500_defconfig (arm, gcc-10) — FAIL, 0 errors, 0 warnings, 0 section mismatches

--------------------------------------------------------------------------------
versatile_defconfig (arm, gcc-10) — FAIL, 0 errors, 0 warnings, 0 section mismatches

--------------------------------------------------------------------------------
vexpress_defconfig (arm, gcc-10) — FAIL, 0 errors, 0 warnings, 0 section mismatches

--------------------------------------------------------------------------------
vf610m4_defconfig (arm, gcc-10) — FAIL, 0 errors, 0 warnings, 0 section mismatches

--------------------------------------------------------------------------------
viper_defconfig (arm, gcc-10) — FAIL, 0 errors, 0 warnings, 0 section mismatches

--------------------------------------------------------------------------------
vt8500_v6_v7_defconfig (arm, gcc-10) — FAIL, 0 errors, 0 warnings, 0 section mismatches

--------------------------------------------------------------------------------
x86_64_defconfig (x86_64, gcc-10) — FAIL, 0 errors, 3 warnings, 0 section mismatches

Warnings:
arch/x86/entry/entry_64.S:1738: Warning: no instruction mnemonic suffix given and no register operands; using default for `sysret'
ld: arch/x86/boot/compressed/head_64.o: warning: relocation in read-only section `.head.text'
ld: warning: creating DT_TEXTREL in a PIE

--------------------------------------------------------------------------------
x86_64_defconfig+x86-chromebook (x86_64, gcc-10) — FAIL, 0 errors, 3 warnings, 0 section mismatches

Warnings:
arch/x86/entry/entry_64.S:1738: Warning: no instruction mnemonic suffix given and no register operands; using default for `sysret'
ld: arch/x86/boot/compressed/head_64.o: warning: relocation in read-only section `.head.text'
ld: warning: creating DT_TEXTREL in a PIE

--------------------------------------------------------------------------------
xcep_defconfig (arm, gcc-10) — FAIL, 0 errors, 0 warnings, 0 section mismatches

--------------------------------------------------------------------------------
zeus_defconfig (arm, gcc-10) — FAIL, 0 errors, 0 warnings, 0 section mismatches

--------------------------------------------------------------------------------
zx_defconfig (arm, gcc-10) — FAIL, 0 errors, 0 warnings, 0 section mismatches

---
For more info write to <info@...>


[isar-cip-core][PATCH v3 7/7] secureboot: Prevent getting shell on panic

Jan Kiszka
 

From: Jan Kiszka <jan.kiszka@...>

On panic, initramfs-tools opens up a shell unless panic=X is set on the
kernel command line. Fix that because such a shell could break the chain
of trust.

Signed-off-by: Jan Kiszka <jan.kiszka@...>
---
wic/qemu-amd64-efibootguard-secureboot.wks.in | 2 +-
1 file changed, 1 insertion(+), 1 deletion(-)

diff --git a/wic/qemu-amd64-efibootguard-secureboot.wks.in b/wic/qemu-amd64-efibootguard-secureboot.wks.in
index affa299..4a0e987 100644
--- a/wic/qemu-amd64-efibootguard-secureboot.wks.in
+++ b/wic/qemu-amd64-efibootguard-secureboot.wks.in
@@ -12,4 +12,4 @@ part --source rawcopy --sourceparams "file=${IMAGE_FULLNAME}.${VERITY_IMAGE_TYPE
part /home --source rootfs --rootfs-dir=${IMAGE_ROOTFS}/home --fstype=ext4 --label home --align 1024 --size 1G
part /var --source rootfs --rootfs-dir=${IMAGE_ROOTFS}/var --fstype=ext4 --label var --align 1024 --size 2G

-bootloader --ptable gpt --append="console=tty0 console=ttyS0,115200 rootwait earlyprintk"
+bootloader --ptable gpt --append="console=tty0 console=ttyS0,115200 rootwait earlyprintk panic=5"
--
2.34.1


[isar-cip-core][PATCH v3 4/7] Convert /etc overlay from systemd mount unit to initramfs hook

Jan Kiszka
 

From: Jan Kiszka <jan.kiszka@...>

As systemd is not well prepared for read-only rootfs, specifically /wrt
machine-id management and anything that depends on it, it's best to
mount the /etc overlay already in the initramfs. This implies that also
/var is mounted at that level. We still keep the fstab setup done by
wic-swu-img class so that systemd will recognize the rootfs as read-only
and not try to remount it rw which will only fail with underlying
squashfs.

Signed-off-by: Jan Kiszka <jan.kiszka@...>
---
classes/wic-swu-img.bbclass | 2 --
.../etc-overlay-fs/etc-overlay-fs_0.1.bb | 32 -----------------
.../etc-overlay-fs/files/etc-hostname.service | 14 --------
.../files/etc-sshd-regen-keys.conf | 6 ----
.../etc-overlay-fs/files/etc-sysusers.conf | 4 ---
recipes-core/etc-overlay-fs/files/etc.mount | 13 -------
recipes-core/etc-overlay-fs/files/postinst | 4 ---
.../cip-core-initramfs/cip-core-initramfs.bb | 4 +++
.../files/etc-overlay.script | 34 +++++++++++++++++++
.../initramfs-etc-overlay-hook_0.1.bb | 27 +++++++++++++++
10 files changed, 65 insertions(+), 75 deletions(-)
delete mode 100644 recipes-core/etc-overlay-fs/etc-overlay-fs_0.1.bb
delete mode 100644 recipes-core/etc-overlay-fs/files/etc-hostname.service
delete mode 100644 recipes-core/etc-overlay-fs/files/etc-sshd-regen-keys.conf
delete mode 100644 recipes-core/etc-overlay-fs/files/etc-sysusers.conf
delete mode 100644 recipes-core/etc-overlay-fs/files/etc.mount
delete mode 100755 recipes-core/etc-overlay-fs/files/postinst
create mode 100644 recipes-initramfs/initramfs-etc-overlay-hook/files/etc-overlay.script
create mode 100644 recipes-initramfs/initramfs-etc-overlay-hook/initramfs-etc-overlay-hook_0.1.bb

diff --git a/classes/wic-swu-img.bbclass b/classes/wic-swu-img.bbclass
index b93a96a..41b2164 100644
--- a/classes/wic-swu-img.bbclass
+++ b/classes/wic-swu-img.bbclass
@@ -15,8 +15,6 @@ inherit squashfs-img
inherit wic-img
inherit swupdate-img

-IMAGE_INSTALL += "etc-overlay-fs"
-
INITRAMFS_RECIPE ?= "cip-core-initramfs"
INITRD_IMAGE = "${INITRAMFS_RECIPE}-${DISTRO}-${MACHINE}.initrd.img"

diff --git a/recipes-core/etc-overlay-fs/etc-overlay-fs_0.1.bb b/recipes-core/etc-overlay-fs/etc-overlay-fs_0.1.bb
deleted file mode 100644
index 4e2b80b..0000000
--- a/recipes-core/etc-overlay-fs/etc-overlay-fs_0.1.bb
+++ /dev/null
@@ -1,32 +0,0 @@
-#
-# CIP Core, generic profile
-#
-# Copyright (c) Siemens AG, 2021
-#
-# Authors:
-# Quirin Gylstorff <quirin.gylstorff@...>
-#
-# SPDX-License-Identifier: MIT
-
-inherit dpkg-raw
-
-SRC_URI = "file://postinst \
- file://etc.mount \
- file://etc-hostname.service \
- file://etc-sshd-regen-keys.conf \
- file://etc-sysusers.conf"
-
-do_install[cleandirs]+="${D}/usr/lib/systemd/system \
- ${D}/usr/lib/systemd/system/local-fs.target.wants \
- ${D}/usr/lib/systemd/system/systemd-sysusers.service.d \
- ${D}/usr/lib/systemd/system/sshd-regen-keys.service.d \
- ${D}/var/local/etc \
- ${D}/var/local/.atomic \
- "
-do_install() {
- TARGET=${D}/usr/lib/systemd/system
- install -m 0644 ${WORKDIR}/etc.mount ${TARGET}/etc.mount
- install -m 0644 ${WORKDIR}/etc-hostname.service ${TARGET}/etc-hostname.service
- install -m 0644 ${WORKDIR}/etc-sshd-regen-keys.conf ${D}/usr/lib/systemd/system/sshd-regen-keys.service.d/etc-sshd-regen-keys.conf
- install -m 0644 ${WORKDIR}/etc-sysusers.conf ${D}/usr/lib/systemd/system/systemd-sysusers.service.d/etc-sysusers.service
-}
diff --git a/recipes-core/etc-overlay-fs/files/etc-hostname.service b/recipes-core/etc-overlay-fs/files/etc-hostname.service
deleted file mode 100644
index 2306b9f..0000000
--- a/recipes-core/etc-overlay-fs/files/etc-hostname.service
+++ /dev/null
@@ -1,14 +0,0 @@
-[Unit]
-Description=set hostname /etc overlay-aware
-Before=network-pre.target
-Wants=network-pre.target
-Requires=etc.mount
-After=etc.mount
-
-[Service]
-Type=oneshot
-RemainAfterExit=yes
-ExecStart=/bin/hostname --boot --file /etc/hostname
-
-[Install]
-WantedBy=basic.target
diff --git a/recipes-core/etc-overlay-fs/files/etc-sshd-regen-keys.conf b/recipes-core/etc-overlay-fs/files/etc-sshd-regen-keys.conf
deleted file mode 100644
index b386c12..0000000
--- a/recipes-core/etc-overlay-fs/files/etc-sshd-regen-keys.conf
+++ /dev/null
@@ -1,6 +0,0 @@
-[Unit]
-# set hostname /etc overlay-aware
-Before=network-pre.target
-Wants=network-pre.target
-Requires=etc.mount
-After=etc.mount
diff --git a/recipes-core/etc-overlay-fs/files/etc-sysusers.conf b/recipes-core/etc-overlay-fs/files/etc-sysusers.conf
deleted file mode 100644
index ad45d7f..0000000
--- a/recipes-core/etc-overlay-fs/files/etc-sysusers.conf
+++ /dev/null
@@ -1,4 +0,0 @@
-[Unit]
-# make systemd-sysusers /etc overlay aware
-Requires=etc.mount
-After=etc.mount
diff --git a/recipes-core/etc-overlay-fs/files/etc.mount b/recipes-core/etc-overlay-fs/files/etc.mount
deleted file mode 100644
index f0ae3c5..0000000
--- a/recipes-core/etc-overlay-fs/files/etc.mount
+++ /dev/null
@@ -1,13 +0,0 @@
-[Unit]
-Description=Overlay-mount /etc
-Requires=var.mount
-After=var.mount
-
-[Mount]
-What=overlay
-Where=/etc
-Type=overlay
-Options=noauto,x-systemd.automount,lowerdir=/etc,upperdir=/var/local/etc,workdir=/var/local/.atomic
-
-[Install]
-WantedBy=local-fs.target
diff --git a/recipes-core/etc-overlay-fs/files/postinst b/recipes-core/etc-overlay-fs/files/postinst
deleted file mode 100755
index e436b53..0000000
--- a/recipes-core/etc-overlay-fs/files/postinst
+++ /dev/null
@@ -1,4 +0,0 @@
-#!/bin/sh
-
-deb-systemd-helper enable etc.mount || true
-deb-systemd-helper enable etc-hostname.service || true
diff --git a/recipes-initramfs/cip-core-initramfs/cip-core-initramfs.bb b/recipes-initramfs/cip-core-initramfs/cip-core-initramfs.bb
index 649daa2..9e0ee26 100644
--- a/recipes-initramfs/cip-core-initramfs/cip-core-initramfs.bb
+++ b/recipes-initramfs/cip-core-initramfs/cip-core-initramfs.bb
@@ -10,3 +10,7 @@
#

inherit initramfs
+
+INITRAMFS_INSTALL += " \
+ initramfs-etc-overlay-hook \
+ "
diff --git a/recipes-initramfs/initramfs-etc-overlay-hook/files/etc-overlay.script b/recipes-initramfs/initramfs-etc-overlay-hook/files/etc-overlay.script
new file mode 100644
index 0000000..a9a3663
--- /dev/null
+++ b/recipes-initramfs/initramfs-etc-overlay-hook/files/etc-overlay.script
@@ -0,0 +1,34 @@
+#!/bin/sh
+#
+# CIP Core, generic profile
+#
+# Copyright (c) Siemens AG, 2022
+#
+# Authors:
+# Jan Kiszka <jan.kiszka@...>
+#
+
+PREREQ=""
+
+prereqs()
+{
+ echo "$PREREQ"
+}
+
+case $1 in
+# get pre-requisites
+prereqs)
+ prereqs
+ exit 0
+ ;;
+esac
+
+. /scripts/functions
+
+if ! mount -t $(get_fstype /dev/disk/by-label/var) /dev/disk/by-label/var ${rootmnt}/var; then
+ panic "Can't mount /var partition - overlay will not work!"
+fi
+
+mkdir -p ${rootmnt}/var/local/etc
+mkdir -p ${rootmnt}/var/local/.atomic
+mount -t overlay -o lowerdir=${rootmnt}/etc,upperdir=${rootmnt}/var/local/etc,workdir=${rootmnt}/var/local/.atomic overlay ${rootmnt}/etc
diff --git a/recipes-initramfs/initramfs-etc-overlay-hook/initramfs-etc-overlay-hook_0.1.bb b/recipes-initramfs/initramfs-etc-overlay-hook/initramfs-etc-overlay-hook_0.1.bb
new file mode 100644
index 0000000..19e9261
--- /dev/null
+++ b/recipes-initramfs/initramfs-etc-overlay-hook/initramfs-etc-overlay-hook_0.1.bb
@@ -0,0 +1,27 @@
+#
+# CIP Core, generic profile
+#
+# Copyright (c) Siemens AG, 2022
+#
+# Authors:
+# Jan Kiszka <jan.kiszka@...>
+#
+# SPDX-License-Identifier: MIT
+#
+
+inherit dpkg-raw
+
+SRC_URI += " \
+ file://etc-overlay.script \
+ "
+
+DEBIAN_DEPENDS = "initramfs-tools"
+
+do_install[cleandirs] += " \
+ ${D}/usr/share/initramfs-tools/hooks \
+ ${D}/usr/share/initramfs-tools/scripts/local-bottom"
+
+do_install() {
+ install -m 0755 "${WORKDIR}/etc-overlay.script" \
+ "${D}/usr/share/initramfs-tools/scripts/local-bottom/etc-overlay"
+}
--
2.34.1


[isar-cip-core][PATCH v3 5/7] customizations: Relocate /root under /home

Jan Kiszka
 

From: Jan Kiszka <jan.kiszka@...>

This is needed for read-only rootfs setups. We could also update the
account settings, but establishing a link comes with less surprises.

Signed-off-by: Jan Kiszka <jan.kiszka@...>
---
recipes-core/customizations/files/postinst | 4 ++++
1 file changed, 4 insertions(+)

diff --git a/recipes-core/customizations/files/postinst b/recipes-core/customizations/files/postinst
index 9b553da..6ca309a 100644
--- a/recipes-core/customizations/files/postinst
+++ b/recipes-core/customizations/files/postinst
@@ -17,3 +17,7 @@ echo "PermitRootLogin yes" >> /etc/ssh/sshd_config
HOSTNAME=demo
echo "$HOSTNAME" > /etc/hostname
echo "127.0.0.1 $HOSTNAME" >> /etc/hosts
+
+# needed for read-only rootfs with writable /home
+mv /root /home/
+ln -s /home/root /root
--
2.34.1


[isar-cip-core][PATCH v3 3/7] squashfs-img: Make sure DEPLOY_DIR_IMAGE exists

Jan Kiszka
 

From: Jan Kiszka <jan.kiszka@...>

We only get it implicitly so far, but that may always change.

Signed-off-by: Jan Kiszka <jan.kiszka@...>
---
classes/squashfs-img.bbclass | 1 +
1 file changed, 1 insertion(+)

diff --git a/classes/squashfs-img.bbclass b/classes/squashfs-img.bbclass
index 04bb67c..c22d7d6 100644
--- a/classes/squashfs-img.bbclass
+++ b/classes/squashfs-img.bbclass
@@ -29,6 +29,7 @@ python __anonymous() {
d.appendVar('SQUASHFS_CREATION_ARGS', args)
}

+do_squashfs_image[dirs] = "${DEPLOY_DIR_IMAGE}"
do_squashfs_image() {
rm -f '${DEPLOY_DIR_IMAGE}/${SQUASHFS_IMAGE_FILE}'

--
2.34.1


[isar-cip-core][PATCH v3 6/7] initramfs-verify-hook: Optimize probing of partitions

Jan Kiszka
 

From: Jan Kiszka <jan.kiszka@...>

Rather than verifying the complete device, match on the UUID embedded
into the dm-verity superblock. That is much faster and, thus, saves boot
time with large partitions and/or slow devices.

Signed-off-by: Jan Kiszka <jan.kiszka@...>
---
.../files/verity.script.tmpl | 18 +++++++++++++-----
1 file changed, 13 insertions(+), 5 deletions(-)

diff --git a/recipes-initramfs/initramfs-verity-hook/files/verity.script.tmpl b/recipes-initramfs/initramfs-verity-hook/files/verity.script.tmpl
index 7c75b5b..da37711 100644
--- a/recipes-initramfs/initramfs-verity-hook/files/verity.script.tmpl
+++ b/recipes-initramfs/initramfs-verity-hook/files/verity.script.tmpl
@@ -37,12 +37,20 @@ case "$ROOT" in
"")
# No Root device was given. Use veritysetup verify to search matching roots
partitions=$(blkid -o device)
- for part in $partitions; do
+ for part in ${partitions}; do
if [ "$(blkid -p ${part} --match-types novfat -s USAGE -o value)" = "filesystem" ]; then
- if veritysetup verify \
- "$part" "$part" "${ROOT_HASH}" \
- --hash-offset "${HASH_OFFSET}";then
- ROOT="$part"
+ verity_uuid=$(
+ veritysetup dump "${part}" --hash-offset "${HASH_OFFSET}" | \
+ while IFS=":" read key value; do
+ if [ "${key}" = "UUID" ]; then
+ # this pattern must use a real tab
+ echo "${value##* }"
+ break
+ fi
+ done
+ )
+ if [ "${UUID}" = "${verity_uuid}" ]; then
+ ROOT="${part}"
break
fi
fi
--
2.34.1


[isar-cip-core][PATCH v3 2/7] initramfs-abrootfs-hook: Convert to an initramfs-class recipe

Jan Kiszka
 

From: Jan Kiszka <jan.kiszka@...>

This unifies the pattern we generate initramfs images for non-secure and
secure SWUpdate images. Besides cleaning up the related abrootfs
selection hook, the unification is a precondition for adding another
initramfs recipe later that will be shared between both image types

The pattern followed in the new initramfs-abrootfs-hook script is now
similar to initramfs-verity-hook: a local-top hook is used, rather than
a patch for Debian's local script. This hook looks for the matching
rootfs by read-only mounting candidates, comparing the contained UUID
against the one stored in the initramfs, unmounting again, and then
setting the ROOT variable on match.

Signed-off-by: Jan Kiszka <jan.kiszka@...>
---
classes/image_uuid.bbclass | 11 ++--
classes/secure-wic-swu-img.bbclass | 4 --
classes/wic-swu-img.bbclass | 6 ++
kas/opt/ebg-secure-boot-snakeoil.yml | 1 +
kas/opt/ebg-swu.yml | 2 +-
.../cip-core-initramfs/cip-core-initramfs.bb | 4 --
.../{initramfs.lsblk.hook => abrootfs.hook} | 11 +---
.../files/abrootfs.script | 66 +++++++++++++++++++
.../files/initramfs.image_uuid.hook | 33 ----------
.../initramfs-abrootfs-hook/files/postinst | 6 --
.../initramfs-abrootfs-hook_0.1.bb | 41 +++++++-----
11 files changed, 107 insertions(+), 78 deletions(-)
rename recipes-initramfs/initramfs-abrootfs-hook/files/{initramfs.lsblk.hook => abrootfs.hook} (62%)
create mode 100644 recipes-initramfs/initramfs-abrootfs-hook/files/abrootfs.script
delete mode 100644 recipes-initramfs/initramfs-abrootfs-hook/files/initramfs.image_uuid.hook
delete mode 100644 recipes-initramfs/initramfs-abrootfs-hook/files/postinst

diff --git a/classes/image_uuid.bbclass b/classes/image_uuid.bbclass
index 2813ed9..71cc3ad 100644
--- a/classes/image_uuid.bbclass
+++ b/classes/image_uuid.bbclass
@@ -1,10 +1,11 @@
#
# CIP Core, generic profile
#
-# Copyright (c) Siemens AG, 2020
+# Copyright (c) Siemens AG, 2020-2022
#
# Authors:
# Quirin Gylstorff <quirin.gylstorff@...>
+# Jan Kiszka <jan.kiszka@...>
#
# SPDX-License-Identifier: MIT
#
@@ -21,13 +22,13 @@ IMAGE_UUID ?= "${@generate_image_uuid(d)}"

do_generate_image_uuid[vardeps] += "IMAGE_UUID"
do_generate_image_uuid[depends] = "buildchroot-target:do_build"
+do_generate_image_uuid[dirs] = "${DEPLOY_DIR_IMAGE}"
do_generate_image_uuid() {
sudo sed -i '/^IMAGE_UUID=.*/d' '${IMAGE_ROOTFS}/etc/os-release'
echo "IMAGE_UUID=\"${IMAGE_UUID}\"" | \
sudo tee -a '${IMAGE_ROOTFS}/etc/os-release'
- image_do_mounts

- # update initramfs to add uuid
- sudo chroot '${IMAGE_ROOTFS}' update-initramfs -u
+ echo "TARGET_IMAGE_UUID=\"${IMAGE_UUID}\"" \
+ > "${DEPLOY_DIR_IMAGE}/${IMAGE_FULLNAME}.uuid.env"
}
-addtask generate_image_uuid before do_copy_boot_files after do_rootfs_install
+addtask generate_image_uuid before do_image after do_rootfs
diff --git a/classes/secure-wic-swu-img.bbclass b/classes/secure-wic-swu-img.bbclass
index 85342fe..5e8e48a 100644
--- a/classes/secure-wic-swu-img.bbclass
+++ b/classes/secure-wic-swu-img.bbclass
@@ -9,10 +9,6 @@
# SPDX-License-Identifier: MIT
#

-INITRAMFS_RECIPE ?= "cip-core-initramfs"
-do_wic_image[depends] += "${INITRAMFS_RECIPE}:do_build"
-INITRD_IMAGE = "${INITRAMFS_RECIPE}-${DISTRO}-${MACHINE}.initrd.img"
-
inherit verity-img
inherit wic-swu-img

diff --git a/classes/wic-swu-img.bbclass b/classes/wic-swu-img.bbclass
index 231b249..b93a96a 100644
--- a/classes/wic-swu-img.bbclass
+++ b/classes/wic-swu-img.bbclass
@@ -16,6 +16,12 @@ inherit wic-img
inherit swupdate-img

IMAGE_INSTALL += "etc-overlay-fs"
+
+INITRAMFS_RECIPE ?= "cip-core-initramfs"
+INITRD_IMAGE = "${INITRAMFS_RECIPE}-${DISTRO}-${MACHINE}.initrd.img"
+
+do_wic_image[depends] += "${INITRAMFS_RECIPE}:do_build"
+
IMAGE_INSTALL += "home-fs"
IMAGE_INSTALL += "tmp-fs"

diff --git a/kas/opt/ebg-secure-boot-snakeoil.yml b/kas/opt/ebg-secure-boot-snakeoil.yml
index 14a5d6a..b329f41 100644
--- a/kas/opt/ebg-secure-boot-snakeoil.yml
+++ b/kas/opt/ebg-secure-boot-snakeoil.yml
@@ -25,6 +25,7 @@ local_conf_header:
secure-boot-image: |
IMAGE_FSTYPES = "secure-wic-swu-img"
WKS_FILE = "${MACHINE}-efibootguard-secureboot.wks.in"
+ INITRAMFS_INSTALL_append = " initramfs-verity-hook"

secure-boot: |
# Add snakeoil binaries for qemu
diff --git a/kas/opt/ebg-swu.yml b/kas/opt/ebg-swu.yml
index d811929..5e4e771 100644
--- a/kas/opt/ebg-swu.yml
+++ b/kas/opt/ebg-swu.yml
@@ -17,7 +17,7 @@ header:

local_conf_header:
initramfs: |
- IMAGE_INSTALL += "initramfs-abrootfs-hook"
+ INITRAMFS_INSTALL_append = " initramfs-abrootfs-hook"

image-option-uuid: |
CIP_IMAGE_OPTIONS_append = " image-uuid.inc"
diff --git a/recipes-initramfs/cip-core-initramfs/cip-core-initramfs.bb b/recipes-initramfs/cip-core-initramfs/cip-core-initramfs.bb
index 825fb9f..649daa2 100644
--- a/recipes-initramfs/cip-core-initramfs/cip-core-initramfs.bb
+++ b/recipes-initramfs/cip-core-initramfs/cip-core-initramfs.bb
@@ -10,7 +10,3 @@
#

inherit initramfs
-
-INITRAMFS_INSTALL += " \
- initramfs-verity-hook \
- "
diff --git a/recipes-initramfs/initramfs-abrootfs-hook/files/initramfs.lsblk.hook b/recipes-initramfs/initramfs-abrootfs-hook/files/abrootfs.hook
similarity index 62%
rename from recipes-initramfs/initramfs-abrootfs-hook/files/initramfs.lsblk.hook
rename to recipes-initramfs/initramfs-abrootfs-hook/files/abrootfs.hook
index cf32404..bacbc2e 100644
--- a/recipes-initramfs/initramfs-abrootfs-hook/files/initramfs.lsblk.hook
+++ b/recipes-initramfs/initramfs-abrootfs-hook/files/abrootfs.hook
@@ -1,9 +1,8 @@
-# This software is a part of ISAR.
-# Copyright (C) Siemens AG, 2020
+#!/bin/sh
+# Copyright (C) Siemens AG, 2020-2022
#
# SPDX-License-Identifier: MIT

-#!/bin/sh
PREREQ=""

prereqs()
@@ -21,9 +20,5 @@ esac
. /usr/share/initramfs-tools/scripts/functions
. /usr/share/initramfs-tools/hook-functions

-if [ ! -x /usr/bin/lsblk ]; then
- echo "Warning: couldn't find /usr/bin/lsblk!"
- exit 0
-fi
-
copy_exec /usr/bin/lsblk
+copy_file library /usr/share/abrootfs/image-uuid.env /usr/share/abrootfs/image-uuid.env
diff --git a/recipes-initramfs/initramfs-abrootfs-hook/files/abrootfs.script b/recipes-initramfs/initramfs-abrootfs-hook/files/abrootfs.script
new file mode 100644
index 0000000..b61fe30
--- /dev/null
+++ b/recipes-initramfs/initramfs-abrootfs-hook/files/abrootfs.script
@@ -0,0 +1,66 @@
+#!/bin/sh
+#
+# CIP Core, generic profile
+#
+# Copyright (c) Siemens AG, 2020-2022
+#
+# Authors:
+# Jan Kiszka <jan.kiszka@...>
+#
+# SPDX-License-Identifier: MIT
+
+prereqs()
+{
+ # Make sure that this script is run last in local-top
+ local req
+ for req in "${0%/*}"/*; do
+ script="${req##*/}"
+ if [ "$script" != "${0##*/}" ]; then
+ printf '%s\n' "$script"
+ fi
+ done
+}
+case $1 in
+prereqs)
+ prereqs
+ exit 0
+ ;;
+esac
+
+. /scripts/functions
+. /usr/share/abrootfs/image-uuid.env
+
+# Even if this script fails horribly, make sure there won't be a chance the
+# current $ROOT will be attempted. As this device most likely contains a
+# perfectly valid filesystem, it would be mounted successfully, leading to a
+# broken boot.
+echo "ROOT=/dev/null" >/conf/param.conf
+wait_for_udev 10
+case "$ROOT" in
+ PART*)
+ # root was given as PARTUUID= or PARTLABEL=. Use blkid to find the matching
+ # partition
+ ROOT=$(blkid --list-one --output device --match-token "$ROOT")
+ ;;
+ "")
+ # No Root device was given. Use find the matching IMAGE_UUID
+ partitions=$(blkid -o device)
+ for part in $partitions; do
+ if [ "$(blkid -p ${part} --match-types novfat -s USAGE -o value)" = "filesystem" ]; then
+ mount -o ro -t $(get_fstype $part) $part ${rootmnt}
+ . ${rootmnt}/etc/os-release
+ umount ${rootmnt}
+ if [ "${IMAGE_UUID}" = "${TARGET_IMAGE_UUID}" ]; then
+ ROOT="$part"
+ break
+ fi
+ fi
+ done
+ ;;
+esac
+
+if [ -z "${ROOT}" ]; then
+ panic "Can't find the root device with matching UUID!"
+fi
+
+echo "ROOT=${ROOT}" >/conf/param.conf
diff --git a/recipes-initramfs/initramfs-abrootfs-hook/files/initramfs.image_uuid.hook b/recipes-initramfs/initramfs-abrootfs-hook/files/initramfs.image_uuid.hook
deleted file mode 100644
index 910ce84..0000000
--- a/recipes-initramfs/initramfs-abrootfs-hook/files/initramfs.image_uuid.hook
+++ /dev/null
@@ -1,33 +0,0 @@
-# This software is a part of ISAR.
-# Copyright (C) Siemens AG, 2020
-#
-# SPDX-License-Identifier: MIT
-
-#!/bin/sh
-set -x
-PREREQ=""
-
-prereqs()
-{
- echo "$PREREQ"
-}
-
-case $1 in
-prereqs)
- prereqs
- exit 0
- ;;
-esac
-
-. /usr/share/initramfs-tools/scripts/functions
-. /usr/share/initramfs-tools/hook-functions
-
-if [ ! -e /etc/os-release ]; then
- echo "Warning: couldn't find /etc/os-release!"
- exit 0
-fi
-
-IMAGE_UUID=$(sed -n 's/^IMAGE_UUID="\(.*\)"/\1/p' /etc/os-release)
-echo "${IMAGE_UUID}" > "${DESTDIR}/conf/image_uuid"
-
-exit 0
\ No newline at end of file
diff --git a/recipes-initramfs/initramfs-abrootfs-hook/files/postinst b/recipes-initramfs/initramfs-abrootfs-hook/files/postinst
deleted file mode 100644
index e065524..0000000
--- a/recipes-initramfs/initramfs-abrootfs-hook/files/postinst
+++ /dev/null
@@ -1,6 +0,0 @@
-#!/bin/sh
-
-# patch local script
-patch -s -p0 /usr/share/initramfs-tools/scripts/local /usr/share/initramfs-abrootfs-hook/debian-local.patch
-
-update-initramfs -v -u
diff --git a/recipes-initramfs/initramfs-abrootfs-hook/initramfs-abrootfs-hook_0.1.bb b/recipes-initramfs/initramfs-abrootfs-hook/initramfs-abrootfs-hook_0.1.bb
index 9c1776a..1693e85 100644
--- a/recipes-initramfs/initramfs-abrootfs-hook/initramfs-abrootfs-hook_0.1.bb
+++ b/recipes-initramfs/initramfs-abrootfs-hook/initramfs-abrootfs-hook_0.1.bb
@@ -1,33 +1,40 @@
#
# CIP Core, generic profile
#
-# Copyright (c) Siemens AG, 2020
+# Copyright (c) Siemens AG, 2020-2022
#
# Authors:
# Quirin Gylstorff <quirin.gylstorff@...>
+# Jan Kiszka <jan.kiszka@...>
#
# SPDX-License-Identifier: MIT


inherit dpkg-raw

-DEBIAN_DEPENDS += ", busybox, patch"
+DEBIAN_DEPENDS = "initramfs-tools"

-SRC_URI += "file://postinst \
- file://initramfs.lsblk.hook \
- file://initramfs.image_uuid.hook \
- file://debian-local-patch"
+SRC_URI += "file://abrootfs.hook \
+ file://abrootfs.script"
+
+ABROOTFS_IMAGE_RECIPE ?= "cip-core-image"
+
+IMAGE_UUID_ENV_FILE = "${DEPLOY_DIR_IMAGE}/${ABROOTFS_IMAGE_RECIPE}-${DISTRO}-${MACHINE}.uuid.env"
+
+do_install[depends] += "${ABROOTFS_IMAGE_RECIPE}:do_generate_image_uuid"
+do_install[cleandirs] += " \
+ ${D}/usr/share/initramfs-tools/hooks \
+ ${D}/usr/share/abrootfs \
+ ${D}/usr/share/initramfs-tools/scripts/local-top"

do_install() {
- # add patch for local to /usr/share/initramfs-abrootfs-hook
- TARGET=${D}/usr/share/initramfs-abrootfs-hook
- install -m 0755 -d ${TARGET}
- install -m 0644 ${WORKDIR}/debian-local-patch ${TARGET}/debian-local.patch
-
- # add hooks for secure boot
- HOOKS=${D}/etc/initramfs-tools/hooks
- install -m 0755 -d ${HOOKS}
- install -m 0740 ${WORKDIR}/initramfs.lsblk.hook ${HOOKS}/lsblk.hook
- install -m 0740 ${WORKDIR}/initramfs.image_uuid.hook ${HOOKS}/image_uuid.hook
+ if [ -f "${IMAGE_UUID_ENV_FILE}" ]; then
+ install -m 0600 "${IMAGE_UUID_ENV_FILE}" "${D}/usr/share/abrootfs/image-uuid.env"
+ else
+ bberror "Did not find ${IMAGE_UUID_ENV_FILE}. initramfs will not be build correctly!"
+ fi
+ install -m 0755 "${WORKDIR}/abrootfs.script" \
+ "${D}/usr/share/initramfs-tools/scripts/local-top/abrootfs"
+ install -m 0755 "${WORKDIR}/abrootfs.hook" \
+ "${D}/usr/share/initramfs-tools/hooks/abrootfs"
}
-addtask do_install after do_transform_template
--
2.34.1


[isar-cip-core][PATCH v3 0/7] Fix read-only rootfs setup /wrt etc overlay - and more

Jan Kiszka
 

Changes in v3:
- create DEPLOY_DIR_IMAGE paths when needed in image-uuid and squashfs
classes
- drop not longer needed image_do_mounts from image-uuid

Changes in v2:
- panic on /var mounting failure during overlay setup
- panic-reboot on initramfs failures in secure mode
- /root persistence
- faster rootfs selection under dm-verity

This addresses the problem of current read-only rootfs + /etc overlay as
used for the SWUpdate setups.

Due to ordering issues in systemd startup between machine-id handling
vs. making /etc writable via the overlay, various things are broken down
the line, e.g. journal reporting. Reading [1], it appeared to be best to
move the overlay mounting into the initramfs. And this implementation
proves this to be right: simpler and working smoothly.

As a by-product, this also unifies the initramfs-abrootfs-hook, and
makes it simpler as well.

Furthermore, this plugs a hole in the secure boot process if the
initramfs fails (we got a shell then), makes /root persistent and
optimizes the rootfs selection via dm-verity.

Jan

[1] https://www.spinics.net/lists/systemd-devel/msg05670.html

Jan Kiszka (7):
wic: Align kernel command line of qemu-amd64-efibootguard*
initramfs-abrootfs-hook: Convert to an initramfs-class recipe
squashfs-img: Make sure DEPLOY_DIR_IMAGE exists
Convert /etc overlay from systemd mount unit to initramfs hook
customizations: Relocate /root under /home
initramfs-verify-hook: Optimize probing of partitions
secureboot: Prevent getting shell on panic

classes/image_uuid.bbclass | 11 +++--
classes/secure-wic-swu-img.bbclass | 4 --
classes/squashfs-img.bbclass | 1 +
classes/wic-swu-img.bbclass | 6 ++-
kas/opt/ebg-secure-boot-snakeoil.yml | 1 +
kas/opt/ebg-swu.yml | 2 +-
recipes-core/customizations/files/postinst | 4 ++
.../etc-overlay-fs/etc-overlay-fs_0.1.bb | 32 -------------
.../etc-overlay-fs/files/etc-hostname.service | 14 ------
.../files/etc-sshd-regen-keys.conf | 6 ---
.../etc-overlay-fs/files/etc-sysusers.conf | 4 --
recipes-core/etc-overlay-fs/files/etc.mount | 13 ------
recipes-core/etc-overlay-fs/files/postinst | 4 --
.../cip-core-initramfs/cip-core-initramfs.bb | 2 +-
.../{initramfs.lsblk.hook => abrootfs.hook} | 11 ++---
.../files/abrootfs.script} | 46 +++++++++----------
.../files/initramfs.image_uuid.hook | 33 -------------
.../initramfs-abrootfs-hook/files/postinst | 6 ---
.../initramfs-abrootfs-hook_0.1.bb | 41 ++++++++++-------
.../files/etc-overlay.script | 34 ++++++++++++++
.../initramfs-etc-overlay-hook_0.1.bb | 27 +++++++++++
.../files/verity.script.tmpl | 18 ++++++--
wic/qemu-amd64-efibootguard-secureboot.wks.in | 2 +-
23 files changed, 142 insertions(+), 180 deletions(-)
delete mode 100644 recipes-core/etc-overlay-fs/etc-overlay-fs_0.1.bb
delete mode 100644 recipes-core/etc-overlay-fs/files/etc-hostname.service
delete mode 100644 recipes-core/etc-overlay-fs/files/etc-sshd-regen-keys.conf
delete mode 100644 recipes-core/etc-overlay-fs/files/etc-sysusers.conf
delete mode 100644 recipes-core/etc-overlay-fs/files/etc.mount
delete mode 100755 recipes-core/etc-overlay-fs/files/postinst
rename recipes-initramfs/initramfs-abrootfs-hook/files/{initramfs.lsblk.hook => abrootfs.hook} (62%)
copy recipes-initramfs/{initramfs-verity-hook/files/verity.script.tmpl => initramfs-abrootfs-hook/files/abrootfs.script} (53%)
delete mode 100644 recipes-initramfs/initramfs-abrootfs-hook/files/initramfs.image_uuid.hook
delete mode 100644 recipes-initramfs/initramfs-abrootfs-hook/files/postinst
create mode 100644 recipes-initramfs/initramfs-etc-overlay-hook/files/etc-overlay.script
create mode 100644 recipes-initramfs/initramfs-etc-overlay-hook/initramfs-etc-overlay-hook_0.1.bb

--
2.34.1


[isar-cip-core][PATCH v3 1/7] wic: Align kernel command line of qemu-amd64-efibootguard*

Jan Kiszka
 

From: Jan Kiszka <jan.kiszka@...>

"rw" is meaningless and misleading for the read-only rootfs we have.

Signed-off-by: Jan Kiszka <jan.kiszka@...>
---
wic/qemu-amd64-efibootguard-secureboot.wks.in | 2 +-
1 file changed, 1 insertion(+), 1 deletion(-)

diff --git a/wic/qemu-amd64-efibootguard-secureboot.wks.in b/wic/qemu-amd64-efibootguard-secureboot.wks.in
index 54f7143..affa299 100644
--- a/wic/qemu-amd64-efibootguard-secureboot.wks.in
+++ b/wic/qemu-amd64-efibootguard-secureboot.wks.in
@@ -12,4 +12,4 @@ part --source rawcopy --sourceparams "file=${IMAGE_FULLNAME}.${VERITY_IMAGE_TYPE
part /home --source rootfs --rootfs-dir=${IMAGE_ROOTFS}/home --fstype=ext4 --label home --align 1024 --size 1G
part /var --source rootfs --rootfs-dir=${IMAGE_ROOTFS}/var --fstype=ext4 --label var --align 1024 --size 2G

-bootloader --ptable gpt --append="console=tty0 console=ttyS0,115200 rootwait rw earlyprintk"
+bootloader --ptable gpt --append="console=tty0 console=ttyS0,115200 rootwait earlyprintk"
--
2.34.1


[ANNOUNCE] Release v4.19.239-cip72 and v5.10.112-cip6

Nobuhiro Iwamatsu
 

Hi all,

CIP kernel team has released Linux kernel v4.19.239-cip72 and v5.10.112-cip6.
The linux-4.19.y-cip tree has been updated base version from v4.19.237 to v4.19.239.
The linux-5.10.y-cip tree has been updated base version from v5.10.109 to v5.10.112,
and sound driver patch for RZ/G2L has been added.

You can get this release via the git tree at:

v5.10.112-cip6:
repository:
https://git.kernel.org/pub/scm/linux/kernel/git/cip/linux-cip.git
branch:
linux-5.10.y-cip
commit hash:
c8f6747dcd02a8f87731c324f4bc37bd120a8982
Fixed CVEs:
CVE-2022-28390: can: ems_usb: ems_usb_start_xmit(): fix double dev_kfree_skb() in error path
CVE-2022-28389: can: mcba_usb: mcba_usb_start_xmit(): fix double dev_kfree_skb in error path
CVE-2022-0168: cifs: fix NULL ptr dereference in smb2_ioctl_query_info()
CVE-2022-1158: KVM: x86/mmu: do compare-and-exchange of gPTE via the user address
CVE-2022-1353: af_key: add __GFP_ZERO flag for compose_sadb_supported in function pfkey_register
CVE-2022-1198: drivers: hamradio: 6pack: fix UAF bug caused by mod_timer()
CVE-2021-4197: cgroup: Use open-time credentials for process migraton perm checks
CVE-2022-1204: ax25: Fix refcount leaks caused by ax25_cb_del()
CVE-2022-1205: ax25: Fix NULL pointer dereferences in ax25 timers
added commits:
CIP: Bump version suffix to -cip6 after merge from stable
arm64: defconfig: Enable SND_SOC_WM8978
arm64: defconfig: Enable SOUND_SOC_RZ
arm64: dts: renesas: rzg2l-smarc: Add Mic routing
arm64: dts: renesas: rzg2l-smarc: Enable audio
arm64: dts: renesas: rzg2l-smarc: Add WM8978 sound codec
arm64: dts: renesas: r9a07g044: Add DMA support to SSI
arm64: dts: renesas: r9a07g044: Add SSI support
arm64: dts: renesas: r9a07g044: Add external audio clock nodes
ASoC: sh: rz-ssi: Remove duplicate macros
ASoC: sh: rz-ssi: Add rz_ssi_set_substream() helper function
ASoC: sh: rz-ssi: Use a do-while loop in rz_ssi_pio_recv()
ASoC: sh: rz-ssi: Make return type of rz_ssi_stream_is_valid() to bool
ASoC: sh: rz-ssi: Drop ssi parameter from rz_ssi_stream_init()
ASoC: sh: rz-ssi: Make the data structures available before registering the handlers
ASoC: sh: rz-ssi: Drop calling rz_ssi_pio_recv() recursively
ASoC: sh: rz-ssi: Check return value of pm_runtime_resume_and_get()
ASoC: sh: rz-ssi: Improve error handling in rz_ssi_dma_request function
ASoC: sh: rz-ssi: Fix wrong operator used issue
ASoC: sh: rz-ssi: Fix dereference of noderef expression warning
ASoC: sh: rz-ssi: Add SSI DMAC support
ASoC: sh: Add RZ/G2L SSIF-2 driver
ASoC: dt-bindings: renesas,rz-ssi: Update slave dma channel configuration parameter
ASoC: dt-bindings: sound: renesas,rz-ssi: Document DMA support
ASoC: dt-bindings: Document RZ/G2L bindings

v4.19.239-cip72:
repository:
https://git.kernel.org/pub/scm/linux/kernel/git/cip/linux-cip.git
branch:
linux-4.19.y-cip
commit hash:
fdf770b2db8080de95dcf74cc7547319034a4a56
Fixed CVEs:
CVE-2022-28390: can: ems_usb: ems_usb_start_xmit(): fix double dev_kfree_skb() in error path
CVE-2022-28389: can: mcba_usb: mcba_usb_start_xmit(): fix double dev_kfree_skb in error path
CVE-2022-1353: af_key: add __GFP_ZERO flag for compose_sadb_supported in function pfkey_register
CVE-2022-1198: drivers: hamradio: 6pack: fix UAF bug caused by mod_timer()
CVE-2021-4197: cgroup: Use open-time credentials for process migraton perm checks
CVE-2022-1011: fuse: fix pipe buffer lifetime for direct_io
added commits:
CIP: Bump version suffix to -cip72 after merge from stable

Best regards,
Nobuhiro


Re: [PATCH 5.10.y-cip 00/24] Add sound support to Renesas RZ/G2L SoC

Nobuhiro Iwamatsu
 

Hi Prabhakar,

Looks good to me.
I am testing on
https://jpn01.safelinks.protection.outlook.com/?url=https%3A%2F%2Fgitl
ab.c
om%2Fcip-project%2Fcip-kernel%2Flinux-cip%2F-
%2Fpipelines%2F521117833&amp;data=05%7C01%7Cprabhakar.mahadev-
lad.rj%40bp.renesas.com%7Cb4ee1a6285394d44892508da2346a0d8%7C53d8
2571d
a194
7e49cb4625a166a4a2a%7C0%7C0%7C637861083493803991%7CUnknown%7C
TWFpbGZsb
3d8e
yJWIjoiMC4wLjAwMDAiLCJQIjoiV2luMzIiLCJBTiI6Ik1haWwiLCJXVCI6Mn0%3
D%7C30
00%7
C%7C%7C&amp;sdata=hAsfuV2fT66SH6cFpfI8cuUQMO8QVozG7EVlYAhMR
u8%3D&amp;r
eser
ved=0.
I can merge it if there are no other comments and test is successful.
Looks like there is one test failure, pretty sure its unrelated to the changes. Can
you please retrigger the failed test so that this patch set gets merged in.
Yeah, I already retrigger it. And I planning to release a kernel including these patches.
Sorry for the late schedule.

Best regards,
Nobuhiro


Re: [PATCH 5.10.y-cip 00/24] Add sound support to Renesas RZ/G2L SoC

Lad Prabhakar
 

Hi Nobuhiro-san,

-----Original Message-----
From: nobuhiro1.iwamatsu@... <nobuhiro1.iwamatsu@...>
Sent: 21 April 2022 04:26
To: Prabhakar Mahadev Lad <prabhakar.mahadev-lad.rj@...>; cip-
dev@...; pavel@...
Cc: Biju Das <biju.das.jz@...>
Subject: RE: [PATCH 5.10.y-cip 00/24] Add sound support to Renesas RZ/G2L
SoC

Hi all,

-----Original Message-----
From: Lad Prabhakar <prabhakar.mahadev-lad.rj@...>
Sent: Thursday, April 21, 2022 6:34 AM
To: cip-dev@...; iwamatsu nobuhiro(岩松 信洋 □SWC◯

CT) <nobuhiro1.iwamatsu@...>; Pavel Machek <pavel@...>
Cc: Biju Das <biju.das.jz@...>
Subject: [PATCH 5.10.y-cip 00/24] Add sound support to Renesas RZ/G2L
SoC

Hi All,

This patch series adds sound support to Renesas RZ/G2L SoC and enables
SSI and codec on Renesas RZ/G2L SMARC EVK.

All the patches have been cherry picked from v5.18-rc3.

Sound support patches were already sent earlier as part of bulk series
[0], but due to some review comments the patches were rejected, now
that the driver is fixed upstream, re-sending the series with all the
fixes.

[0]
https://jpn01.safelinks.protection.outlook.com/?url=https%3A%2F%2Fpatc
hwork.kernel.org%2Fproject%2Fcip-dev%2Fcover%2F&amp;data=05%7C01%7Cpra
bhakar.mahadev-lad.rj%40bp.renesas.com%7Cb4ee1a6285394d44892508da2346a
0d8%7C53d82571da1947e49cb4625a166a4a2a%7C0%7C0%7C637861083493803991%7C
Unknown%7CTWFpbGZsb3d8eyJWIjoiMC4wLjAwMDAiLCJQIjoiV2luMzIiLCJBTiI6Ik1h
aWwiLCJXVCI6Mn0%3D%7C3000%7C%7C%7C&amp;sdata=tb4S87F0MCvezWQFTwYhtfUNP
ErdCwkz9JsE%2FWJK9qQ%3D&amp;reserved=0
20211229101530.22783-1-prabhakar.mahadev-lad.rj@.../
Looks good to me.
I am testing on
https://jpn01.safelinks.protection.outlook.com/?url=https%3A%2F%2Fgitlab.c
om%2Fcip-project%2Fcip-kernel%2Flinux-cip%2F-
%2Fpipelines%2F521117833&amp;data=05%7C01%7Cprabhakar.mahadev-
lad.rj%40bp.renesas.com%7Cb4ee1a6285394d44892508da2346a0d8%7C53d82571da194
7e49cb4625a166a4a2a%7C0%7C0%7C637861083493803991%7CUnknown%7CTWFpbGZsb3d8e
yJWIjoiMC4wLjAwMDAiLCJQIjoiV2luMzIiLCJBTiI6Ik1haWwiLCJXVCI6Mn0%3D%7C3000%7
C%7C%7C&amp;sdata=hAsfuV2fT66SH6cFpfI8cuUQMO8QVozG7EVlYAhMRu8%3D&amp;reser
ved=0.
I can merge it if there are no other comments and test is successful.
Looks like there is one test failure, pretty sure its unrelated to the changes. Can you please retrigger the failed test so that this patch set gets merged in.

Cheers,
Prabhakar


Cheers,
Prabhakar
Best regards,
Nobuhiro

Biju Das (16):
ASoC: dt-bindings: Document RZ/G2L bindings
ASoC: dt-bindings: sound: renesas,rz-ssi: Document DMA support
ASoC: dt-bindings: renesas,rz-ssi: Update slave dma channel
configuration parameter
ASoC: sh: Add RZ/G2L SSIF-2 driver
ASoC: sh: rz-ssi: Add SSI DMAC support
ASoC: sh: rz-ssi: Fix dereference of noderef expression warning
ASoC: sh: rz-ssi: Fix wrong operator used issue
ASoC: sh: rz-ssi: Improve error handling in rz_ssi_dma_request
function
arm64: dts: renesas: r9a07g044: Add external audio clock nodes
arm64: dts: renesas: r9a07g044: Add SSI support
arm64: dts: renesas: r9a07g044: Add DMA support to SSI
arm64: dts: renesas: rzg2l-smarc: Add WM8978 sound codec
arm64: dts: renesas: rzg2l-smarc: Enable audio
arm64: dts: renesas: rzg2l-smarc: Add Mic routing
arm64: defconfig: Enable SOUND_SOC_RZ
arm64: defconfig: Enable SND_SOC_WM8978

Heiner Kallweit (1):
ASoC: sh: rz-ssi: Check return value of pm_runtime_resume_and_get()

Lad Prabhakar (7):
ASoC: sh: rz-ssi: Drop calling rz_ssi_pio_recv() recursively
ASoC: sh: rz-ssi: Make the data structures available before
registering the handlers
ASoC: sh: rz-ssi: Drop ssi parameter from rz_ssi_stream_init()
ASoC: sh: rz-ssi: Make return type of rz_ssi_stream_is_valid() to bool
ASoC: sh: rz-ssi: Use a do-while loop in rz_ssi_pio_recv()
ASoC: sh: rz-ssi: Add rz_ssi_set_substream() helper function
ASoC: sh: rz-ssi: Remove duplicate macros

.../bindings/sound/renesas,rz-ssi.yaml | 118 ++
arch/arm64/boot/dts/renesas/r9a07g044.dtsi | 98 ++
arch/arm64/boot/dts/renesas/rzg2l-smarc.dtsi | 79 ++
arch/arm64/configs/defconfig | 2 +
sound/soc/sh/Kconfig | 6 +
sound/soc/sh/Makefile | 4 +
sound/soc/sh/rz-ssi.c | 1078
+++++++++++++++++
7 files changed, 1385 insertions(+)
create mode 100644
Documentation/devicetree/bindings/sound/renesas,rz-ssi.yaml
create mode 100644 sound/soc/sh/rz-ssi.c

--
2.17.1


Re: [isar-cip-core][PATCH v2 2/6] initramfs-abrootfs-hook: Convert to an initramfs-class recipe

Jan Kiszka
 

On 22.04.22 09:47, Jan Kiszka wrote:
From: Jan Kiszka <jan.kiszka@...>

This unifies the pattern we generate initramfs images for non-secure and
secure SWUpdate images. Besides cleaning up the related abrootfs
selection hook, the unification is a precondition for adding another
initramfs recipe later that will be shared between both image types

The pattern followed in the new initramfs-abrootfs-hook script is now
similar to initramfs-verity-hook: a local-top hook is used, rather than
a patch for Debian's local script. This hook looks for the matching
rootfs by read-only mounting candidates, comparing the contained UUID
against the one stored in the initramfs, unmounting again, and then
setting the ROOT variable on match.

Signed-off-by: Jan Kiszka <jan.kiszka@...>
---
classes/image_uuid.bbclass | 6 +-
classes/secure-wic-swu-img.bbclass | 4 --
classes/wic-swu-img.bbclass | 6 ++
kas/opt/ebg-secure-boot-snakeoil.yml | 1 +
kas/opt/ebg-swu.yml | 2 +-
.../cip-core-initramfs/cip-core-initramfs.bb | 4 --
.../{initramfs.lsblk.hook => abrootfs.hook} | 11 +---
.../files/abrootfs.script | 66 +++++++++++++++++++
.../files/initramfs.image_uuid.hook | 33 ----------
.../initramfs-abrootfs-hook/files/postinst | 6 --
.../initramfs-abrootfs-hook_0.1.bb | 41 +++++++-----
11 files changed, 104 insertions(+), 76 deletions(-)
rename recipes-initramfs/initramfs-abrootfs-hook/files/{initramfs.lsblk.hook => abrootfs.hook} (62%)
create mode 100644 recipes-initramfs/initramfs-abrootfs-hook/files/abrootfs.script
delete mode 100644 recipes-initramfs/initramfs-abrootfs-hook/files/initramfs.image_uuid.hook
delete mode 100644 recipes-initramfs/initramfs-abrootfs-hook/files/postinst

diff --git a/classes/image_uuid.bbclass b/classes/image_uuid.bbclass
index 2813ed9..7294eb3 100644
--- a/classes/image_uuid.bbclass
+++ b/classes/image_uuid.bbclass
@@ -1,10 +1,11 @@
#
# CIP Core, generic profile
#
-# Copyright (c) Siemens AG, 2020
+# Copyright (c) Siemens AG, 2020-2022
#
# Authors:
# Quirin Gylstorff <quirin.gylstorff@...>
+# Jan Kiszka <jan.kiszka@...>
#
# SPDX-License-Identifier: MIT
#
@@ -27,7 +28,6 @@ do_generate_image_uuid() {
sudo tee -a '${IMAGE_ROOTFS}/etc/os-release'
image_do_mounts
This line is obsolete.


- # update initramfs to add uuid
- sudo chroot '${IMAGE_ROOTFS}' update-initramfs -u
+ echo "TARGET_IMAGE_UUID=\"${IMAGE_UUID}\"" > "${DEPLOY_DIR_IMAGE}/${IMAGE_FULLNAME}.uuid.env"
}
addtask generate_image_uuid before do_copy_boot_files after do_rootfs_install
This one as well, plus it broke when no one else used DEPLOY_DIR_IMAGE
before. v3 will follow, fixing a similar issue in verity-img.

Jan

--
Siemens AG, Technology
Competence Center Embedded Linux

1441 - 1460 of 9648