Date   

[PATCH 5.10.y-cip 04/39] mmc: renesas_sdhi: clear TAPEN when resetting, too

Lad Prabhakar
 

From: Wolfram Sang <wsa+renesas@...>

commit 183edc060e6969a3afe83f663b534f6324fb7e3a upstream.

We want to clear TAPEN in a software reset, too, to have a completely
known state. Especially when we doing the initial reset during boot to
clear previous firmware states.

Signed-off-by: Wolfram Sang <wsa+renesas@...>
Tested-by: Niklas Söderlund <niklas.soderlund+renesas@...>
Reviewed-by: Yoshihiro Shimoda <yoshihiro.shimoda.uh@...>
Tested-by: Yoshihiro Shimoda <yoshihiro.shimoda.uh@...>
Link: https://lore.kernel.org/r/20201110162151.37622-2-wsa+renesas@sang-engineering.com
Signed-off-by: Ulf Hansson <ulf.hansson@...>
Signed-off-by: Lad Prabhakar <prabhakar.mahadev-lad.rj@...>
---
drivers/mmc/host/renesas_sdhi_core.c | 2 +-
1 file changed, 1 insertion(+), 1 deletion(-)

diff --git a/drivers/mmc/host/renesas_sdhi_core.c b/drivers/mmc/host/renesas_sdhi_core.c
index e264ba2bff29..da8c9cf5a942 100644
--- a/drivers/mmc/host/renesas_sdhi_core.c
+++ b/drivers/mmc/host/renesas_sdhi_core.c
@@ -558,7 +558,7 @@ static void renesas_sdhi_reset(struct tmio_mmc_host *host)
struct renesas_sdhi *priv = host_to_priv(host);

if (priv->scc_ctl) {
- renesas_sdhi_reset_scc(host, priv);
+ renesas_sdhi_disable_scc(host->mmc);
renesas_sdhi_reset_hs400_mode(host, priv);
priv->needs_adjust_hs400 = false;

--
2.17.1


[PATCH 5.10.y-cip 03/39] mmc: renesas_sdhi: simplify reset routine a little

Lad Prabhakar
 

From: Wolfram Sang <wsa+renesas@...>

commit 9f809065d86dec2070263acedaa5758f8c9e95a9 upstream.

The 'reset' pointer is only populated for Gen2+. So, we don't need to
check for that flag inside the routine.

Signed-off-by: Wolfram Sang <wsa+renesas@...>
Reviewed-by: Niklas Söderlund <niklas.soderlund+renesas@...>
Reviewed-by: Yoshihiro Shimoda <yoshihiro.shimoda.uh@...>
Tested-by: Yoshihiro Shimoda <yoshihiro.shimoda.uh@...>
Link: https://lore.kernel.org/r/20201110142058.36393-5-wsa+renesas@sang-engineering.com
Signed-off-by: Ulf Hansson <ulf.hansson@...>
Signed-off-by: Lad Prabhakar <prabhakar.mahadev-lad.rj@...>
---
drivers/mmc/host/renesas_sdhi_core.c | 5 ++---
1 file changed, 2 insertions(+), 3 deletions(-)

diff --git a/drivers/mmc/host/renesas_sdhi_core.c b/drivers/mmc/host/renesas_sdhi_core.c
index fc210c314e6c..e264ba2bff29 100644
--- a/drivers/mmc/host/renesas_sdhi_core.c
+++ b/drivers/mmc/host/renesas_sdhi_core.c
@@ -552,6 +552,7 @@ static int renesas_sdhi_prepare_hs400_tuning(struct mmc_host *mmc, struct mmc_io
return 0;
}

+/* only populated for TMIO_MMC_MIN_RCAR2 */
static void renesas_sdhi_reset(struct tmio_mmc_host *host)
{
struct renesas_sdhi *priv = host_to_priv(host);
@@ -569,9 +570,7 @@ static void renesas_sdhi_reset(struct tmio_mmc_host *host)
sd_scc_read32(host, priv, SH_MOBILE_SDHI_SCC_RVSCNTL));
}

- if (host->pdata->flags & TMIO_MMC_MIN_RCAR2)
- sd_ctrl_write32_as_16_and_16(host, CTL_IRQ_MASK,
- TMIO_MASK_INIT_RCAR2);
+ sd_ctrl_write32_as_16_and_16(host, CTL_IRQ_MASK, TMIO_MASK_INIT_RCAR2);
}

#define SH_MOBILE_SDHI_MIN_TAP_ROW 3
--
2.17.1


[PATCH 5.10.y-cip 02/39] mmc: renesas_sdhi: populate SCC pointer at the proper place

Lad Prabhakar
 

From: Wolfram Sang <wsa+renesas@...>

commit d14ac691bb6f6ebaa7eeec21ca04dd47300ff5b6 upstream.

The SCC pointer is currently filled whenever the SoC is Gen2+. This is
wrong because there is a Gen2-variant without SCC (SDHI_VER_GEN2_SDR50).
We have been lucky because the writes to unintended registers have not
caused problems so far. But further refactoring work exposed the
problem. So, move the pointer initialization to the place where we know
that the SDHI instance supports tuning. And also populate the 'reset'
pointer unconditionally to make sure the interrupt enable register is
always properly set for Gen2+.

Signed-off-by: Wolfram Sang <wsa+renesas@...>
Reviewed-by: Niklas Söderlund <niklas.soderlund+renesas@...>
Reviewed-by: Yoshihiro Shimoda <yoshihiro.shimoda.uh@...>
Tested-by: Yoshihiro Shimoda <yoshihiro.shimoda.uh@...>
Link: https://lore.kernel.org/r/20201110142058.36393-4-wsa+renesas@sang-engineering.com
Signed-off-by: Ulf Hansson <ulf.hansson@...>
Signed-off-by: Lad Prabhakar <prabhakar.mahadev-lad.rj@...>
---
drivers/mmc/host/renesas_sdhi_core.c | 7 ++-----
1 file changed, 2 insertions(+), 5 deletions(-)

diff --git a/drivers/mmc/host/renesas_sdhi_core.c b/drivers/mmc/host/renesas_sdhi_core.c
index 9dc9824e1f76..fc210c314e6c 100644
--- a/drivers/mmc/host/renesas_sdhi_core.c
+++ b/drivers/mmc/host/renesas_sdhi_core.c
@@ -1012,11 +1012,7 @@ int renesas_sdhi_probe(struct platform_device *pdev,
host->ops.start_signal_voltage_switch =
renesas_sdhi_start_signal_voltage_switch;
host->sdcard_irq_setbit_mask = TMIO_STAT_ALWAYS_SET_27;
-
- if (of_data && of_data->scc_offset) {
- priv->scc_ctl = host->ctl + of_data->scc_offset;
- host->reset = renesas_sdhi_reset;
- }
+ host->reset = renesas_sdhi_reset;
}

/* Orginally registers were 16 bit apart, could be 32 or 64 nowadays */
@@ -1096,6 +1092,7 @@ int renesas_sdhi_probe(struct platform_device *pdev,
if (!hit)
dev_warn(&host->pdev->dev, "Unknown clock rate for tuning\n");

+ priv->scc_ctl = host->ctl + of_data->scc_offset;
host->check_retune = renesas_sdhi_check_scc_error;
host->ops.execute_tuning = renesas_sdhi_execute_tuning;
host->ops.prepare_hs400_tuning = renesas_sdhi_prepare_hs400_tuning;
--
2.17.1


[PATCH 5.10.y-cip 01/39] mmc: renesas_sdhi: probe into TMIO after SCC parameters have been setup

Lad Prabhakar
 

From: Wolfram Sang <wsa+renesas@...>

commit b161d87dfd3d9f3fb064a089a9e521d0e5d3e38f upstream.

Setting up the SCC parameters does not need a probed TMIO device. But in
the near future, probing the TMIO device needs the SCC parameters setup.
So, fix the ordering.

Signed-off-by: Wolfram Sang <wsa+renesas@...>
Reviewed-by: Niklas Söderlund <niklas.soderlund+renesas@...>
Reviewed-by: Yoshihiro Shimoda <yoshihiro.shimoda.uh@...>
Tested-by: Yoshihiro Shimoda <yoshihiro.shimoda.uh@...>
Link: https://lore.kernel.org/r/20201110142058.36393-3-wsa+renesas@sang-engineering.com
Signed-off-by: Ulf Hansson <ulf.hansson@...>
Signed-off-by: Lad Prabhakar <prabhakar.mahadev-lad.rj@...>
---
drivers/mmc/host/renesas_sdhi_core.c | 8 ++++----
1 file changed, 4 insertions(+), 4 deletions(-)

diff --git a/drivers/mmc/host/renesas_sdhi_core.c b/drivers/mmc/host/renesas_sdhi_core.c
index d5e7bbdffc53..9dc9824e1f76 100644
--- a/drivers/mmc/host/renesas_sdhi_core.c
+++ b/drivers/mmc/host/renesas_sdhi_core.c
@@ -1072,10 +1072,6 @@ int renesas_sdhi_probe(struct platform_device *pdev,
quirks->hs400_calib_table + 1);
}

- ret = tmio_mmc_host_probe(host);
- if (ret < 0)
- goto edisclk;
-
/* Enable tuning iff we have an SCC and a supported mode */
if (of_data && of_data->scc_offset &&
(host->mmc->caps & MMC_CAP_UHS_SDR104 ||
@@ -1107,6 +1103,10 @@ int renesas_sdhi_probe(struct platform_device *pdev,
host->ops.hs400_complete = renesas_sdhi_hs400_complete;
}

+ ret = tmio_mmc_host_probe(host);
+ if (ret < 0)
+ goto edisclk;
+
num_irqs = platform_irq_count(pdev);
if (num_irqs < 0) {
ret = num_irqs;
--
2.17.1


[PATCH 5.10.y-cip 00/39] Add SD/eMMC support for Renesas RZ/G2L SoC

Lad Prabhakar
 

Hi All,

This patch series adds support for SD/eMMC on Renesas RZ/G2L SoC and
enables this interfaces on Renesas RZ/G2L SMARC EVK.

All the patches have been cherry picked from v5.17 release.

Cheers,
Prabhakar

Biju Das (9):
mmc: tmio: reinit card irqs in reset routine
clk: renesas: rzg2l: Add SDHI clk mux support
clk: renesas: r9a07g044: Add SDHI clock and reset entries
dt-bindings: mmc: renesas,sdhi: Fix dtbs-check warning
dt-bindings: mmc: renesas,sdhi: Document RZ/G2L bindings
dt-bindings: mmc: renesas,sdhi: Rename RZ/G2L clocks
arm64: dts: renesas: r9a07g044: Add SDHI nodes
arm64: dts: renesas: rzg2l-smarc-som: Enable eMMC on SMARC platform
arm64: dts: renesas: rzg2l-smarc: Enable microSD on SMARC platform

Geert Uytterhoeven (1):
clk: renesas: rzg2l: Add missing kerneldoc for resets

Lad Prabhakar (2):
clk: renesas: rzg2l: Check return value of pm_genpd_init()
clk: renesas: rzg2l: propagate return value
of_genpd_add_provider_simple()

Masaharu Hayakawa (1):
mmc: tmio: Add data timeout error detection

Rob Herring (2):
dt-bindings: Fix errors in 'if' schemas
dt-bindings: Drop redundant minItems/maxItems

Takeshi Saito (1):
mmc: tmio: restore bus width when resetting

Wolfram Sang (21):
mmc: renesas_sdhi: probe into TMIO after SCC parameters have been
setup
mmc: renesas_sdhi: populate SCC pointer at the proper place
mmc: renesas_sdhi: simplify reset routine a little
mmc: renesas_sdhi: clear TAPEN when resetting, too
mmc: renesas_sdhi: merge the SCC reset functions
mmc: renesas_sdhi: remove superfluous SCLKEN
mmc: renesas_sdhi: improve HOST_MODE usage
mmc: renesas_sdhi: don't hardcode SDIF values
mmc: renesas_sdhi: sort includes
mmc: tmio: set max_busy_timeout
mmc: tmio: add hook for custom busy_wait calculation
mmc: renesas_sdhi: populate hook for longer busy_wait
mmc: tmio: support custom irq masks
mmc: renesas_sdhi: use custom mask for TMIO_MASK_ALL
mmc: tmio: abort DMA before reset
mmc: renesas_sdhi: break SCC reset into own function
mmc: renesas_sdhi: do hard reset if possible
mmc: tmio: always flag retune when resetting and a card is present
mmc: tmio: always restore irq register
mmc: tmio: reenable card irqs after the reset callback
dt-bindings: mmc: renesas,sdhi: Add optional SDnH clock

Yoshihiro Shimoda (2):
mmc: renesas_internal_dmac: add pre_req and post_req support
mmc: renesas_sdhi: Add a condition of cmd/data timeout for retune

.../devicetree/bindings/mmc/renesas,sdhi.yaml | 153 ++++++++++++-----
arch/arm64/boot/dts/renesas/r9a07g044.dtsi | 32 ++++
.../boot/dts/renesas/rzg2l-smarc-som.dtsi | 143 ++++++++++++++++
arch/arm64/boot/dts/renesas/rzg2l-smarc.dtsi | 62 +++++++
drivers/clk/renesas/r9a07g044-cpg.c | 36 ++++
drivers/clk/renesas/rzg2l-cpg.c | 136 ++++++++++++++-
drivers/clk/renesas/rzg2l-cpg.h | 19 +++
drivers/mmc/host/Kconfig | 1 +
drivers/mmc/host/renesas_sdhi.h | 2 +
drivers/mmc/host/renesas_sdhi_core.c | 155 ++++++++++++------
drivers/mmc/host/renesas_sdhi_internal_dmac.c | 91 +++++++++-
drivers/mmc/host/tmio_mmc.h | 11 +-
drivers/mmc/host/tmio_mmc_core.c | 88 ++++++----
drivers/mmc/host/uniphier-sd.c | 1 +
include/linux/mfd/tmio.h | 7 +-
15 files changed, 794 insertions(+), 143 deletions(-)

--
2.17.1


cip/linux-5.10.y-cip ltp-timers: 7 runs, 1 regressions (v5.10.106-cip4) #kernelci

kernelci.org bot <bot@...>
 

cip/linux-5.10.y-cip ltp-timers: 7 runs, 1 regressions (v5.10.106-cip4)

Regressions Summary
-------------------

platform | arch | lab | compiler | defconfig | regressions
-----------------------+--------+---------------+----------+------------------------------+------------
asus-C436FA-Flip-hatch | x86_64 | lab-collabora | gcc-10 | x86_64_defcon...6-chromebook | 1

Details: https://kernelci.org/test/job/cip/branch/linux-5.10.y-cip/kernel/v5.10.106-cip4/plan/ltp-timers/

Test: ltp-timers
Tree: cip
Branch: linux-5.10.y-cip
Describe: v5.10.106-cip4
URL: https://git.kernel.org/pub/scm/linux/kernel/git/cip/linux-cip.git
SHA: 8bb6e30b765989a3c0924158316d689e16317cd1

Test suite revisions:
ltp-tests
URL: https://github.com/linux-test-project/ltp.git
SHA: dc836ec4cd4e02e1346001f828c1f1988a8d7d54


Test Regressions
----------------


platform | arch | lab | compiler | defconfig | regressions
-----------------------+--------+---------------+----------+------------------------------+------------
asus-C436FA-Flip-hatch | x86_64 | lab-collabora | gcc-10 | x86_64_defcon...6-chromebook | 1

Details: https://kernelci.org/test/plan/id/6242e20fa24d250179ae067c

Results: 0 PASS, 1 FAIL, 0 SKIP
Full config: x86_64_defconfig+x86-chromebook
Compiler: gcc-10 (gcc (Debian 10.2.1-6) 10.2.1 20210110)
Plain log: https://storage.kernelci.org//cip/linux-5.10.y-cip/v5.10.106-cip4/x86_64/x86_64_defconfig+x86-chromebook/gcc-10/lab-collabora/ltp-timers-asus-C436FA-Flip-hatch.txt
HTML log: https://storage.kernelci.org//cip/linux-5.10.y-cip/v5.10.106-cip4/x86_64/x86_64_defconfig+x86-chromebook/gcc-10/lab-collabora/ltp-timers-asus-C436FA-Flip-hatch.html
Rootfs: http://storage.kernelci.org/images/rootfs/debian/bullseye-ltp/20220311.1/amd64/initrd.cpio.gz


* ltp-timers.login: https://kernelci.org/test/case/id/6242e20fa24d250179ae067d
new failure (last pass: v5.10.83-cip1-151-ga4163710a1dc)


cip/linux-5.10.y-cip ltp-pty: 4 runs, 3 regressions (v5.10.106-cip4) #kernelci

kernelci.org bot <bot@...>
 

cip/linux-5.10.y-cip ltp-pty: 4 runs, 3 regressions (v5.10.106-cip4)

Regressions Summary
-------------------

platform | arch | lab | compiler | defconfig | regressions
--------------------------+--------+---------------+----------+------------------------------+------------
asus-C433TA-AJ0005-rammus | x86_64 | lab-collabora | gcc-10 | x86_64_defcon...6-chromebook | 1
hp-11A-G6-EE-grunt | x86_64 | lab-collabora | gcc-10 | x86_64_defcon...6-chromebook | 1
rk3399-gru-kevin | arm64 | lab-collabora | gcc-10 | defconfig+arm64-chromebook | 1

Details: https://kernelci.org/test/job/cip/branch/linux-5.10.y-cip/kernel/v5.10.106-cip4/plan/ltp-pty/

Test: ltp-pty
Tree: cip
Branch: linux-5.10.y-cip
Describe: v5.10.106-cip4
URL: https://git.kernel.org/pub/scm/linux/kernel/git/cip/linux-cip.git
SHA: 8bb6e30b765989a3c0924158316d689e16317cd1

Test suite revisions:
ltp-tests
URL: https://github.com/linux-test-project/ltp.git
SHA: dc836ec4cd4e02e1346001f828c1f1988a8d7d54


Test Regressions
----------------


platform | arch | lab | compiler | defconfig | regressions
--------------------------+--------+---------------+----------+------------------------------+------------
asus-C433TA-AJ0005-rammus | x86_64 | lab-collabora | gcc-10 | x86_64_defcon...6-chromebook | 1

Details: https://kernelci.org/test/plan/id/6242dea58b14bf7a79ae06a0

Results: 0 PASS, 1 FAIL, 0 SKIP
Full config: x86_64_defconfig+x86-chromebook
Compiler: gcc-10 (gcc (Debian 10.2.1-6) 10.2.1 20210110)
Plain log: https://storage.kernelci.org//cip/linux-5.10.y-cip/v5.10.106-cip4/x86_64/x86_64_defconfig+x86-chromebook/gcc-10/lab-collabora/ltp-pty-asus-C433TA-AJ0005-rammus.txt
HTML log: https://storage.kernelci.org//cip/linux-5.10.y-cip/v5.10.106-cip4/x86_64/x86_64_defconfig+x86-chromebook/gcc-10/lab-collabora/ltp-pty-asus-C433TA-AJ0005-rammus.html
Rootfs: http://storage.kernelci.org/images/rootfs/debian/bullseye-ltp/20220311.1/amd64/initrd.cpio.gz


* ltp-pty.login: https://kernelci.org/test/case/id/6242dea58b14bf7a79ae06a1
new failure (last pass: v5.10.83-cip1-151-ga4163710a1dc)



platform | arch | lab | compiler | defconfig | regressions
--------------------------+--------+---------------+----------+------------------------------+------------
hp-11A-G6-EE-grunt | x86_64 | lab-collabora | gcc-10 | x86_64_defcon...6-chromebook | 1

Details: https://kernelci.org/test/plan/id/6242e4a40b456963c8ae067c

Results: 0 PASS, 1 FAIL, 0 SKIP
Full config: x86_64_defconfig+x86-chromebook
Compiler: gcc-10 (gcc (Debian 10.2.1-6) 10.2.1 20210110)
Plain log: https://storage.kernelci.org//cip/linux-5.10.y-cip/v5.10.106-cip4/x86_64/x86_64_defconfig+x86-chromebook/gcc-10/lab-collabora/ltp-pty-hp-11A-G6-EE-grunt.txt
HTML log: https://storage.kernelci.org//cip/linux-5.10.y-cip/v5.10.106-cip4/x86_64/x86_64_defconfig+x86-chromebook/gcc-10/lab-collabora/ltp-pty-hp-11A-G6-EE-grunt.html
Rootfs: http://storage.kernelci.org/images/rootfs/debian/bullseye-ltp/20220311.1/amd64/initrd.cpio.gz


* ltp-pty.login: https://kernelci.org/test/case/id/6242e4a40b456963c8ae067d
new failure (last pass: v5.10.83-cip1-151-ga4163710a1dc)



platform | arch | lab | compiler | defconfig | regressions
--------------------------+--------+---------------+----------+------------------------------+------------
rk3399-gru-kevin | arm64 | lab-collabora | gcc-10 | defconfig+arm64-chromebook | 1

Details: https://kernelci.org/test/plan/id/6242e36482ded63d30ae06a8

Results: 0 PASS, 1 FAIL, 0 SKIP
Full config: defconfig+arm64-chromebook
Compiler: gcc-10 (aarch64-linux-gnu-gcc (Debian 10.2.1-6) 10.2.1 20210110)
Plain log: https://storage.kernelci.org//cip/linux-5.10.y-cip/v5.10.106-cip4/arm64/defconfig+arm64-chromebook/gcc-10/lab-collabora/ltp-pty-rk3399-gru-kevin.txt
HTML log: https://storage.kernelci.org//cip/linux-5.10.y-cip/v5.10.106-cip4/arm64/defconfig+arm64-chromebook/gcc-10/lab-collabora/ltp-pty-rk3399-gru-kevin.html
Rootfs: http://storage.kernelci.org/images/rootfs/debian/bullseye-ltp/20220311.1/arm64/initrd.cpio.gz


* ltp-pty.login: https://kernelci.org/test/case/id/6242e36482ded63d30ae06a9
new failure (last pass: v5.10.83-cip1-178-g2cf1d12aab81)


cip/linux-5.10.y-cip kselftest-seccomp: 3 runs, 2 regressions (v5.10.106-cip4) #kernelci

kernelci.org bot <bot@...>
 

cip/linux-5.10.y-cip kselftest-seccomp: 3 runs, 2 regressions (v5.10.106-cip4)

Regressions Summary
-------------------

platform | arch | lab | compiler | defconfig | regressions
--------------------------+--------+---------------+----------+------------------------------+------------
asus-C433TA-AJ0005-rammus | x86_64 | lab-collabora | gcc-10 | x86_64_defcon...ok+kselftest | 1
hp-11A-G6-EE-grunt | x86_64 | lab-collabora | gcc-10 | x86_64_defcon...ok+kselftest | 1

Details: https://kernelci.org/test/job/cip/branch/linux-5.10.y-cip/kernel/v5.10.106-cip4/plan/kselftest-seccomp/

Test: kselftest-seccomp
Tree: cip
Branch: linux-5.10.y-cip
Describe: v5.10.106-cip4
URL: https://git.kernel.org/pub/scm/linux/kernel/git/cip/linux-cip.git
SHA: 8bb6e30b765989a3c0924158316d689e16317cd1


Test Regressions
----------------


platform | arch | lab | compiler | defconfig | regressions
--------------------------+--------+---------------+----------+------------------------------+------------
asus-C433TA-AJ0005-rammus | x86_64 | lab-collabora | gcc-10 | x86_64_defcon...ok+kselftest | 1

Details: https://kernelci.org/test/plan/id/6242dd0f8ba61d19d5ae06b5

Results: 83 PASS, 4 FAIL, 8 SKIP
Full config: x86_64_defconfig+x86-chromebook+kselftest
Compiler: gcc-10 (gcc (Debian 10.2.1-6) 10.2.1 20210110)
Plain log: https://storage.kernelci.org//cip/linux-5.10.y-cip/v5.10.106-cip4/x86_64/x86_64_defconfig+x86-chromebook+kselftest/gcc-10/lab-collabora/kselftest-seccomp-asus-C433TA-AJ0005-rammus.txt
HTML log: https://storage.kernelci.org//cip/linux-5.10.y-cip/v5.10.106-cip4/x86_64/x86_64_defconfig+x86-chromebook+kselftest/gcc-10/lab-collabora/kselftest-seccomp-asus-C433TA-AJ0005-rammus.html
Rootfs: http://storage.kernelci.org/images/rootfs/debian/bullseye-kselftest/20220311.1/amd64/initrd.cpio.gz


* kselftest-seccomp.seccomp_seccomp_bpf_TSYNC_siblings_fail_prctl: https://kernelci.org/test/case/id/6242dd0f8ba61d19d5ae06bc
new failure (last pass: v5.10.100-cip2)



platform | arch | lab | compiler | defconfig | regressions
--------------------------+--------+---------------+----------+------------------------------+------------
hp-11A-G6-EE-grunt | x86_64 | lab-collabora | gcc-10 | x86_64_defcon...ok+kselftest | 1

Details: https://kernelci.org/test/plan/id/6242e334ec89aef8b0ae06a2

Results: 83 PASS, 4 FAIL, 8 SKIP
Full config: x86_64_defconfig+x86-chromebook+kselftest
Compiler: gcc-10 (gcc (Debian 10.2.1-6) 10.2.1 20210110)
Plain log: https://storage.kernelci.org//cip/linux-5.10.y-cip/v5.10.106-cip4/x86_64/x86_64_defconfig+x86-chromebook+kselftest/gcc-10/lab-collabora/kselftest-seccomp-hp-11A-G6-EE-grunt.txt
HTML log: https://storage.kernelci.org//cip/linux-5.10.y-cip/v5.10.106-cip4/x86_64/x86_64_defconfig+x86-chromebook+kselftest/gcc-10/lab-collabora/kselftest-seccomp-hp-11A-G6-EE-grunt.html
Rootfs: http://storage.kernelci.org/images/rootfs/debian/bullseye-kselftest/20220311.1/amd64/initrd.cpio.gz


* kselftest-seccomp.seccomp_seccomp_bpf_TSYNC_siblings_fail_prctl: https://kernelci.org/test/case/id/6242e334ec89aef8b0ae06a9
new failure (last pass: v5.10.100-cip2)


cip/linux-5.10.y-cip baseline-nfs: 16 runs, 1 regressions (v5.10.106-cip4) #kernelci

kernelci.org bot <bot@...>
 

cip/linux-5.10.y-cip baseline-nfs: 16 runs, 1 regressions (v5.10.106-cip4)

Regressions Summary
-------------------

platform | arch | lab | compiler | defconfig | regressions
-----------------+-------+---------------+----------+----------------------------+------------
rk3399-gru-kevin | arm64 | lab-collabora | gcc-10 | defconfig+arm64-chromebook | 1

Details: https://kernelci.org/test/job/cip/branch/linux-5.10.y-cip/kernel/v5.10.106-cip4/plan/baseline-nfs/

Test: baseline-nfs
Tree: cip
Branch: linux-5.10.y-cip
Describe: v5.10.106-cip4
URL: https://git.kernel.org/pub/scm/linux/kernel/git/cip/linux-cip.git
SHA: 8bb6e30b765989a3c0924158316d689e16317cd1


Test Regressions
----------------


platform | arch | lab | compiler | defconfig | regressions
-----------------+-------+---------------+----------+----------------------------+------------
rk3399-gru-kevin | arm64 | lab-collabora | gcc-10 | defconfig+arm64-chromebook | 1

Details: https://kernelci.org/test/plan/id/6242e06ce5676f1b00ae06b9

Results: 84 PASS, 4 FAIL, 0 SKIP
Full config: defconfig+arm64-chromebook
Compiler: gcc-10 (aarch64-linux-gnu-gcc (Debian 10.2.1-6) 10.2.1 20210110)
Plain log: https://storage.kernelci.org//cip/linux-5.10.y-cip/v5.10.106-cip4/arm64/defconfig+arm64-chromebook/gcc-10/lab-collabora/baseline-nfs-rk3399-gru-kevin.txt
HTML log: https://storage.kernelci.org//cip/linux-5.10.y-cip/v5.10.106-cip4/arm64/defconfig+arm64-chromebook/gcc-10/lab-collabora/baseline-nfs-rk3399-gru-kevin.html
Rootfs: http://storage.kernelci.org/images/rootfs/debian/bullseye/20220311.1/arm64/initrd.cpio.gz


* baseline-nfs.bootrr.rockchip-i2s1-probed: https://kernelci.org/test/case/id/6242e06ce5676f1b00ae06da
new failure (last pass: v5.10.83-cip1-178-g2cf1d12aab81)

2022-03-29T10:33:00.689071 <4>[ 37.252292] cdn-dp fec00000.dp: Direct firmware load for rockchip/dptx.bin failed with error -2
2022-03-29T10:33:00.699099 <4>[ 37.262907] cdn-dp fec00000.dp: Falling back to sysfs fallback for: rockchip/dptx.bin
2022-03-29T10:33:01.504897 /lava-5969081/1/../bin/lava-test-case


cip/linux-5.10.y-cip baseline: 104 runs, 1 regressions (v5.10.106-cip4) #kernelci

kernelci.org bot <bot@...>
 

cip/linux-5.10.y-cip baseline: 104 runs, 1 regressions (v5.10.106-cip4)

Regressions Summary
-------------------

platform | arch | lab | compiler | defconfig | regressions
-----------------+-------+---------------+----------+----------------------------+------------
rk3399-gru-kevin | arm64 | lab-collabora | gcc-10 | defconfig+arm64-chromebook | 1

Details: https://kernelci.org/test/job/cip/branch/linux-5.10.y-cip/kernel/v5.10.106-cip4/plan/baseline/

Test: baseline
Tree: cip
Branch: linux-5.10.y-cip
Describe: v5.10.106-cip4
URL: https://git.kernel.org/pub/scm/linux/kernel/git/cip/linux-cip.git
SHA: 8bb6e30b765989a3c0924158316d689e16317cd1


Test Regressions
----------------


platform | arch | lab | compiler | defconfig | regressions
-----------------+-------+---------------+----------+----------------------------+------------
rk3399-gru-kevin | arm64 | lab-collabora | gcc-10 | defconfig+arm64-chromebook | 1

Details: https://kernelci.org/test/plan/id/6242e0491b50cdb27fae06b5

Results: 90 PASS, 2 FAIL, 0 SKIP
Full config: defconfig+arm64-chromebook
Compiler: gcc-10 (aarch64-linux-gnu-gcc (Debian 10.2.1-6) 10.2.1 20210110)
Plain log: https://storage.kernelci.org//cip/linux-5.10.y-cip/v5.10.106-cip4/arm64/defconfig+arm64-chromebook/gcc-10/lab-collabora/baseline-rk3399-gru-kevin.txt
HTML log: https://storage.kernelci.org//cip/linux-5.10.y-cip/v5.10.106-cip4/arm64/defconfig+arm64-chromebook/gcc-10/lab-collabora/baseline-rk3399-gru-kevin.html
Rootfs: http://storage.kernelci.org/images/rootfs/buildroot/buildroot-baseline/20220228.1/arm64/rootfs.cpio.gz


* baseline.bootrr.rockchip-i2s1-probed: https://kernelci.org/test/case/id/6242e0491b50cdb27fae06d6
new failure (last pass: v5.10.83-cip1-178-g2cf1d12aab81)

2022-03-29T10:32:20.576387 /lava-5969080/1/../bin/lava-test-case
2022-03-29T10:32:20.586558 <8>[ 34.578035] <LAVA_SIGNAL_TESTCASE TEST_CASE_ID=rockchip-i2s1-probed RESULT=fail>


cip/linux-4.19.y-cip ltp-timers: 6 runs, 2 regressions (v4.19.235-cip70) #kernelci

kernelci.org bot <bot@...>
 

cip/linux-4.19.y-cip ltp-timers: 6 runs, 2 regressions (v4.19.235-cip70)

Regressions Summary
-------------------

platform | arch | lab | compiler | defconfig | regressions
-------------------+--------+---------------+----------+------------------------------+------------
hp-11A-G6-EE-grunt | x86_64 | lab-collabora | gcc-10 | x86_64_defcon...6-chromebook | 2

Details: https://kernelci.org/test/job/cip/branch/linux-4.19.y-cip/kernel/v4.19.235-cip70/plan/ltp-timers/

Test: ltp-timers
Tree: cip
Branch: linux-4.19.y-cip
Describe: v4.19.235-cip70
URL: https://git.kernel.org/pub/scm/linux/kernel/git/cip/linux-cip.git
SHA: 91567a6adc2cb5217b6d7aabf7da3ac9ae6f1a79

Test suite revisions:
ltp-tests
URL: https://github.com/linux-test-project/ltp.git
SHA: dc836ec4cd4e02e1346001f828c1f1988a8d7d54


Test Regressions
----------------


platform | arch | lab | compiler | defconfig | regressions
-------------------+--------+---------------+----------+------------------------------+------------
hp-11A-G6-EE-grunt | x86_64 | lab-collabora | gcc-10 | x86_64_defcon...6-chromebook | 2

Details: https://kernelci.org/test/plan/id/6242dd9267b43ebba7ae0696

Results: 32 PASS, 4 FAIL, 0 SKIP
Full config: x86_64_defconfig+x86-chromebook
Compiler: gcc-10 (gcc (Debian 10.2.1-6) 10.2.1 20210110)
Plain log: https://storage.kernelci.org//cip/linux-4.19.y-cip/v4.19.235-cip70/x86_64/x86_64_defconfig+x86-chromebook/gcc-10/lab-collabora/ltp-timers-hp-11A-G6-EE-grunt.txt
HTML log: https://storage.kernelci.org//cip/linux-4.19.y-cip/v4.19.235-cip70/x86_64/x86_64_defconfig+x86-chromebook/gcc-10/lab-collabora/ltp-timers-hp-11A-G6-EE-grunt.html
Rootfs: http://storage.kernelci.org/images/rootfs/debian/bullseye-ltp/20220311.1/amd64/initrd.cpio.gz


* ltp-timers.clock_settime: https://kernelci.org/test/case/id/6242dd9267b43ebba7ae06a6
new failure (last pass: v4.19.233-cip69)

* ltp-timers.clock_settime: https://kernelci.org/test/case/id/6242dd9267b43ebba7ae06a6
new failure (last pass: v4.19.233-cip69)


cip/linux-4.19.y-cip ltp-pty: 3 runs, 3 regressions (v4.19.235-cip70) #kernelci

kernelci.org bot <bot@...>
 

cip/linux-4.19.y-cip ltp-pty: 3 runs, 3 regressions (v4.19.235-cip70)

Regressions Summary
-------------------

platform | arch | lab | compiler | defconfig | regressions
--------------------------+--------+---------------+----------+------------------------------+------------
asus-C433TA-AJ0005-rammus | x86_64 | lab-collabora | gcc-10 | x86_64_defcon...6-chromebook | 1
hp-11A-G6-EE-grunt | x86_64 | lab-collabora | gcc-10 | x86_64_defcon...6-chromebook | 1
rk3399-gru-kevin | arm64 | lab-collabora | gcc-10 | defconfig+arm64-chromebook | 1

Details: https://kernelci.org/test/job/cip/branch/linux-4.19.y-cip/kernel/v4.19.235-cip70/plan/ltp-pty/

Test: ltp-pty
Tree: cip
Branch: linux-4.19.y-cip
Describe: v4.19.235-cip70
URL: https://git.kernel.org/pub/scm/linux/kernel/git/cip/linux-cip.git
SHA: 91567a6adc2cb5217b6d7aabf7da3ac9ae6f1a79

Test suite revisions:
ltp-tests
URL: https://github.com/linux-test-project/ltp.git
SHA: dc836ec4cd4e02e1346001f828c1f1988a8d7d54


Test Regressions
----------------


platform | arch | lab | compiler | defconfig | regressions
--------------------------+--------+---------------+----------+------------------------------+------------
asus-C433TA-AJ0005-rammus | x86_64 | lab-collabora | gcc-10 | x86_64_defcon...6-chromebook | 1

Details: https://kernelci.org/test/plan/id/6242da926f5f446e37ae0687

Results: 0 PASS, 1 FAIL, 0 SKIP
Full config: x86_64_defconfig+x86-chromebook
Compiler: gcc-10 (gcc (Debian 10.2.1-6) 10.2.1 20210110)
Plain log: https://storage.kernelci.org//cip/linux-4.19.y-cip/v4.19.235-cip70/x86_64/x86_64_defconfig+x86-chromebook/gcc-10/lab-collabora/ltp-pty-asus-C433TA-AJ0005-rammus.txt
HTML log: https://storage.kernelci.org//cip/linux-4.19.y-cip/v4.19.235-cip70/x86_64/x86_64_defconfig+x86-chromebook/gcc-10/lab-collabora/ltp-pty-asus-C433TA-AJ0005-rammus.html
Rootfs: http://storage.kernelci.org/images/rootfs/debian/bullseye-ltp/20220311.1/amd64/initrd.cpio.gz


* ltp-pty.login: https://kernelci.org/test/case/id/6242da926f5f446e37ae0688
new failure (last pass: v4.19.233-cip69)



platform | arch | lab | compiler | defconfig | regressions
--------------------------+--------+---------------+----------+------------------------------+------------
hp-11A-G6-EE-grunt | x86_64 | lab-collabora | gcc-10 | x86_64_defcon...6-chromebook | 1

Details: https://kernelci.org/test/plan/id/6242ded291b74ccf79ae067c

Results: 0 PASS, 1 FAIL, 0 SKIP
Full config: x86_64_defconfig+x86-chromebook
Compiler: gcc-10 (gcc (Debian 10.2.1-6) 10.2.1 20210110)
Plain log: https://storage.kernelci.org//cip/linux-4.19.y-cip/v4.19.235-cip70/x86_64/x86_64_defconfig+x86-chromebook/gcc-10/lab-collabora/ltp-pty-hp-11A-G6-EE-grunt.txt
HTML log: https://storage.kernelci.org//cip/linux-4.19.y-cip/v4.19.235-cip70/x86_64/x86_64_defconfig+x86-chromebook/gcc-10/lab-collabora/ltp-pty-hp-11A-G6-EE-grunt.html
Rootfs: http://storage.kernelci.org/images/rootfs/debian/bullseye-ltp/20220311.1/amd64/initrd.cpio.gz


* ltp-pty.login: https://kernelci.org/test/case/id/6242ded291b74ccf79ae067d
new failure (last pass: v4.19.233-cip69)



platform | arch | lab | compiler | defconfig | regressions
--------------------------+--------+---------------+----------+------------------------------+------------
rk3399-gru-kevin | arm64 | lab-collabora | gcc-10 | defconfig+arm64-chromebook | 1

Details: https://kernelci.org/test/plan/id/6242db3b721c4ffc31ae068d

Results: 0 PASS, 1 FAIL, 0 SKIP
Full config: defconfig+arm64-chromebook
Compiler: gcc-10 (aarch64-linux-gnu-gcc (Debian 10.2.1-6) 10.2.1 20210110)
Plain log: https://storage.kernelci.org//cip/linux-4.19.y-cip/v4.19.235-cip70/arm64/defconfig+arm64-chromebook/gcc-10/lab-collabora/ltp-pty-rk3399-gru-kevin.txt
HTML log: https://storage.kernelci.org//cip/linux-4.19.y-cip/v4.19.235-cip70/arm64/defconfig+arm64-chromebook/gcc-10/lab-collabora/ltp-pty-rk3399-gru-kevin.html
Rootfs: http://storage.kernelci.org/images/rootfs/debian/bullseye-ltp/20220311.1/arm64/initrd.cpio.gz


* ltp-pty.login: https://kernelci.org/test/case/id/6242db3b721c4ffc31ae068e
new failure (last pass: v4.19.229-cip67)


cip/linux-4.19.y-cip ltp-fcntl-locktests: 3 runs, 1 regressions (v4.19.235-cip70) #kernelci

kernelci.org bot <bot@...>
 

cip/linux-4.19.y-cip ltp-fcntl-locktests: 3 runs, 1 regressions (v4.19.235-cip70)

Regressions Summary
-------------------

platform | arch | lab | compiler | defconfig | regressions
-----------------+-------+---------------+----------+----------------------------+------------
rk3399-gru-kevin | arm64 | lab-collabora | gcc-10 | defconfig+arm64-chromebook | 1

Details: https://kernelci.org/test/job/cip/branch/linux-4.19.y-cip/kernel/v4.19.235-cip70/plan/ltp-fcntl-locktests/

Test: ltp-fcntl-locktests
Tree: cip
Branch: linux-4.19.y-cip
Describe: v4.19.235-cip70
URL: https://git.kernel.org/pub/scm/linux/kernel/git/cip/linux-cip.git
SHA: 91567a6adc2cb5217b6d7aabf7da3ac9ae6f1a79

Test suite revisions:
ltp-tests
URL: https://github.com/linux-test-project/ltp.git
SHA: dc836ec4cd4e02e1346001f828c1f1988a8d7d54


Test Regressions
----------------


platform | arch | lab | compiler | defconfig | regressions
-----------------+-------+---------------+----------+----------------------------+------------
rk3399-gru-kevin | arm64 | lab-collabora | gcc-10 | defconfig+arm64-chromebook | 1

Details: https://kernelci.org/test/plan/id/6242d793a1ae15b33eae068d

Results: 0 PASS, 1 FAIL, 0 SKIP
Full config: defconfig+arm64-chromebook
Compiler: gcc-10 (aarch64-linux-gnu-gcc (Debian 10.2.1-6) 10.2.1 20210110)
Plain log: https://storage.kernelci.org//cip/linux-4.19.y-cip/v4.19.235-cip70/arm64/defconfig+arm64-chromebook/gcc-10/lab-collabora/ltp-fcntl-locktests-rk3399-gru-kevin.txt
HTML log: https://storage.kernelci.org//cip/linux-4.19.y-cip/v4.19.235-cip70/arm64/defconfig+arm64-chromebook/gcc-10/lab-collabora/ltp-fcntl-locktests-rk3399-gru-kevin.html
Rootfs: http://storage.kernelci.org/images/rootfs/debian/bullseye-ltp/20220311.1/arm64/initrd.cpio.gz


* ltp-fcntl-locktests.login: https://kernelci.org/test/case/id/6242d793a1ae15b33eae068e
new failure (last pass: v4.19.229-cip67)


cip/linux-5.10.y-cip build: 190 builds: 3 failed, 187 passed, 4 errors, 10 warnings (v5.10.106-cip4) #kernelci

kernelci.org bot <bot@...>
 

cip/linux-5.10.y-cip build: 190 builds: 3 failed, 187 passed, 4 errors, 10 warnings (v5.10.106-cip4)

Full Build Summary: https://kernelci.org/build/cip/branch/linux-5.10.y-cip/kernel/v5.10.106-cip4/

Tree: cip
Branch: linux-5.10.y-cip
Git Describe: v5.10.106-cip4
Git Commit: 8bb6e30b765989a3c0924158316d689e16317cd1
Git URL: https://git.kernel.org/pub/scm/linux/kernel/git/cip/linux-cip.git
Built: 7 unique architectures

Build Failures Detected:

arm:
rpc_defconfig: (gcc-10) FAIL

mips:
ip27_defconfig: (gcc-10) FAIL
ip28_defconfig: (gcc-10) FAIL

Errors and Warnings Detected:

arc:

arm64:

arm:
rpc_defconfig (gcc-10): 4 errors

i386:

mips:
32r2el_defconfig (gcc-10): 1 warning
decstation_64_defconfig (gcc-10): 1 warning
decstation_defconfig (gcc-10): 1 warning
decstation_r4k_defconfig (gcc-10): 1 warning
lemote2f_defconfig (gcc-10): 1 warning
rm200_defconfig (gcc-10): 1 warning

riscv:
rv32_defconfig (gcc-10): 4 warnings

x86_64:

Errors summary:

2 arm-linux-gnueabihf-gcc: error: unrecognized -march target: armv3m
2 arm-linux-gnueabihf-gcc: error: missing argument to ‘-march=’

Warnings summary:

3 kernel/rcu/tasks.h:707:13: warning: ‘show_rcu_tasks_rude_gp_kthread’ defined but not used [-Wunused-function]
2 WARNING: modpost: Symbol info of vmlinux is missing. Unresolved symbol check will be entirely skipped.
2 <stdin>:830:2: warning: #warning syscall fstat64 not implemented [-Wcpp]
2 <stdin>:1127:2: warning: #warning syscall fstatat64 not implemented [-Wcpp]
1 net/mac80211/mlme.c:4343:1: warning: the frame size of 1040 bytes is larger than 1024 bytes [-Wframe-larger-than=]
1 drivers/block/paride/bpck.c:32: warning: "PC" redefined

Section mismatches summary:

1 WARNING: modpost: vmlinux.o(.text+0xd040): Section mismatch in reference from the function __arm_ioremap_pfn_caller() to the function .meminit.text:memblock_is_map_memory()
1 WARNING: modpost: vmlinux.o(.text+0xce9c): Section mismatch in reference from the function __arm_ioremap_pfn_caller() to the function .meminit.text:memblock_is_map_memory()
1 WARNING: modpost: vmlinux.o(.text+0xcda4): Section mismatch in reference from the function __arm_ioremap_pfn_caller() to the function .meminit.text:memblock_is_map_memory()
1 WARNING: modpost: vmlinux.o(.text+0xcd38): Section mismatch in reference from the function __arm_ioremap_pfn_caller() to the function .meminit.text:memblock_is_map_memory()
1 WARNING: modpost: vmlinux.o(.text+0xcb84): Section mismatch in reference from the function __arm_ioremap_pfn_caller() to the function .meminit.text:memblock_is_map_memory()
1 WARNING: modpost: vmlinux.o(.text+0xcb74): Section mismatch in reference from the function __arm_ioremap_pfn_caller() to the function .meminit.text:memblock_is_map_memory()
1 WARNING: modpost: vmlinux.o(.text+0xcb6c): Section mismatch in reference from the function __arm_ioremap_pfn_caller() to the function .meminit.text:memblock_is_map_memory()
1 WARNING: modpost: vmlinux.o(.text+0xcb4c): Section mismatch in reference from the function __arm_ioremap_pfn_caller() to the function .meminit.text:memblock_is_map_memory()
1 WARNING: modpost: vmlinux.o(.text+0xcaa8): Section mismatch in reference from the function __arm_ioremap_pfn_caller() to the function .meminit.text:memblock_is_map_memory()
1 WARNING: modpost: vmlinux.o(.text+0xc8ec): Section mismatch in reference from the function __arm_ioremap_pfn_caller() to the function .meminit.text:memblock_is_map_memory()
1 WARNING: modpost: vmlinux.o(.text+0xb904): Section mismatch in reference from the function __arm_ioremap_pfn_caller() to the function .meminit.text:memblock_is_map_memory()
1 WARNING: modpost: vmlinux.o(.text+0x8054): Section mismatch in reference from the function __arm_ioremap_pfn_caller() to the function .meminit.text:memblock_is_map_memory()
1 WARNING: modpost: vmlinux.o(.text+0x7670): Section mismatch in reference from the function __arm_ioremap_pfn_caller() to the function .meminit.text:memblock_is_map_memory()

================================================================================

Detailed per-defconfig build reports:

--------------------------------------------------------------------------------
32r2el_defconfig (mips, gcc-10) — PASS, 0 errors, 1 warning, 0 section mismatches

Warnings:
WARNING: modpost: Symbol info of vmlinux is missing. Unresolved symbol check will be entirely skipped.

--------------------------------------------------------------------------------
allnoconfig (arc, gcc-10) — PASS, 0 errors, 0 warnings, 0 section mismatches

--------------------------------------------------------------------------------
allnoconfig (i386, gcc-10) — PASS, 0 errors, 0 warnings, 0 section mismatches

--------------------------------------------------------------------------------
allnoconfig (x86_64, gcc-10) — PASS, 0 errors, 0 warnings, 0 section mismatches

--------------------------------------------------------------------------------
am200epdkit_defconfig (arm, gcc-10) — PASS, 0 errors, 0 warnings, 0 section mismatches

--------------------------------------------------------------------------------
ar7_defconfig (mips, gcc-10) — PASS, 0 errors, 0 warnings, 0 section mismatches

--------------------------------------------------------------------------------
aspeed_g4_defconfig (arm, gcc-10) — PASS, 0 errors, 0 warnings, 0 section mismatches

--------------------------------------------------------------------------------
aspeed_g5_defconfig (arm, gcc-10) — PASS, 0 errors, 0 warnings, 0 section mismatches

--------------------------------------------------------------------------------
assabet_defconfig (arm, gcc-10) — PASS, 0 errors, 0 warnings, 0 section mismatches

Section mismatches:
WARNING: modpost: vmlinux.o(.text+0xcb6c): Section mismatch in reference from the function __arm_ioremap_pfn_caller() to the function .meminit.text:memblock_is_map_memory()

--------------------------------------------------------------------------------
at91_dt_defconfig (arm, gcc-10) — PASS, 0 errors, 0 warnings, 0 section mismatches

--------------------------------------------------------------------------------
ath25_defconfig (mips, gcc-10) — PASS, 0 errors, 0 warnings, 0 section mismatches

--------------------------------------------------------------------------------
ath79_defconfig (mips, gcc-10) — PASS, 0 errors, 0 warnings, 0 section mismatches

--------------------------------------------------------------------------------
axm55xx_defconfig (arm, gcc-10) — PASS, 0 errors, 0 warnings, 0 section mismatches

--------------------------------------------------------------------------------
axs103_defconfig (arc, gcc-10) — PASS, 0 errors, 0 warnings, 0 section mismatches

--------------------------------------------------------------------------------
axs103_smp_defconfig (arc, gcc-10) — PASS, 0 errors, 0 warnings, 0 section mismatches

--------------------------------------------------------------------------------
badge4_defconfig (arm, gcc-10) — PASS, 0 errors, 0 warnings, 0 section mismatches

Section mismatches:
WARNING: modpost: vmlinux.o(.text+0xcd38): Section mismatch in reference from the function __arm_ioremap_pfn_caller() to the function .meminit.text:memblock_is_map_memory()

--------------------------------------------------------------------------------
bcm2835_defconfig (arm, gcc-10) — PASS, 0 errors, 0 warnings, 0 section mismatches

--------------------------------------------------------------------------------
bcm47xx_defconfig (mips, gcc-10) — PASS, 0 errors, 0 warnings, 0 section mismatches

--------------------------------------------------------------------------------
bcm63xx_defconfig (mips, gcc-10) — PASS, 0 errors, 0 warnings, 0 section mismatches

--------------------------------------------------------------------------------
bigsur_defconfig (mips, gcc-10) — PASS, 0 errors, 0 warnings, 0 section mismatches

--------------------------------------------------------------------------------
bmips_be_defconfig (mips, gcc-10) — PASS, 0 errors, 0 warnings, 0 section mismatches

--------------------------------------------------------------------------------
bmips_stb_defconfig (mips, gcc-10) — PASS, 0 errors, 0 warnings, 0 section mismatches

--------------------------------------------------------------------------------
capcella_defconfig (mips, gcc-10) — PASS, 0 errors, 0 warnings, 0 section mismatches

--------------------------------------------------------------------------------
cavium_octeon_defconfig (mips, gcc-10) — PASS, 0 errors, 0 warnings, 0 section mismatches

--------------------------------------------------------------------------------
cerfcube_defconfig (arm, gcc-10) — PASS, 0 errors, 0 warnings, 0 section mismatches

Section mismatches:
WARNING: modpost: vmlinux.o(.text+0x7670): Section mismatch in reference from the function __arm_ioremap_pfn_caller() to the function .meminit.text:memblock_is_map_memory()

--------------------------------------------------------------------------------
ci20_defconfig (mips, gcc-10) — PASS, 0 errors, 0 warnings, 0 section mismatches

--------------------------------------------------------------------------------
cm_x300_defconfig (arm, gcc-10) — PASS, 0 errors, 0 warnings, 0 section mismatches

--------------------------------------------------------------------------------
cobalt_defconfig (mips, gcc-10) — PASS, 0 errors, 0 warnings, 0 section mismatches

--------------------------------------------------------------------------------
colibri_pxa270_defconfig (arm, gcc-10) — PASS, 0 errors, 0 warnings, 0 section mismatches

--------------------------------------------------------------------------------
colibri_pxa300_defconfig (arm, gcc-10) — PASS, 0 errors, 0 warnings, 0 section mismatches

--------------------------------------------------------------------------------
collie_defconfig (arm, gcc-10) — PASS, 0 errors, 0 warnings, 0 section mismatches

Section mismatches:
WARNING: modpost: vmlinux.o(.text+0xb904): Section mismatch in reference from the function __arm_ioremap_pfn_caller() to the function .meminit.text:memblock_is_map_memory()

--------------------------------------------------------------------------------
corgi_defconfig (arm, gcc-10) — PASS, 0 errors, 0 warnings, 0 section mismatches

--------------------------------------------------------------------------------
cu1000-neo_defconfig (mips, gcc-10) — PASS, 0 errors, 0 warnings, 0 section mismatches

--------------------------------------------------------------------------------
cu1830-neo_defconfig (mips, gcc-10) — PASS, 0 errors, 0 warnings, 0 section mismatches

--------------------------------------------------------------------------------
davinci_all_defconfig (arm, gcc-10) — PASS, 0 errors, 0 warnings, 0 section mismatches

--------------------------------------------------------------------------------
db1xxx_defconfig (mips, gcc-10) — PASS, 0 errors, 0 warnings, 0 section mismatches

--------------------------------------------------------------------------------
decstation_64_defconfig (mips, gcc-10) — PASS, 0 errors, 1 warning, 0 section mismatches

Warnings:
kernel/rcu/tasks.h:707:13: warning: ‘show_rcu_tasks_rude_gp_kthread’ defined but not used [-Wunused-function]

--------------------------------------------------------------------------------
decstation_defconfig (mips, gcc-10) — PASS, 0 errors, 1 warning, 0 section mismatches

Warnings:
kernel/rcu/tasks.h:707:13: warning: ‘show_rcu_tasks_rude_gp_kthread’ defined but not used [-Wunused-function]

--------------------------------------------------------------------------------
decstation_r4k_defconfig (mips, gcc-10) — PASS, 0 errors, 1 warning, 0 section mismatches

Warnings:
kernel/rcu/tasks.h:707:13: warning: ‘show_rcu_tasks_rude_gp_kthread’ defined but not used [-Wunused-function]

--------------------------------------------------------------------------------
defconfig (riscv, gcc-10) — PASS, 0 errors, 0 warnings, 0 section mismatches

--------------------------------------------------------------------------------
defconfig (arm64, gcc-10) — PASS, 0 errors, 0 warnings, 0 section mismatches

--------------------------------------------------------------------------------
defconfig+arm64-chromebook (arm64, gcc-10) — PASS, 0 errors, 0 warnings, 0 section mismatches

--------------------------------------------------------------------------------
defconfig+arm64-chromebook+kselftest (arm64, gcc-10) — PASS, 0 errors, 0 warnings, 0 section mismatches

--------------------------------------------------------------------------------
defconfig+kselftest (arm64, gcc-10) — PASS, 0 errors, 0 warnings, 0 section mismatches

--------------------------------------------------------------------------------
dove_defconfig (arm, gcc-10) — PASS, 0 errors, 0 warnings, 0 section mismatches

--------------------------------------------------------------------------------
e55_defconfig (mips, gcc-10) — PASS, 0 errors, 0 warnings, 0 section mismatches

--------------------------------------------------------------------------------
ebsa110_defconfig (arm, gcc-10) — PASS, 0 errors, 0 warnings, 0 section mismatches

--------------------------------------------------------------------------------
efm32_defconfig (arm, gcc-10) — PASS, 0 errors, 0 warnings, 0 section mismatches

--------------------------------------------------------------------------------
ep93xx_defconfig (arm, gcc-10) — PASS, 0 errors, 0 warnings, 0 section mismatches

Section mismatches:
WARNING: modpost: vmlinux.o(.text+0x8054): Section mismatch in reference from the function __arm_ioremap_pfn_caller() to the function .meminit.text:memblock_is_map_memory()

--------------------------------------------------------------------------------
eseries_pxa_defconfig (arm, gcc-10) — PASS, 0 errors, 0 warnings, 0 section mismatches

--------------------------------------------------------------------------------
exynos_defconfig (arm, gcc-10) — PASS, 0 errors, 0 warnings, 0 section mismatches

--------------------------------------------------------------------------------
ezx_defconfig (arm, gcc-10) — PASS, 0 errors, 0 warnings, 0 section mismatches

--------------------------------------------------------------------------------
footbridge_defconfig (arm, gcc-10) — PASS, 0 errors, 0 warnings, 0 section mismatches

--------------------------------------------------------------------------------
fuloong2e_defconfig (mips, gcc-10) — PASS, 0 errors, 0 warnings, 0 section mismatches

--------------------------------------------------------------------------------
gcw0_defconfig (mips, gcc-10) — PASS, 0 errors, 0 warnings, 0 section mismatches

--------------------------------------------------------------------------------
gemini_defconfig (arm, gcc-10) — PASS, 0 errors, 0 warnings, 0 section mismatches

--------------------------------------------------------------------------------
gpr_defconfig (mips, gcc-10) — PASS, 0 errors, 0 warnings, 0 section mismatches

--------------------------------------------------------------------------------
h3600_defconfig (arm, gcc-10) — PASS, 0 errors, 0 warnings, 0 section mismatches

Section mismatches:
WARNING: modpost: vmlinux.o(.text+0xcb84): Section mismatch in reference from the function __arm_ioremap_pfn_caller() to the function .meminit.text:memblock_is_map_memory()

--------------------------------------------------------------------------------
h5000_defconfig (arm, gcc-10) — PASS, 0 errors, 0 warnings, 0 section mismatches

--------------------------------------------------------------------------------
hackkit_defconfig (arm, gcc-10) — PASS, 0 errors, 0 warnings, 0 section mismatches

Section mismatches:
WARNING: modpost: vmlinux.o(.text+0xce9c): Section mismatch in reference from the function __arm_ioremap_pfn_caller() to the function .meminit.text:memblock_is_map_memory()

--------------------------------------------------------------------------------
haps_hs_defconfig (arc, gcc-10) — PASS, 0 errors, 0 warnings, 0 section mismatches

--------------------------------------------------------------------------------
haps_hs_smp_defconfig (arc, gcc-10) — PASS, 0 errors, 0 warnings, 0 section mismatches

--------------------------------------------------------------------------------
hisi_defconfig (arm, gcc-10) — PASS, 0 errors, 0 warnings, 0 section mismatches

--------------------------------------------------------------------------------
hsdk_defconfig (arc, gcc-10) — PASS, 0 errors, 0 warnings, 0 section mismatches

--------------------------------------------------------------------------------
i386_defconfig (i386, gcc-10) — PASS, 0 errors, 0 warnings, 0 section mismatches

--------------------------------------------------------------------------------
imote2_defconfig (arm, gcc-10) — PASS, 0 errors, 0 warnings, 0 section mismatches

--------------------------------------------------------------------------------
imx_v4_v5_defconfig (arm, gcc-10) — PASS, 0 errors, 0 warnings, 0 section mismatches

--------------------------------------------------------------------------------
imx_v6_v7_defconfig (arm, gcc-10) — PASS, 0 errors, 0 warnings, 0 section mismatches

--------------------------------------------------------------------------------
integrator_defconfig (arm, gcc-10) — PASS, 0 errors, 0 warnings, 0 section mismatches

--------------------------------------------------------------------------------
iop32x_defconfig (arm, gcc-10) — PASS, 0 errors, 0 warnings, 0 section mismatches

--------------------------------------------------------------------------------
ip22_defconfig (mips, gcc-10) — PASS, 0 errors, 0 warnings, 0 section mismatches

--------------------------------------------------------------------------------
ip27_defconfig (mips, gcc-10) — FAIL, 0 errors, 0 warnings, 0 section mismatches

--------------------------------------------------------------------------------
ip28_defconfig (mips, gcc-10) — FAIL, 0 errors, 0 warnings, 0 section mismatches

--------------------------------------------------------------------------------
ip32_defconfig (mips, gcc-10) — PASS, 0 errors, 0 warnings, 0 section mismatches

--------------------------------------------------------------------------------
ixp4xx_defconfig (arm, gcc-10) — PASS, 0 errors, 0 warnings, 0 section mismatches

--------------------------------------------------------------------------------
jazz_defconfig (mips, gcc-10) — PASS, 0 errors, 0 warnings, 0 section mismatches

--------------------------------------------------------------------------------
jmr3927_defconfig (mips, gcc-10) — PASS, 0 errors, 0 warnings, 0 section mismatches

--------------------------------------------------------------------------------
jornada720_defconfig (arm, gcc-10) — PASS, 0 errors, 0 warnings, 0 section mismatches

Section mismatches:
WARNING: modpost: vmlinux.o(.text+0xcaa8): Section mismatch in reference from the function __arm_ioremap_pfn_caller() to the function .meminit.text:memblock_is_map_memory()

--------------------------------------------------------------------------------
keystone_defconfig (arm, gcc-10) — PASS, 0 errors, 0 warnings, 0 section mismatches

--------------------------------------------------------------------------------
lart_defconfig (arm, gcc-10) — PASS, 0 errors, 0 warnings, 0 section mismatches

Section mismatches:
WARNING: modpost: vmlinux.o(.text+0xcb74): Section mismatch in reference from the function __arm_ioremap_pfn_caller() to the function .meminit.text:memblock_is_map_memory()

--------------------------------------------------------------------------------
lemote2f_defconfig (mips, gcc-10) — PASS, 0 errors, 1 warning, 0 section mismatches

Warnings:
net/mac80211/mlme.c:4343:1: warning: the frame size of 1040 bytes is larger than 1024 bytes [-Wframe-larger-than=]

--------------------------------------------------------------------------------
loongson1b_defconfig (mips, gcc-10) — PASS, 0 errors, 0 warnings, 0 section mismatches

--------------------------------------------------------------------------------
loongson1c_defconfig (mips, gcc-10) — PASS, 0 errors, 0 warnings, 0 section mismatches

--------------------------------------------------------------------------------
loongson3_defconfig (mips, gcc-10) — PASS, 0 errors, 0 warnings, 0 section mismatches

--------------------------------------------------------------------------------
lpc18xx_defconfig (arm, gcc-10) — PASS, 0 errors, 0 warnings, 0 section mismatches

--------------------------------------------------------------------------------
lpc32xx_defconfig (arm, gcc-10) — PASS, 0 errors, 0 warnings, 0 section mismatches

--------------------------------------------------------------------------------
lpd270_defconfig (arm, gcc-10) — PASS, 0 errors, 0 warnings, 0 section mismatches

--------------------------------------------------------------------------------
lubbock_defconfig (arm, gcc-10) — PASS, 0 errors, 0 warnings, 0 section mismatches

--------------------------------------------------------------------------------
magician_defconfig (arm, gcc-10) — PASS, 0 errors, 0 warnings, 0 section mismatches

--------------------------------------------------------------------------------
mainstone_defconfig (arm, gcc-10) — PASS, 0 errors, 0 warnings, 0 section mismatches

--------------------------------------------------------------------------------
malta_defconfig (mips, gcc-10) — PASS, 0 errors, 0 warnings, 0 section mismatches

--------------------------------------------------------------------------------
malta_kvm_defconfig (mips, gcc-10) — PASS, 0 errors, 0 warnings, 0 section mismatches

--------------------------------------------------------------------------------
malta_kvm_guest_defconfig (mips, gcc-10) — PASS, 0 errors, 0 warnings, 0 section mismatches

--------------------------------------------------------------------------------
malta_qemu_32r6_defconfig (mips, gcc-10) — PASS, 0 errors, 0 warnings, 0 section mismatches

--------------------------------------------------------------------------------
maltaaprp_defconfig (mips, gcc-10) — PASS, 0 errors, 0 warnings, 0 section mismatches

--------------------------------------------------------------------------------
maltasmvp_defconfig (mips, gcc-10) — PASS, 0 errors, 0 warnings, 0 section mismatches

--------------------------------------------------------------------------------
maltasmvp_eva_defconfig (mips, gcc-10) — PASS, 0 errors, 0 warnings, 0 section mismatches

--------------------------------------------------------------------------------
maltaup_defconfig (mips, gcc-10) — PASS, 0 errors, 0 warnings, 0 section mismatches

--------------------------------------------------------------------------------
maltaup_xpa_defconfig (mips, gcc-10) — PASS, 0 errors, 0 warnings, 0 section mismatches

--------------------------------------------------------------------------------
milbeaut_m10v_defconfig (arm, gcc-10) — PASS, 0 errors, 0 warnings, 0 section mismatches

--------------------------------------------------------------------------------
mini2440_defconfig (arm, gcc-10) — PASS, 0 errors, 0 warnings, 0 section mismatches

--------------------------------------------------------------------------------
mmp2_defconfig (arm, gcc-10) — PASS, 0 errors, 0 warnings, 0 section mismatches

--------------------------------------------------------------------------------
moxart_defconfig (arm, gcc-10) — PASS, 0 errors, 0 warnings, 0 section mismatches

--------------------------------------------------------------------------------
mpc30x_defconfig (mips, gcc-10) — PASS, 0 errors, 0 warnings, 0 section mismatches

--------------------------------------------------------------------------------
mps2_defconfig (arm, gcc-10) — PASS, 0 errors, 0 warnings, 0 section mismatches

--------------------------------------------------------------------------------
mtx1_defconfig (mips, gcc-10) — PASS, 0 errors, 0 warnings, 0 section mismatches

--------------------------------------------------------------------------------
multi_v4t_defconfig (arm, gcc-10) — PASS, 0 errors, 0 warnings, 0 section mismatches

--------------------------------------------------------------------------------
multi_v5_defconfig (arm, gcc-10) — PASS, 0 errors, 0 warnings, 0 section mismatches

--------------------------------------------------------------------------------
multi_v7_defconfig (arm, gcc-10) — PASS, 0 errors, 0 warnings, 0 section mismatches

--------------------------------------------------------------------------------
multi_v7_defconfig+kselftest (arm, gcc-10) — PASS, 0 errors, 0 warnings, 0 section mismatches

--------------------------------------------------------------------------------
mvebu_v5_defconfig (arm, gcc-10) — PASS, 0 errors, 0 warnings, 0 section mismatches

--------------------------------------------------------------------------------
mvebu_v7_defconfig (arm, gcc-10) — PASS, 0 errors, 0 warnings, 0 section mismatches

--------------------------------------------------------------------------------
mxs_defconfig (arm, gcc-10) — PASS, 0 errors, 0 warnings, 0 section mismatches

--------------------------------------------------------------------------------
neponset_defconfig (arm, gcc-10) — PASS, 0 errors, 0 warnings, 0 section mismatches

Section mismatches:
WARNING: modpost: vmlinux.o(.text+0xcda4): Section mismatch in reference from the function __arm_ioremap_pfn_caller() to the function .meminit.text:memblock_is_map_memory()

--------------------------------------------------------------------------------
netwinder_defconfig (arm, gcc-10) — PASS, 0 errors, 0 warnings, 0 section mismatches

--------------------------------------------------------------------------------
nhk8815_defconfig (arm, gcc-10) — PASS, 0 errors, 0 warnings, 0 section mismatches

--------------------------------------------------------------------------------
nlm_xlp_defconfig (mips, gcc-10) — PASS, 0 errors, 0 warnings, 0 section mismatches

--------------------------------------------------------------------------------
nlm_xlr_defconfig (mips, gcc-10) — PASS, 0 errors, 0 warnings, 0 section mismatches

--------------------------------------------------------------------------------
nommu_k210_defconfig (riscv, gcc-10) — PASS, 0 errors, 0 warnings, 0 section mismatches

--------------------------------------------------------------------------------
nsimosci_hs_defconfig (arc, gcc-10) — PASS, 0 errors, 0 warnings, 0 section mismatches

--------------------------------------------------------------------------------
nsimosci_hs_smp_defconfig (arc, gcc-10) — PASS, 0 errors, 0 warnings, 0 section mismatches

--------------------------------------------------------------------------------
omap1_defconfig (arm, gcc-10) — PASS, 0 errors, 0 warnings, 0 section mismatches

--------------------------------------------------------------------------------
omap2plus_defconfig (arm, gcc-10) — PASS, 0 errors, 0 warnings, 0 section mismatches

--------------------------------------------------------------------------------
omega2p_defconfig (mips, gcc-10) — PASS, 0 errors, 0 warnings, 0 section mismatches

--------------------------------------------------------------------------------
orion5x_defconfig (arm, gcc-10) — PASS, 0 errors, 0 warnings, 0 section mismatches

--------------------------------------------------------------------------------
oxnas_v6_defconfig (arm, gcc-10) — PASS, 0 errors, 0 warnings, 0 section mismatches

--------------------------------------------------------------------------------
palmz72_defconfig (arm, gcc-10) — PASS, 0 errors, 0 warnings, 0 section mismatches

--------------------------------------------------------------------------------
pcm027_defconfig (arm, gcc-10) — PASS, 0 errors, 0 warnings, 0 section mismatches

--------------------------------------------------------------------------------
pic32mzda_defconfig (mips, gcc-10) — PASS, 0 errors, 0 warnings, 0 section mismatches

--------------------------------------------------------------------------------
pistachio_defconfig (mips, gcc-10) — PASS, 0 errors, 0 warnings, 0 section mismatches

--------------------------------------------------------------------------------
pleb_defconfig (arm, gcc-10) — PASS, 0 errors, 0 warnings, 0 section mismatches

Section mismatches:
WARNING: modpost: vmlinux.o(.text+0xc8ec): Section mismatch in reference from the function __arm_ioremap_pfn_caller() to the function .meminit.text:memblock_is_map_memory()

--------------------------------------------------------------------------------
prima2_defconfig (arm, gcc-10) — PASS, 0 errors, 0 warnings, 0 section mismatches

--------------------------------------------------------------------------------
pxa168_defconfig (arm, gcc-10) — PASS, 0 errors, 0 warnings, 0 section mismatches

--------------------------------------------------------------------------------
pxa255-idp_defconfig (arm, gcc-10) — PASS, 0 errors, 0 warnings, 0 section mismatches

--------------------------------------------------------------------------------
pxa3xx_defconfig (arm, gcc-10) — PASS, 0 errors, 0 warnings, 0 section mismatches

--------------------------------------------------------------------------------
pxa910_defconfig (arm, gcc-10) — PASS, 0 errors, 0 warnings, 0 section mismatches

--------------------------------------------------------------------------------
pxa_defconfig (arm, gcc-10) — PASS, 0 errors, 0 warnings, 0 section mismatches

--------------------------------------------------------------------------------
qcom_defconfig (arm, gcc-10) — PASS, 0 errors, 0 warnings, 0 section mismatches

--------------------------------------------------------------------------------
qi_lb60_defconfig (mips, gcc-10) — PASS, 0 errors, 0 warnings, 0 section mismatches

--------------------------------------------------------------------------------
rb532_defconfig (mips, gcc-10) — PASS, 0 errors, 0 warnings, 0 section mismatches

--------------------------------------------------------------------------------
rbtx49xx_defconfig (mips, gcc-10) — PASS, 0 errors, 0 warnings, 0 section mismatches

--------------------------------------------------------------------------------
realview_defconfig (arm, gcc-10) — PASS, 0 errors, 0 warnings, 0 section mismatches

--------------------------------------------------------------------------------
rm200_defconfig (mips, gcc-10) — PASS, 0 errors, 1 warning, 0 section mismatches

Warnings:
drivers/block/paride/bpck.c:32: warning: "PC" redefined

--------------------------------------------------------------------------------
rpc_defconfig (arm, gcc-10) — FAIL, 4 errors, 0 warnings, 0 section mismatches

Errors:
arm-linux-gnueabihf-gcc: error: unrecognized -march target: armv3m
arm-linux-gnueabihf-gcc: error: missing argument to ‘-march=’
arm-linux-gnueabihf-gcc: error: unrecognized -march target: armv3m
arm-linux-gnueabihf-gcc: error: missing argument to ‘-march=’

--------------------------------------------------------------------------------
rs90_defconfig (mips, gcc-10) — PASS, 0 errors, 0 warnings, 0 section mismatches

--------------------------------------------------------------------------------
rt305x_defconfig (mips, gcc-10) — PASS, 0 errors, 0 warnings, 0 section mismatches

--------------------------------------------------------------------------------
rv32_defconfig (riscv, gcc-10) — PASS, 0 errors, 4 warnings, 0 section mismatches

Warnings:
<stdin>:830:2: warning: #warning syscall fstat64 not implemented [-Wcpp]
<stdin>:1127:2: warning: #warning syscall fstatat64 not implemented [-Wcpp]
<stdin>:830:2: warning: #warning syscall fstat64 not implemented [-Wcpp]
<stdin>:1127:2: warning: #warning syscall fstatat64 not implemented [-Wcpp]

--------------------------------------------------------------------------------
s3c2410_defconfig (arm, gcc-10) — PASS, 0 errors, 0 warnings, 0 section mismatches

--------------------------------------------------------------------------------
s3c6400_defconfig (arm, gcc-10) — PASS, 0 errors, 0 warnings, 0 section mismatches

--------------------------------------------------------------------------------
s5pv210_defconfig (arm, gcc-10) — PASS, 0 errors, 0 warnings, 0 section mismatches

--------------------------------------------------------------------------------
sama5_defconfig (arm, gcc-10) — PASS, 0 errors, 0 warnings, 0 section mismatches

--------------------------------------------------------------------------------
sb1250_swarm_defconfig (mips, gcc-10) — PASS, 0 errors, 0 warnings, 0 section mismatches

--------------------------------------------------------------------------------
shannon_defconfig (arm, gcc-10) — PASS, 0 errors, 0 warnings, 0 section mismatches

Section mismatches:
WARNING: modpost: vmlinux.o(.text+0xcb4c): Section mismatch in reference from the function __arm_ioremap_pfn_caller() to the function .meminit.text:memblock_is_map_memory()

--------------------------------------------------------------------------------
shmobile_defconfig (arm, gcc-10) — PASS, 0 errors, 0 warnings, 0 section mismatches

--------------------------------------------------------------------------------
simpad_defconfig (arm, gcc-10) — PASS, 0 errors, 0 warnings, 0 section mismatches

Section mismatches:
WARNING: modpost: vmlinux.o(.text+0xd040): Section mismatch in reference from the function __arm_ioremap_pfn_caller() to the function .meminit.text:memblock_is_map_memory()

--------------------------------------------------------------------------------
socfpga_defconfig (arm, gcc-10) — PASS, 0 errors, 0 warnings, 0 section mismatches

--------------------------------------------------------------------------------
spear13xx_defconfig (arm, gcc-10) — PASS, 0 errors, 0 warnings, 0 section mismatches

--------------------------------------------------------------------------------
spear3xx_defconfig (arm, gcc-10) — PASS, 0 errors, 0 warnings, 0 section mismatches

--------------------------------------------------------------------------------
spear6xx_defconfig (arm, gcc-10) — PASS, 0 errors, 0 warnings, 0 section mismatches

--------------------------------------------------------------------------------
spitz_defconfig (arm, gcc-10) — PASS, 0 errors, 0 warnings, 0 section mismatches

--------------------------------------------------------------------------------
stm32_defconfig (arm, gcc-10) — PASS, 0 errors, 0 warnings, 0 section mismatches

--------------------------------------------------------------------------------
sunxi_defconfig (arm, gcc-10) — PASS, 0 errors, 0 warnings, 0 section mismatches

--------------------------------------------------------------------------------
tango4_defconfig (arm, gcc-10) — PASS, 0 errors, 0 warnings, 0 section mismatches

--------------------------------------------------------------------------------
tb0219_defconfig (mips, gcc-10) — PASS, 0 errors, 0 warnings, 0 section mismatches

--------------------------------------------------------------------------------
tb0226_defconfig (mips, gcc-10) — PASS, 0 errors, 0 warnings, 0 section mismatches

--------------------------------------------------------------------------------
tb0287_defconfig (mips, gcc-10) — PASS, 0 errors, 0 warnings, 0 section mismatches

--------------------------------------------------------------------------------
tct_hammer_defconfig (arm, gcc-10) — PASS, 0 errors, 0 warnings, 0 section mismatches

--------------------------------------------------------------------------------
tegra_defconfig (arm, gcc-10) — PASS, 0 errors, 0 warnings, 0 section mismatches

--------------------------------------------------------------------------------
tinyconfig (x86_64, gcc-10) — PASS, 0 errors, 0 warnings, 0 section mismatches

--------------------------------------------------------------------------------
tinyconfig (i386, gcc-10) — PASS, 0 errors, 0 warnings, 0 section mismatches

--------------------------------------------------------------------------------
tinyconfig (arc, gcc-10) — PASS, 0 errors, 0 warnings, 0 section mismatches

--------------------------------------------------------------------------------
trizeps4_defconfig (arm, gcc-10) — PASS, 0 errors, 0 warnings, 0 section mismatches

--------------------------------------------------------------------------------
u300_defconfig (arm, gcc-10) — PASS, 0 errors, 0 warnings, 0 section mismatches

--------------------------------------------------------------------------------
u8500_defconfig (arm, gcc-10) — PASS, 0 errors, 0 warnings, 0 section mismatches

--------------------------------------------------------------------------------
vdk_hs38_defconfig (arc, gcc-10) — PASS, 0 errors, 0 warnings, 0 section mismatches

--------------------------------------------------------------------------------
vdk_hs38_smp_defconfig (arc, gcc-10) — PASS, 0 errors, 0 warnings, 0 section mismatches

--------------------------------------------------------------------------------
versatile_defconfig (arm, gcc-10) — PASS, 0 errors, 0 warnings, 0 section mismatches

--------------------------------------------------------------------------------
vexpress_defconfig (arm, gcc-10) — PASS, 0 errors, 0 warnings, 0 section mismatches

--------------------------------------------------------------------------------
vf610m4_defconfig (arm, gcc-10) — PASS, 0 errors, 0 warnings, 0 section mismatches

--------------------------------------------------------------------------------
viper_defconfig (arm, gcc-10) — PASS, 0 errors, 0 warnings, 0 section mismatches

--------------------------------------------------------------------------------
vocore2_defconfig (mips, gcc-10) — PASS, 0 errors, 0 warnings, 0 section mismatches

--------------------------------------------------------------------------------
vt8500_v6_v7_defconfig (arm, gcc-10) — PASS, 0 errors, 0 warnings, 0 section mismatches

--------------------------------------------------------------------------------
workpad_defconfig (mips, gcc-10) — PASS, 0 errors, 0 warnings, 0 section mismatches

--------------------------------------------------------------------------------
x86_64_defconfig (x86_64, gcc-10) — PASS, 0 errors, 0 warnings, 0 section mismatches

--------------------------------------------------------------------------------
x86_64_defconfig+kselftest (x86_64, gcc-10) — PASS, 0 errors, 0 warnings, 0 section mismatches

--------------------------------------------------------------------------------
x86_64_defconfig+x86-chromebook (x86_64, gcc-10) — PASS, 0 errors, 0 warnings, 0 section mismatches

--------------------------------------------------------------------------------
x86_64_defconfig+x86-chromebook+kselftest (x86_64, gcc-10) — PASS, 0 errors, 0 warnings, 0 section mismatches

--------------------------------------------------------------------------------
xcep_defconfig (arm, gcc-10) — PASS, 0 errors, 0 warnings, 0 section mismatches

--------------------------------------------------------------------------------
zeus_defconfig (arm, gcc-10) — PASS, 0 errors, 0 warnings, 0 section mismatches

--------------------------------------------------------------------------------
zx_defconfig (arm, gcc-10) — PASS, 0 errors, 0 warnings, 0 section mismatches

---
For more info write to <info@...>


cip/linux-4.19.y-cip baseline-nfs: 8 runs, 1 regressions (v4.19.235-cip70) #kernelci

kernelci.org bot <bot@...>
 

cip/linux-4.19.y-cip baseline-nfs: 8 runs, 1 regressions (v4.19.235-cip70)

Regressions Summary
-------------------

platform | arch | lab | compiler | defconfig | regressions
-----------------+-------+---------------+----------+----------------------------+------------
rk3399-gru-kevin | arm64 | lab-collabora | gcc-10 | defconfig+arm64-chromebook | 1

Details: https://kernelci.org/test/job/cip/branch/linux-4.19.y-cip/kernel/v4.19.235-cip70/plan/baseline-nfs/

Test: baseline-nfs
Tree: cip
Branch: linux-4.19.y-cip
Describe: v4.19.235-cip70
URL: https://git.kernel.org/pub/scm/linux/kernel/git/cip/linux-cip.git
SHA: 91567a6adc2cb5217b6d7aabf7da3ac9ae6f1a79


Test Regressions
----------------


platform | arch | lab | compiler | defconfig | regressions
-----------------+-------+---------------+----------+----------------------------+------------
rk3399-gru-kevin | arm64 | lab-collabora | gcc-10 | defconfig+arm64-chromebook | 1

Details: https://kernelci.org/test/plan/id/6242d81a06bdf7f640ae0694

Results: 82 PASS, 6 FAIL, 0 SKIP
Full config: defconfig+arm64-chromebook
Compiler: gcc-10 (aarch64-linux-gnu-gcc (Debian 10.2.1-6) 10.2.1 20210110)
Plain log: https://storage.kernelci.org//cip/linux-4.19.y-cip/v4.19.235-cip70/arm64/defconfig+arm64-chromebook/gcc-10/lab-collabora/baseline-nfs-rk3399-gru-kevin.txt
HTML log: https://storage.kernelci.org//cip/linux-4.19.y-cip/v4.19.235-cip70/arm64/defconfig+arm64-chromebook/gcc-10/lab-collabora/baseline-nfs-rk3399-gru-kevin.html
Rootfs: http://storage.kernelci.org/images/rootfs/debian/bullseye/20220311.1/arm64/initrd.cpio.gz


* baseline-nfs.bootrr.rockchip-i2s1-probed: https://kernelci.org/test/case/id/6242d81b06bdf7f640ae06b5
new failure (last pass: v4.19.229-cip67)

2022-03-29T09:57:22.749317 <8>[ 37.456083] <LAVA_SIGNAL_TESTCASE TEST_CASE_ID=rockchip-i2s0-probed RESULT=pass>
2022-03-29T09:57:23.773892 /lava-5968685/1/../bin/lava-test-case
2022-03-29T09:57:23.800683 <8>[ 38.507222] <LAVA_SIGNAL_TESTCASE TEST_CASE_ID=rockchip-i2s1-probed RESULT=fail>


cip/linux-4.19.y-cip baseline: 86 runs, 1 regressions (v4.19.235-cip70) #kernelci

kernelci.org bot <bot@...>
 

cip/linux-4.19.y-cip baseline: 86 runs, 1 regressions (v4.19.235-cip70)

Regressions Summary
-------------------

platform | arch | lab | compiler | defconfig | regressions
-----------------+-------+---------------+----------+----------------------------+------------
rk3399-gru-kevin | arm64 | lab-collabora | gcc-10 | defconfig+arm64-chromebook | 1

Details: https://kernelci.org/test/job/cip/branch/linux-4.19.y-cip/kernel/v4.19.235-cip70/plan/baseline/

Test: baseline
Tree: cip
Branch: linux-4.19.y-cip
Describe: v4.19.235-cip70
URL: https://git.kernel.org/pub/scm/linux/kernel/git/cip/linux-cip.git
SHA: 91567a6adc2cb5217b6d7aabf7da3ac9ae6f1a79


Test Regressions
----------------


platform | arch | lab | compiler | defconfig | regressions
-----------------+-------+---------------+----------+----------------------------+------------
rk3399-gru-kevin | arm64 | lab-collabora | gcc-10 | defconfig+arm64-chromebook | 1

Details: https://kernelci.org/test/plan/id/6242d681606a2910b1ae067c

Results: 83 PASS, 7 FAIL, 0 SKIP
Full config: defconfig+arm64-chromebook
Compiler: gcc-10 (aarch64-linux-gnu-gcc (Debian 10.2.1-6) 10.2.1 20210110)
Plain log: https://storage.kernelci.org//cip/linux-4.19.y-cip/v4.19.235-cip70/arm64/defconfig+arm64-chromebook/gcc-10/lab-collabora/baseline-rk3399-gru-kevin.txt
HTML log: https://storage.kernelci.org//cip/linux-4.19.y-cip/v4.19.235-cip70/arm64/defconfig+arm64-chromebook/gcc-10/lab-collabora/baseline-rk3399-gru-kevin.html
Rootfs: http://storage.kernelci.org/images/rootfs/buildroot/buildroot-baseline/20220228.1/arm64/rootfs.cpio.gz


* baseline.bootrr.rockchip-i2s1-probed: https://kernelci.org/test/case/id/6242d681606a2910b1ae069e
new failure (last pass: v4.19.229-cip67)

2022-03-29T09:50:50.951167 /lava-5968679/1/../bin/lava-test-case
2022-03-29T09:50:50.959880 <8>[ 36.756488] <LAVA_SIGNAL_TESTCASE TEST_CASE_ID=rockchip-i2s1-probed RESULT=fail>


cip/linux-4.19.y-cip build: 120 builds: 1 failed, 119 passed, 2 errors, 22 warnings (v4.19.235-cip70) #kernelci

kernelci.org bot <bot@...>
 

cip/linux-4.19.y-cip build: 120 builds: 1 failed, 119 passed, 2 errors, 22 warnings (v4.19.235-cip70)

Full Build Summary: https://kernelci.org/build/cip/branch/linux-4.19.y-cip/kernel/v4.19.235-cip70/

Tree: cip
Branch: linux-4.19.y-cip
Git Describe: v4.19.235-cip70
Git Commit: 91567a6adc2cb5217b6d7aabf7da3ac9ae6f1a79
Git URL: https://git.kernel.org/pub/scm/linux/kernel/git/cip/linux-cip.git
Built: 3 unique architectures

Build Failure Detected:

arm:
rpc_defconfig: (gcc-10) FAIL

Errors and Warnings Detected:

arm64:
cip://4.19.y-cip/arm64/qemu_arm64_defconfig (gcc-10): 3 warnings
defconfig (gcc-10): 3 warnings
defconfig+arm64-chromebook (gcc-10): 3 warnings

arm:
omap1_defconfig (gcc-10): 1 warning
rpc_defconfig (gcc-10): 2 errors

x86_64:
allnoconfig (gcc-10): 3 warnings
cip://4.19.y-cip/x86/cip_qemu_defconfig (gcc-10): 3 warnings
x86_64_defconfig (gcc-10): 3 warnings
x86_64_defconfig+x86-chromebook (gcc-10): 3 warnings

Errors summary:

1 arm-linux-gnueabihf-gcc: error: unrecognized -march target: armv3
1 arm-linux-gnueabihf-gcc: error: missing argument to ‘-march=’

Warnings summary:

9 aarch64-linux-gnu-ld: warning: -z norelro ignored
4 ld: warning: creating DT_TEXTREL in a PIE
4 ld: arch/x86/boot/compressed/head_64.o: warning: relocation in read-only section `.head.text'
4 arch/x86/entry/entry_64.S:1738: Warning: no instruction mnemonic suffix given and no register operands; using default for `sysret'
1 drivers/gpio/gpio-omap.c:1233:34: warning: array ‘omap_gpio_match’ assumed to have one element

================================================================================

Detailed per-defconfig build reports:

--------------------------------------------------------------------------------
acs5k_defconfig (arm, gcc-10) — PASS, 0 errors, 0 warnings, 0 section mismatches

--------------------------------------------------------------------------------
acs5k_tiny_defconfig (arm, gcc-10) — PASS, 0 errors, 0 warnings, 0 section mismatches

--------------------------------------------------------------------------------
allnoconfig (x86_64, gcc-10) — PASS, 0 errors, 3 warnings, 0 section mismatches

Warnings:
arch/x86/entry/entry_64.S:1738: Warning: no instruction mnemonic suffix given and no register operands; using default for `sysret'
ld: arch/x86/boot/compressed/head_64.o: warning: relocation in read-only section `.head.text'
ld: warning: creating DT_TEXTREL in a PIE

--------------------------------------------------------------------------------
am200epdkit_defconfig (arm, gcc-10) — PASS, 0 errors, 0 warnings, 0 section mismatches

--------------------------------------------------------------------------------
aspeed_g4_defconfig (arm, gcc-10) — PASS, 0 errors, 0 warnings, 0 section mismatches

--------------------------------------------------------------------------------
aspeed_g5_defconfig (arm, gcc-10) — PASS, 0 errors, 0 warnings, 0 section mismatches

--------------------------------------------------------------------------------
assabet_defconfig (arm, gcc-10) — PASS, 0 errors, 0 warnings, 0 section mismatches

--------------------------------------------------------------------------------
at91_dt_defconfig (arm, gcc-10) — PASS, 0 errors, 0 warnings, 0 section mismatches

--------------------------------------------------------------------------------
axm55xx_defconfig (arm, gcc-10) — PASS, 0 errors, 0 warnings, 0 section mismatches

--------------------------------------------------------------------------------
badge4_defconfig (arm, gcc-10) — PASS, 0 errors, 0 warnings, 0 section mismatches

--------------------------------------------------------------------------------
bcm2835_defconfig (arm, gcc-10) — PASS, 0 errors, 0 warnings, 0 section mismatches

--------------------------------------------------------------------------------
cerfcube_defconfig (arm, gcc-10) — PASS, 0 errors, 0 warnings, 0 section mismatches

--------------------------------------------------------------------------------
cip://4.19.y-cip/arm/qemu_arm_defconfig (arm, gcc-10) — PASS, 0 errors, 0 warnings, 0 section mismatches

--------------------------------------------------------------------------------
cip://4.19.y-cip/arm64/qemu_arm64_defconfig (arm64, gcc-10) — PASS, 0 errors, 3 warnings, 0 section mismatches

Warnings:
aarch64-linux-gnu-ld: warning: -z norelro ignored
aarch64-linux-gnu-ld: warning: -z norelro ignored
aarch64-linux-gnu-ld: warning: -z norelro ignored

--------------------------------------------------------------------------------
cip://4.19.y-cip/x86/cip_qemu_defconfig (x86_64, gcc-10) — PASS, 0 errors, 3 warnings, 0 section mismatches

Warnings:
arch/x86/entry/entry_64.S:1738: Warning: no instruction mnemonic suffix given and no register operands; using default for `sysret'
ld: arch/x86/boot/compressed/head_64.o: warning: relocation in read-only section `.head.text'
ld: warning: creating DT_TEXTREL in a PIE

--------------------------------------------------------------------------------
cm_x2xx_defconfig (arm, gcc-10) — PASS, 0 errors, 0 warnings, 0 section mismatches

--------------------------------------------------------------------------------
cm_x300_defconfig (arm, gcc-10) — PASS, 0 errors, 0 warnings, 0 section mismatches

--------------------------------------------------------------------------------
colibri_pxa270_defconfig (arm, gcc-10) — PASS, 0 errors, 0 warnings, 0 section mismatches

--------------------------------------------------------------------------------
colibri_pxa300_defconfig (arm, gcc-10) — PASS, 0 errors, 0 warnings, 0 section mismatches

--------------------------------------------------------------------------------
collie_defconfig (arm, gcc-10) — PASS, 0 errors, 0 warnings, 0 section mismatches

--------------------------------------------------------------------------------
corgi_defconfig (arm, gcc-10) — PASS, 0 errors, 0 warnings, 0 section mismatches

--------------------------------------------------------------------------------
davinci_all_defconfig (arm, gcc-10) — PASS, 0 errors, 0 warnings, 0 section mismatches

--------------------------------------------------------------------------------
defconfig (arm64, gcc-10) — PASS, 0 errors, 3 warnings, 0 section mismatches

Warnings:
aarch64-linux-gnu-ld: warning: -z norelro ignored
aarch64-linux-gnu-ld: warning: -z norelro ignored
aarch64-linux-gnu-ld: warning: -z norelro ignored

--------------------------------------------------------------------------------
defconfig+arm64-chromebook (arm64, gcc-10) — PASS, 0 errors, 3 warnings, 0 section mismatches

Warnings:
aarch64-linux-gnu-ld: warning: -z norelro ignored
aarch64-linux-gnu-ld: warning: -z norelro ignored
aarch64-linux-gnu-ld: warning: -z norelro ignored

--------------------------------------------------------------------------------
dove_defconfig (arm, gcc-10) — PASS, 0 errors, 0 warnings, 0 section mismatches

--------------------------------------------------------------------------------
ebsa110_defconfig (arm, gcc-10) — PASS, 0 errors, 0 warnings, 0 section mismatches

--------------------------------------------------------------------------------
efm32_defconfig (arm, gcc-10) — PASS, 0 errors, 0 warnings, 0 section mismatches

--------------------------------------------------------------------------------
em_x270_defconfig (arm, gcc-10) — PASS, 0 errors, 0 warnings, 0 section mismatches

--------------------------------------------------------------------------------
ep93xx_defconfig (arm, gcc-10) — PASS, 0 errors, 0 warnings, 0 section mismatches

--------------------------------------------------------------------------------
eseries_pxa_defconfig (arm, gcc-10) — PASS, 0 errors, 0 warnings, 0 section mismatches

--------------------------------------------------------------------------------
exynos_defconfig (arm, gcc-10) — PASS, 0 errors, 0 warnings, 0 section mismatches

--------------------------------------------------------------------------------
ezx_defconfig (arm, gcc-10) — PASS, 0 errors, 0 warnings, 0 section mismatches

--------------------------------------------------------------------------------
footbridge_defconfig (arm, gcc-10) — PASS, 0 errors, 0 warnings, 0 section mismatches

--------------------------------------------------------------------------------
gemini_defconfig (arm, gcc-10) — PASS, 0 errors, 0 warnings, 0 section mismatches

--------------------------------------------------------------------------------
h3600_defconfig (arm, gcc-10) — PASS, 0 errors, 0 warnings, 0 section mismatches

--------------------------------------------------------------------------------
h5000_defconfig (arm, gcc-10) — PASS, 0 errors, 0 warnings, 0 section mismatches

--------------------------------------------------------------------------------
hackkit_defconfig (arm, gcc-10) — PASS, 0 errors, 0 warnings, 0 section mismatches

--------------------------------------------------------------------------------
hisi_defconfig (arm, gcc-10) — PASS, 0 errors, 0 warnings, 0 section mismatches

--------------------------------------------------------------------------------
imote2_defconfig (arm, gcc-10) — PASS, 0 errors, 0 warnings, 0 section mismatches

--------------------------------------------------------------------------------
imx_v4_v5_defconfig (arm, gcc-10) — PASS, 0 errors, 0 warnings, 0 section mismatches

--------------------------------------------------------------------------------
imx_v6_v7_defconfig (arm, gcc-10) — PASS, 0 errors, 0 warnings, 0 section mismatches

--------------------------------------------------------------------------------
integrator_defconfig (arm, gcc-10) — PASS, 0 errors, 0 warnings, 0 section mismatches

--------------------------------------------------------------------------------
iop13xx_defconfig (arm, gcc-10) — PASS, 0 errors, 0 warnings, 0 section mismatches

--------------------------------------------------------------------------------
iop32x_defconfig (arm, gcc-10) — PASS, 0 errors, 0 warnings, 0 section mismatches

--------------------------------------------------------------------------------
iop33x_defconfig (arm, gcc-10) — PASS, 0 errors, 0 warnings, 0 section mismatches

--------------------------------------------------------------------------------
ixp4xx_defconfig (arm, gcc-10) — PASS, 0 errors, 0 warnings, 0 section mismatches

--------------------------------------------------------------------------------
jornada720_defconfig (arm, gcc-10) — PASS, 0 errors, 0 warnings, 0 section mismatches

--------------------------------------------------------------------------------
keystone_defconfig (arm, gcc-10) — PASS, 0 errors, 0 warnings, 0 section mismatches

--------------------------------------------------------------------------------
ks8695_defconfig (arm, gcc-10) — PASS, 0 errors, 0 warnings, 0 section mismatches

--------------------------------------------------------------------------------
lart_defconfig (arm, gcc-10) — PASS, 0 errors, 0 warnings, 0 section mismatches

--------------------------------------------------------------------------------
lpc18xx_defconfig (arm, gcc-10) — PASS, 0 errors, 0 warnings, 0 section mismatches

--------------------------------------------------------------------------------
lpc32xx_defconfig (arm, gcc-10) — PASS, 0 errors, 0 warnings, 0 section mismatches

--------------------------------------------------------------------------------
lpd270_defconfig (arm, gcc-10) — PASS, 0 errors, 0 warnings, 0 section mismatches

--------------------------------------------------------------------------------
lubbock_defconfig (arm, gcc-10) — PASS, 0 errors, 0 warnings, 0 section mismatches

--------------------------------------------------------------------------------
magician_defconfig (arm, gcc-10) — PASS, 0 errors, 0 warnings, 0 section mismatches

--------------------------------------------------------------------------------
mainstone_defconfig (arm, gcc-10) — PASS, 0 errors, 0 warnings, 0 section mismatches

--------------------------------------------------------------------------------
mini2440_defconfig (arm, gcc-10) — PASS, 0 errors, 0 warnings, 0 section mismatches

--------------------------------------------------------------------------------
mmp2_defconfig (arm, gcc-10) — PASS, 0 errors, 0 warnings, 0 section mismatches

--------------------------------------------------------------------------------
moxart_defconfig (arm, gcc-10) — PASS, 0 errors, 0 warnings, 0 section mismatches

--------------------------------------------------------------------------------
mps2_defconfig (arm, gcc-10) — PASS, 0 errors, 0 warnings, 0 section mismatches

--------------------------------------------------------------------------------
multi_v4t_defconfig (arm, gcc-10) — PASS, 0 errors, 0 warnings, 0 section mismatches

--------------------------------------------------------------------------------
multi_v5_defconfig (arm, gcc-10) — PASS, 0 errors, 0 warnings, 0 section mismatches

--------------------------------------------------------------------------------
multi_v7_defconfig (arm, gcc-10) — PASS, 0 errors, 0 warnings, 0 section mismatches

--------------------------------------------------------------------------------
mvebu_v5_defconfig (arm, gcc-10) — PASS, 0 errors, 0 warnings, 0 section mismatches

--------------------------------------------------------------------------------
mvebu_v7_defconfig (arm, gcc-10) — PASS, 0 errors, 0 warnings, 0 section mismatches

--------------------------------------------------------------------------------
mxs_defconfig (arm, gcc-10) — PASS, 0 errors, 0 warnings, 0 section mismatches

--------------------------------------------------------------------------------
neponset_defconfig (arm, gcc-10) — PASS, 0 errors, 0 warnings, 0 section mismatches

--------------------------------------------------------------------------------
netwinder_defconfig (arm, gcc-10) — PASS, 0 errors, 0 warnings, 0 section mismatches

--------------------------------------------------------------------------------
netx_defconfig (arm, gcc-10) — PASS, 0 errors, 0 warnings, 0 section mismatches

--------------------------------------------------------------------------------
nhk8815_defconfig (arm, gcc-10) — PASS, 0 errors, 0 warnings, 0 section mismatches

--------------------------------------------------------------------------------
nuc910_defconfig (arm, gcc-10) — PASS, 0 errors, 0 warnings, 0 section mismatches

--------------------------------------------------------------------------------
nuc950_defconfig (arm, gcc-10) — PASS, 0 errors, 0 warnings, 0 section mismatches

--------------------------------------------------------------------------------
nuc960_defconfig (arm, gcc-10) — PASS, 0 errors, 0 warnings, 0 section mismatches

--------------------------------------------------------------------------------
omap1_defconfig (arm, gcc-10) — PASS, 0 errors, 1 warning, 0 section mismatches

Warnings:
drivers/gpio/gpio-omap.c:1233:34: warning: array ‘omap_gpio_match’ assumed to have one element

--------------------------------------------------------------------------------
omap2plus_defconfig (arm, gcc-10) — PASS, 0 errors, 0 warnings, 0 section mismatches

--------------------------------------------------------------------------------
orion5x_defconfig (arm, gcc-10) — PASS, 0 errors, 0 warnings, 0 section mismatches

--------------------------------------------------------------------------------
oxnas_v6_defconfig (arm, gcc-10) — PASS, 0 errors, 0 warnings, 0 section mismatches

--------------------------------------------------------------------------------
palmz72_defconfig (arm, gcc-10) — PASS, 0 errors, 0 warnings, 0 section mismatches

--------------------------------------------------------------------------------
pcm027_defconfig (arm, gcc-10) — PASS, 0 errors, 0 warnings, 0 section mismatches

--------------------------------------------------------------------------------
pleb_defconfig (arm, gcc-10) — PASS, 0 errors, 0 warnings, 0 section mismatches

--------------------------------------------------------------------------------
prima2_defconfig (arm, gcc-10) — PASS, 0 errors, 0 warnings, 0 section mismatches

--------------------------------------------------------------------------------
pxa168_defconfig (arm, gcc-10) — PASS, 0 errors, 0 warnings, 0 section mismatches

--------------------------------------------------------------------------------
pxa255-idp_defconfig (arm, gcc-10) — PASS, 0 errors, 0 warnings, 0 section mismatches

--------------------------------------------------------------------------------
pxa3xx_defconfig (arm, gcc-10) — PASS, 0 errors, 0 warnings, 0 section mismatches

--------------------------------------------------------------------------------
pxa910_defconfig (arm, gcc-10) — PASS, 0 errors, 0 warnings, 0 section mismatches

--------------------------------------------------------------------------------
pxa_defconfig (arm, gcc-10) — PASS, 0 errors, 0 warnings, 0 section mismatches

--------------------------------------------------------------------------------
qcom_defconfig (arm, gcc-10) — PASS, 0 errors, 0 warnings, 0 section mismatches

--------------------------------------------------------------------------------
raumfeld_defconfig (arm, gcc-10) — PASS, 0 errors, 0 warnings, 0 section mismatches

--------------------------------------------------------------------------------
realview_defconfig (arm, gcc-10) — PASS, 0 errors, 0 warnings, 0 section mismatches

--------------------------------------------------------------------------------
rpc_defconfig (arm, gcc-10) — FAIL, 2 errors, 0 warnings, 0 section mismatches

Errors:
arm-linux-gnueabihf-gcc: error: unrecognized -march target: armv3
arm-linux-gnueabihf-gcc: error: missing argument to ‘-march=’

--------------------------------------------------------------------------------
s3c2410_defconfig (arm, gcc-10) — PASS, 0 errors, 0 warnings, 0 section mismatches

--------------------------------------------------------------------------------
s3c6400_defconfig (arm, gcc-10) — PASS, 0 errors, 0 warnings, 0 section mismatches

--------------------------------------------------------------------------------
s5pv210_defconfig (arm, gcc-10) — PASS, 0 errors, 0 warnings, 0 section mismatches

--------------------------------------------------------------------------------
sama5_defconfig (arm, gcc-10) — PASS, 0 errors, 0 warnings, 0 section mismatches

--------------------------------------------------------------------------------
shannon_defconfig (arm, gcc-10) — PASS, 0 errors, 0 warnings, 0 section mismatches

--------------------------------------------------------------------------------
shmobile_defconfig (arm, gcc-10) — PASS, 0 errors, 0 warnings, 0 section mismatches

--------------------------------------------------------------------------------
simpad_defconfig (arm, gcc-10) — PASS, 0 errors, 0 warnings, 0 section mismatches

--------------------------------------------------------------------------------
socfpga_defconfig (arm, gcc-10) — PASS, 0 errors, 0 warnings, 0 section mismatches

--------------------------------------------------------------------------------
spear13xx_defconfig (arm, gcc-10) — PASS, 0 errors, 0 warnings, 0 section mismatches

--------------------------------------------------------------------------------
spear3xx_defconfig (arm, gcc-10) — PASS, 0 errors, 0 warnings, 0 section mismatches

--------------------------------------------------------------------------------
spear6xx_defconfig (arm, gcc-10) — PASS, 0 errors, 0 warnings, 0 section mismatches

--------------------------------------------------------------------------------
spitz_defconfig (arm, gcc-10) — PASS, 0 errors, 0 warnings, 0 section mismatches

--------------------------------------------------------------------------------
stm32_defconfig (arm, gcc-10) — PASS, 0 errors, 0 warnings, 0 section mismatches

--------------------------------------------------------------------------------
sunxi_defconfig (arm, gcc-10) — PASS, 0 errors, 0 warnings, 0 section mismatches

--------------------------------------------------------------------------------
tango4_defconfig (arm, gcc-10) — PASS, 0 errors, 0 warnings, 0 section mismatches

--------------------------------------------------------------------------------
tct_hammer_defconfig (arm, gcc-10) — PASS, 0 errors, 0 warnings, 0 section mismatches

--------------------------------------------------------------------------------
tegra_defconfig (arm, gcc-10) — PASS, 0 errors, 0 warnings, 0 section mismatches

--------------------------------------------------------------------------------
trizeps4_defconfig (arm, gcc-10) — PASS, 0 errors, 0 warnings, 0 section mismatches

--------------------------------------------------------------------------------
u300_defconfig (arm, gcc-10) — PASS, 0 errors, 0 warnings, 0 section mismatches

--------------------------------------------------------------------------------
u8500_defconfig (arm, gcc-10) — PASS, 0 errors, 0 warnings, 0 section mismatches

--------------------------------------------------------------------------------
versatile_defconfig (arm, gcc-10) — PASS, 0 errors, 0 warnings, 0 section mismatches

--------------------------------------------------------------------------------
vexpress_defconfig (arm, gcc-10) — PASS, 0 errors, 0 warnings, 0 section mismatches

--------------------------------------------------------------------------------
vf610m4_defconfig (arm, gcc-10) — PASS, 0 errors, 0 warnings, 0 section mismatches

--------------------------------------------------------------------------------
viper_defconfig (arm, gcc-10) — PASS, 0 errors, 0 warnings, 0 section mismatches

--------------------------------------------------------------------------------
vt8500_v6_v7_defconfig (arm, gcc-10) — PASS, 0 errors, 0 warnings, 0 section mismatches

--------------------------------------------------------------------------------
x86_64_defconfig (x86_64, gcc-10) — PASS, 0 errors, 3 warnings, 0 section mismatches

Warnings:
arch/x86/entry/entry_64.S:1738: Warning: no instruction mnemonic suffix given and no register operands; using default for `sysret'
ld: arch/x86/boot/compressed/head_64.o: warning: relocation in read-only section `.head.text'
ld: warning: creating DT_TEXTREL in a PIE

--------------------------------------------------------------------------------
x86_64_defconfig+x86-chromebook (x86_64, gcc-10) — PASS, 0 errors, 3 warnings, 0 section mismatches

Warnings:
arch/x86/entry/entry_64.S:1738: Warning: no instruction mnemonic suffix given and no register operands; using default for `sysret'
ld: arch/x86/boot/compressed/head_64.o: warning: relocation in read-only section `.head.text'
ld: warning: creating DT_TEXTREL in a PIE

--------------------------------------------------------------------------------
xcep_defconfig (arm, gcc-10) — PASS, 0 errors, 0 warnings, 0 section mismatches

--------------------------------------------------------------------------------
zeus_defconfig (arm, gcc-10) — PASS, 0 errors, 0 warnings, 0 section mismatches

--------------------------------------------------------------------------------
zx_defconfig (arm, gcc-10) — PASS, 0 errors, 0 warnings, 0 section mismatches

---
For more info write to <info@...>


[ANNOUNCE] Release v5.10.106-cip4 v4.19.235-cip70

Nobuhiro Iwamatsu
 

Hi all,

CIP kernel team has released Linux kernel v5.10.106-cip4 and v4.19.235-cip70.
The linux-5.10.y-cip tree has been updated base version from v5.10.104 to v5.10.106.
and the linux-4.19.y-cip tree has been updated base version from v4.19.233 to v4.19.235.
There are no CIP-specific patches in this release.

Yoe can get this release via the git tree at:

v5.10.106-cip4:
repository:
https://git.kernel.org/pub/scm/linux/kernel/git/cip/linux-cip.git
branch:
linux-5.10.y-cip
commit hash:
8bb6e30b765989a3c0924158316d689e16317cd1
Fixed CVEs:
- CVE-2022-0995: watch_queue, pipe: Free watchqueue state after clearing pipe ring
- CVE-2022-23040: xen/xenbus: don't let xenbus_grant_ring() remove grants in error case
- CVE-2022-23036: xen/grant-table: add gnttab_try_end_foreign_access()
- CVE-2022-23038: xen/grant-table: add gnttab_try_end_foreign_access()
- CVE-2022-23037: xen/netfront: don't use gnttab_query_foreign_access() for mapped status
- CVE-2022-23038: xen/scsifront: don't use gnttab_query_foreign_access() for mapped status
- CVE-2022-23039: xen/gntalloc: don't use gnttab_query_foreign_access()
- CVE-2022-23041: xen/9p: use alloc/free_pages_exact()
- CVE-2022-23042: xen/netfront: react properly to failing gnttab_end_foreign_access_ref()
- CVE-2022-24958: usb: gadget: don't release an existing dev->buf
- CVE-2022-23960:
added commits:
CIP: Bump version suffix to -cip4 after merge from stable

v4.19.235-cip70:
repository:
https://git.kernel.org/pub/scm/linux/kernel/git/cip/linux-cip.git
branch:
linux-4.19.y-cip
commit hash:
91567a6adc2cb5217b6d7aabf7da3ac9ae6f1a79
Fixed CVEs:
- CVE-2022-23036: xen/grant-table: add gnttab_try_end_foreign_access()
- CVE-2022-23038: xen/grant-table: add gnttab_try_end_foreign_access()
- CVE-2022-23037: xen/netfront: don't use gnttab_query_foreign_access() for mapped status
- CVE-2022-23039: xen/gntalloc: don't use gnttab_query_foreign_access()
- CVE-2022-23041: xen/9p: use alloc/free_pages_exact()
- CVE-2022-23041: xen/gnttab: fix gnttab_end_foreign_access() without page specified
- CVE-2022-23042: xen/netfront: react properly to failing gnttab_end_foreign_access_ref()
- CVE-2022-24958: usb: gadget: don't release an existing dev->buf
- CVE-2021-4149: btrfs: unlock newly allocated extent buffer after error
- CVE-2022-24958: usb: gadget: don't release an existing dev->buf
added commits:
CIP: Bump version suffix to -cip70 after merge from stable

Best regards,
Nobuhiro


cip-gitlab/ci/iwamatsu/linux-5.10.y-cip-rc ltp-timers: 8 runs, 2 regressions (v5.10.104-cip3-224-gbc5581d50c4e) #kernelci

kernelci.org bot <bot@...>
 

cip-gitlab/ci/iwamatsu/linux-5.10.y-cip-rc ltp-timers: 8 runs, 2 regressions (v5.10.104-cip3-224-gbc5581d50c4e)

Regressions Summary
-------------------

platform | arch | lab | compiler | defconfig | regressions
-------------------+--------+---------------+----------+------------------------------+------------
hp-11A-G6-EE-grunt | x86_64 | lab-collabora | gcc-10 | x86_64_defcon...6-chromebook | 2

Details: https://kernelci.org/test/job/cip-gitlab/branch/ci%2Fiwamatsu%2Flinux-5.10.y-cip-rc/kernel/v5.10.104-cip3-224-gbc5581d50c4e/plan/ltp-timers/

Test: ltp-timers
Tree: cip-gitlab
Branch: ci/iwamatsu/linux-5.10.y-cip-rc
Describe: v5.10.104-cip3-224-gbc5581d50c4e
URL: https://gitlab.com/cip-project/cip-kernel/linux-cip.git
SHA: bc5581d50c4ebee1d73a29e0e3e0ce12e959112f

Test suite revisions:
ltp-tests
URL: https://github.com/linux-test-project/ltp.git
SHA: dc836ec4cd4e02e1346001f828c1f1988a8d7d54


Test Regressions
----------------


platform | arch | lab | compiler | defconfig | regressions
-------------------+--------+---------------+----------+------------------------------+------------
hp-11A-G6-EE-grunt | x86_64 | lab-collabora | gcc-10 | x86_64_defcon...6-chromebook | 2

Details: https://kernelci.org/test/plan/id/6242411afb7dd792e0ae06ed

Results: 32 PASS, 4 FAIL, 0 SKIP
Full config: x86_64_defconfig+x86-chromebook
Compiler: gcc-10 (gcc (Debian 10.2.1-6) 10.2.1 20210110)
Plain log: https://storage.kernelci.org//cip-gitlab/ci-iwamatsu-linux-5.10.y-cip-rc/v5.10.104-cip3-224-gbc5581d50c4e/x86_64/x86_64_defconfig+x86-chromebook/gcc-10/lab-collabora/ltp-timers-hp-11A-G6-EE-grunt.txt
HTML log: https://storage.kernelci.org//cip-gitlab/ci-iwamatsu-linux-5.10.y-cip-rc/v5.10.104-cip3-224-gbc5581d50c4e/x86_64/x86_64_defconfig+x86-chromebook/gcc-10/lab-collabora/ltp-timers-hp-11A-G6-EE-grunt.html
Rootfs: http://storage.kernelci.org/images/rootfs/debian/bullseye-ltp/20220311.1/amd64/initrd.cpio.gz


* ltp-timers.clock_settime: https://kernelci.org/test/case/id/6242411afb7dd792e0ae06f2
failing since 19 days (last pass: v5.10.100-cip2-319-gcbff87047566, first fail: v5.10.100-cip2-425-g0a0d92194f39)

* ltp-timers.clock_settime: https://kernelci.org/test/case/id/6242411afb7dd792e0ae06f2
failing since 19 days (last pass: v5.10.100-cip2-319-gcbff87047566, first fail: v5.10.100-cip2-425-g0a0d92194f39)


cip-gitlab/ci/iwamatsu/linux-5.10.y-cip-rc ltp-pty: 5 runs, 4 regressions (v5.10.104-cip3-224-gbc5581d50c4e) #kernelci

kernelci.org bot <bot@...>
 

cip-gitlab/ci/iwamatsu/linux-5.10.y-cip-rc ltp-pty: 5 runs, 4 regressions (v5.10.104-cip3-224-gbc5581d50c4e)

Regressions Summary
-------------------

platform | arch | lab | compiler | defconfig | regressions
--------------------------+--------+---------------+----------+------------------------------+------------
asus-C433TA-AJ0005-rammus | x86_64 | lab-collabora | gcc-10 | x86_64_defcon...6-chromebook | 1
asus-C523NA-A20057-coral | x86_64 | lab-collabora | gcc-10 | x86_64_defcon...6-chromebook | 1
hp-11A-G6-EE-grunt | x86_64 | lab-collabora | gcc-10 | x86_64_defcon...6-chromebook | 1
rk3399-gru-kevin | arm64 | lab-collabora | gcc-10 | defconfig+arm64-chromebook | 1

Details: https://kernelci.org/test/job/cip-gitlab/branch/ci%2Fiwamatsu%2Flinux-5.10.y-cip-rc/kernel/v5.10.104-cip3-224-gbc5581d50c4e/plan/ltp-pty/

Test: ltp-pty
Tree: cip-gitlab
Branch: ci/iwamatsu/linux-5.10.y-cip-rc
Describe: v5.10.104-cip3-224-gbc5581d50c4e
URL: https://gitlab.com/cip-project/cip-kernel/linux-cip.git
SHA: bc5581d50c4ebee1d73a29e0e3e0ce12e959112f

Test suite revisions:
ltp-tests
URL: https://github.com/linux-test-project/ltp.git
SHA: dc836ec4cd4e02e1346001f828c1f1988a8d7d54


Test Regressions
----------------


platform | arch | lab | compiler | defconfig | regressions
--------------------------+--------+---------------+----------+------------------------------+------------
asus-C433TA-AJ0005-rammus | x86_64 | lab-collabora | gcc-10 | x86_64_defcon...6-chromebook | 1

Details: https://kernelci.org/test/plan/id/62423d2b71a41cce20ae0689

Results: 0 PASS, 1 FAIL, 0 SKIP
Full config: x86_64_defconfig+x86-chromebook
Compiler: gcc-10 (gcc (Debian 10.2.1-6) 10.2.1 20210110)
Plain log: https://storage.kernelci.org//cip-gitlab/ci-iwamatsu-linux-5.10.y-cip-rc/v5.10.104-cip3-224-gbc5581d50c4e/x86_64/x86_64_defconfig+x86-chromebook/gcc-10/lab-collabora/ltp-pty-asus-C433TA-AJ0005-rammus.txt
HTML log: https://storage.kernelci.org//cip-gitlab/ci-iwamatsu-linux-5.10.y-cip-rc/v5.10.104-cip3-224-gbc5581d50c4e/x86_64/x86_64_defconfig+x86-chromebook/gcc-10/lab-collabora/ltp-pty-asus-C433TA-AJ0005-rammus.html
Rootfs: http://storage.kernelci.org/images/rootfs/debian/bullseye-ltp/20220311.1/amd64/initrd.cpio.gz


* ltp-pty.login: https://kernelci.org/test/case/id/62423d2b71a41cce20ae068a
failing since 5 days (last pass: v5.10.104-cip3-132-g46c091c34fabb, first fail: v5.10.104-cip3-186-g758e0f22e236)



platform | arch | lab | compiler | defconfig | regressions
--------------------------+--------+---------------+----------+------------------------------+------------
asus-C523NA-A20057-coral | x86_64 | lab-collabora | gcc-10 | x86_64_defcon...6-chromebook | 1

Details: https://kernelci.org/test/plan/id/6242436f48dd65b8dfae067e

Results: 0 PASS, 1 FAIL, 0 SKIP
Full config: x86_64_defconfig+x86-chromebook
Compiler: gcc-10 (gcc (Debian 10.2.1-6) 10.2.1 20210110)
Plain log: https://storage.kernelci.org//cip-gitlab/ci-iwamatsu-linux-5.10.y-cip-rc/v5.10.104-cip3-224-gbc5581d50c4e/x86_64/x86_64_defconfig+x86-chromebook/gcc-10/lab-collabora/ltp-pty-asus-C523NA-A20057-coral.txt
HTML log: https://storage.kernelci.org//cip-gitlab/ci-iwamatsu-linux-5.10.y-cip-rc/v5.10.104-cip3-224-gbc5581d50c4e/x86_64/x86_64_defconfig+x86-chromebook/gcc-10/lab-collabora/ltp-pty-asus-C523NA-A20057-coral.html
Rootfs: http://storage.kernelci.org/images/rootfs/debian/bullseye-ltp/20220311.1/amd64/initrd.cpio.gz


* ltp-pty.login: https://kernelci.org/test/case/id/6242436f48dd65b8dfae067f
failing since 5 days (last pass: v5.10.104-cip3-132-g46c091c34fabb, first fail: v5.10.104-cip3-186-g758e0f22e236)



platform | arch | lab | compiler | defconfig | regressions
--------------------------+--------+---------------+----------+------------------------------+------------
hp-11A-G6-EE-grunt | x86_64 | lab-collabora | gcc-10 | x86_64_defcon...6-chromebook | 1

Details: https://kernelci.org/test/plan/id/62423d09e1bccea339ae0681

Results: 0 PASS, 1 FAIL, 0 SKIP
Full config: x86_64_defconfig+x86-chromebook
Compiler: gcc-10 (gcc (Debian 10.2.1-6) 10.2.1 20210110)
Plain log: https://storage.kernelci.org//cip-gitlab/ci-iwamatsu-linux-5.10.y-cip-rc/v5.10.104-cip3-224-gbc5581d50c4e/x86_64/x86_64_defconfig+x86-chromebook/gcc-10/lab-collabora/ltp-pty-hp-11A-G6-EE-grunt.txt
HTML log: https://storage.kernelci.org//cip-gitlab/ci-iwamatsu-linux-5.10.y-cip-rc/v5.10.104-cip3-224-gbc5581d50c4e/x86_64/x86_64_defconfig+x86-chromebook/gcc-10/lab-collabora/ltp-pty-hp-11A-G6-EE-grunt.html
Rootfs: http://storage.kernelci.org/images/rootfs/debian/bullseye-ltp/20220311.1/amd64/initrd.cpio.gz


* ltp-pty.login: https://kernelci.org/test/case/id/62423d09e1bccea339ae0682
failing since 5 days (last pass: v5.10.104-cip3-132-g46c091c34fabb, first fail: v5.10.104-cip3-186-g758e0f22e236)



platform | arch | lab | compiler | defconfig | regressions
--------------------------+--------+---------------+----------+------------------------------+------------
rk3399-gru-kevin | arm64 | lab-collabora | gcc-10 | defconfig+arm64-chromebook | 1

Details: https://kernelci.org/test/plan/id/6242425d0704707e7fae067d

Results: 0 PASS, 1 FAIL, 0 SKIP
Full config: defconfig+arm64-chromebook
Compiler: gcc-10 (aarch64-linux-gnu-gcc (Debian 10.2.1-6) 10.2.1 20210110)
Plain log: https://storage.kernelci.org//cip-gitlab/ci-iwamatsu-linux-5.10.y-cip-rc/v5.10.104-cip3-224-gbc5581d50c4e/arm64/defconfig+arm64-chromebook/gcc-10/lab-collabora/ltp-pty-rk3399-gru-kevin.txt
HTML log: https://storage.kernelci.org//cip-gitlab/ci-iwamatsu-linux-5.10.y-cip-rc/v5.10.104-cip3-224-gbc5581d50c4e/arm64/defconfig+arm64-chromebook/gcc-10/lab-collabora/ltp-pty-rk3399-gru-kevin.html
Rootfs: http://storage.kernelci.org/images/rootfs/debian/bullseye-ltp/20220311.1/arm64/initrd.cpio.gz


* ltp-pty.login: https://kernelci.org/test/case/id/6242425d0704707e7fae067e
failing since 6 days (last pass: v5.10.100-cip2-484-gede5006fb276, first fail: v5.10.104-cip3-155-g4f07dbd2df49e)

1721 - 1740 of 9573