Date   

cip-gitlab/ci/pavel/linux-test baseline: 76 runs, 38 regressions (v4.4-st5-1797-gb2b8419761095) #kernelci

kernelci.org bot <bot@...>
 

cip-gitlab/ci/pavel/linux-test baseline: 76 runs, 38 regressions (v4.4-st5-1797-gb2b8419761095)

Regressions Summary
-------------------

platform | arch | lab | compiler | defconfig | regressions
---------------------------+--------+---------------+----------+------------------------------+------------
asus-C436FA-Flip-hatch | x86_64 | lab-collabora | gcc-10 | x86_64_defcon...6-chromebook | 1
asus-cx9400-volteer | x86_64 | lab-collabora | gcc-10 | x86_64_defcon...6-chromebook | 1
at91-sama5d4_xplained | arm | lab-baylibre | gcc-10 | multi_v7_defconfig | 1
beaglebone-black | arm | lab-broonie | gcc-10 | multi_v7_defconfig | 1
beaglebone-black | arm | lab-cip | gcc-10 | multi_v7_defconfig | 1
beaglebone-black | arm | lab-broonie | gcc-10 | omap2plus_defconfig | 1
beaglebone-black | arm | lab-cip | gcc-10 | omap2plus_defconfig | 1
hp-x360-12b-n4000-octopus | x86_64 | lab-collabora | gcc-10 | x86_64_defcon...6-chromebook | 1
juno-uboot | arm64 | lab-broonie | gcc-10 | defconfig | 1
meson8b-odroidc1 | arm | lab-baylibre | gcc-10 | multi_v7_defconfig | 1
qemu_arm-virt-gicv2 | arm | lab-baylibre | gcc-10 | multi_v7_defconfig | 1
qemu_arm-virt-gicv2 | arm | lab-broonie | gcc-10 | multi_v7_defconfig | 1
qemu_arm-virt-gicv2-uefi | arm | lab-baylibre | gcc-10 | multi_v7_defconfig | 1
qemu_arm-virt-gicv2-uefi | arm | lab-broonie | gcc-10 | multi_v7_defconfig | 1
qemu_arm-virt-gicv3 | arm | lab-baylibre | gcc-10 | multi_v7_defconfig | 1
qemu_arm-virt-gicv3 | arm | lab-broonie | gcc-10 | multi_v7_defconfig | 1
qemu_arm-virt-gicv3-uefi | arm | lab-baylibre | gcc-10 | multi_v7_defconfig | 1
qemu_arm-virt-gicv3-uefi | arm | lab-broonie | gcc-10 | multi_v7_defconfig | 1
qemu_arm64-virt-gicv2 | arm64 | lab-baylibre | gcc-10 | defconfig+arm64-chromebook | 1
qemu_arm64-virt-gicv2 | arm64 | lab-baylibre | gcc-10 | defconfig | 1
qemu_arm64-virt-gicv2 | arm64 | lab-broonie | gcc-10 | defconfig+arm64-chromebook | 1
qemu_arm64-virt-gicv2 | arm64 | lab-broonie | gcc-10 | defconfig | 1
qemu_arm64-virt-gicv2-uefi | arm64 | lab-baylibre | gcc-10 | defconfig+arm64-chromebook | 1
qemu_arm64-virt-gicv2-uefi | arm64 | lab-baylibre | gcc-10 | defconfig | 1
qemu_arm64-virt-gicv2-uefi | arm64 | lab-broonie | gcc-10 | defconfig+arm64-chromebook | 1
qemu_arm64-virt-gicv2-uefi | arm64 | lab-broonie | gcc-10 | defconfig | 1
qemu_arm64-virt-gicv3 | arm64 | lab-baylibre | gcc-10 | defconfig+arm64-chromebook | 1
qemu_arm64-virt-gicv3 | arm64 | lab-baylibre | gcc-10 | defconfig | 1
qemu_arm64-virt-gicv3 | arm64 | lab-broonie | gcc-10 | defconfig+arm64-chromebook | 1
qemu_arm64-virt-gicv3 | arm64 | lab-broonie | gcc-10 | defconfig | 1
qemu_arm64-virt-gicv3-uefi | arm64 | lab-baylibre | gcc-10 | defconfig+arm64-chromebook | 1
qemu_arm64-virt-gicv3-uefi | arm64 | lab-baylibre | gcc-10 | defconfig | 1
qemu_arm64-virt-gicv3-uefi | arm64 | lab-broonie | gcc-10 | defconfig+arm64-chromebook | 1
qemu_arm64-virt-gicv3-uefi | arm64 | lab-broonie | gcc-10 | defconfig | 1
qemu_x86_64-uefi-mixed | x86_64 | lab-baylibre | gcc-10 | x86_64_defconfig | 1
qemu_x86_64-uefi-mixed | x86_64 | lab-baylibre | gcc-10 | x86_64_defcon...6-chromebook | 1
qemu_x86_64-uefi-mixed | x86_64 | lab-broonie | gcc-10 | x86_64_defconfig | 1
qemu_x86_64-uefi-mixed | x86_64 | lab-broonie | gcc-10 | x86_64_defcon...6-chromebook | 1

Details: https://kernelci.org/test/job/cip-gitlab/branch/ci%2Fpavel%2Flinux-test/kernel/v4.4-st5-1797-gb2b8419761095/plan/baseline/

Test: baseline
Tree: cip-gitlab
Branch: ci/pavel/linux-test
Describe: v4.4-st5-1797-gb2b8419761095
URL: https://gitlab.com/cip-project/cip-kernel/linux-cip.git
SHA: b2b8419761095643d782c4cb4a982131b3efb6b8


Test Regressions
----------------


platform | arch | lab | compiler | defconfig | regressions
---------------------------+--------+---------------+----------+------------------------------+------------
asus-C436FA-Flip-hatch | x86_64 | lab-collabora | gcc-10 | x86_64_defcon...6-chromebook | 1

Details: https://kernelci.org/test/plan/id/628bbc26323bb6af90a39be7

Results: 0 PASS, 1 FAIL, 0 SKIP
Full config: x86_64_defconfig+x86-chromebook
Compiler: gcc-10 (gcc (Debian 10.2.1-6) 10.2.1 20210110)
Plain log: https://storage.kernelci.org//cip-gitlab/ci-pavel-linux-test/v4.4-st5-1797-gb2b8419761095/x86_64/x86_64_defconfig+x86-chromebook/gcc-10/lab-collabora/baseline-asus-C436FA-Flip-hatch.txt
HTML log: https://storage.kernelci.org//cip-gitlab/ci-pavel-linux-test/v4.4-st5-1797-gb2b8419761095/x86_64/x86_64_defconfig+x86-chromebook/gcc-10/lab-collabora/baseline-asus-C436FA-Flip-hatch.html
Rootfs: http://storage.kernelci.org/images/rootfs/buildroot/buildroot-baseline/20220513.0/x86/rootfs.cpio.gz


* baseline.login: https://kernelci.org/test/case/id/628bbc26323bb6af90a39be8
failing since 12 days (last pass: v5.10.109-cip5-384-g722204542e8a, first fail: v4.4-st5-23-gf7cf04ab668f1)



platform | arch | lab | compiler | defconfig | regressions
---------------------------+--------+---------------+----------+------------------------------+------------
asus-cx9400-volteer | x86_64 | lab-collabora | gcc-10 | x86_64_defcon...6-chromebook | 1

Details: https://kernelci.org/test/plan/id/628bb6e49fd4928edba39bfa

Results: 0 PASS, 1 FAIL, 0 SKIP
Full config: x86_64_defconfig+x86-chromebook
Compiler: gcc-10 (gcc (Debian 10.2.1-6) 10.2.1 20210110)
Plain log: https://storage.kernelci.org//cip-gitlab/ci-pavel-linux-test/v4.4-st5-1797-gb2b8419761095/x86_64/x86_64_defconfig+x86-chromebook/gcc-10/lab-collabora/baseline-asus-cx9400-volteer.txt
HTML log: https://storage.kernelci.org//cip-gitlab/ci-pavel-linux-test/v4.4-st5-1797-gb2b8419761095/x86_64/x86_64_defconfig+x86-chromebook/gcc-10/lab-collabora/baseline-asus-cx9400-volteer.html
Rootfs: http://storage.kernelci.org/images/rootfs/buildroot/buildroot-baseline/20220513.0/x86/rootfs.cpio.gz


* baseline.login: https://kernelci.org/test/case/id/628bb6e49fd4928edba39bfb
failing since 12 days (last pass: v5.10.109-cip5-384-g722204542e8a, first fail: v4.4-st5-23-gf7cf04ab668f1)



platform | arch | lab | compiler | defconfig | regressions
---------------------------+--------+---------------+----------+------------------------------+------------
at91-sama5d4_xplained | arm | lab-baylibre | gcc-10 | multi_v7_defconfig | 1

Details: https://kernelci.org/test/plan/id/628bb8d626ae149314a39c58

Results: 0 PASS, 1 FAIL, 0 SKIP
Full config: multi_v7_defconfig
Compiler: gcc-10 (arm-linux-gnueabihf-gcc (Debian 10.2.1-6) 10.2.1 20210110)
Plain log: https://storage.kernelci.org//cip-gitlab/ci-pavel-linux-test/v4.4-st5-1797-gb2b8419761095/arm/multi_v7_defconfig/gcc-10/lab-baylibre/baseline-at91-sama5d4_xplained.txt
HTML log: https://storage.kernelci.org//cip-gitlab/ci-pavel-linux-test/v4.4-st5-1797-gb2b8419761095/arm/multi_v7_defconfig/gcc-10/lab-baylibre/baseline-at91-sama5d4_xplained.html
Rootfs: http://storage.kernelci.org/images/rootfs/buildroot/buildroot-baseline/20220513.0/armel/rootfs.cpio.gz


* baseline.login: https://kernelci.org/test/case/id/628bb8d626ae149314a39c59
failing since 12 days (last pass: v5.10.109-cip5-384-g722204542e8a, first fail: v4.4-st5-260-gb0fe64f485ff)



platform | arch | lab | compiler | defconfig | regressions
---------------------------+--------+---------------+----------+------------------------------+------------
beaglebone-black | arm | lab-broonie | gcc-10 | multi_v7_defconfig | 1

Details: https://kernelci.org/test/plan/id/628bb6b61fdf123273a39c1d

Results: 4 PASS, 1 FAIL, 2 SKIP
Full config: multi_v7_defconfig
Compiler: gcc-10 (arm-linux-gnueabihf-gcc (Debian 10.2.1-6) 10.2.1 20210110)
Plain log: https://storage.kernelci.org//cip-gitlab/ci-pavel-linux-test/v4.4-st5-1797-gb2b8419761095/arm/multi_v7_defconfig/gcc-10/lab-broonie/baseline-beaglebone-black.txt
HTML log: https://storage.kernelci.org//cip-gitlab/ci-pavel-linux-test/v4.4-st5-1797-gb2b8419761095/arm/multi_v7_defconfig/gcc-10/lab-broonie/baseline-beaglebone-black.html
Rootfs: http://storage.kernelci.org/images/rootfs/buildroot/buildroot-baseline/20220513.0/armel/rootfs.cpio.gz


* baseline.dmesg.crit: https://kernelci.org/test/case/id/628bb6b61fdf123273a39c26
failing since 13 days (last pass: v5.10.109-cip5-384-g722204542e8a, first fail: v4.4-st5-260-gb0fe64f485ff)
1 lines

2022-05-23T16:30:33.692384 / #
2022-05-23T16:30:33.698083
2022-05-23T16:30:33.804165 / # #
2022-05-23T16:30:33.809828 #
2022-05-23T16:30:33.912303 / # export SHELL=/bin/sh
2022-05-23T16:30:33.917871 export SHELL=/bin/sh
2022-05-23T16:30:34.019876 / # . /lava-164485/environment
2022-05-23T16:30:34.025506 . /lava-164485/environment
2022-05-23T16:30:34.127610 / # /lava-164485/bin/lava-test-runner /lava-164485/0
2022-05-23T16:30:34.132802 /lava-164485/bin/lava-test-runner /lava-164485/0
... (9 line(s) more)



platform | arch | lab | compiler | defconfig | regressions
---------------------------+--------+---------------+----------+------------------------------+------------
beaglebone-black | arm | lab-cip | gcc-10 | multi_v7_defconfig | 1

Details: https://kernelci.org/test/plan/id/628bb6887adb84dce9a39c3c

Results: 4 PASS, 1 FAIL, 2 SKIP
Full config: multi_v7_defconfig
Compiler: gcc-10 (arm-linux-gnueabihf-gcc (Debian 10.2.1-6) 10.2.1 20210110)
Plain log: https://storage.kernelci.org//cip-gitlab/ci-pavel-linux-test/v4.4-st5-1797-gb2b8419761095/arm/multi_v7_defconfig/gcc-10/lab-cip/baseline-beaglebone-black.txt
HTML log: https://storage.kernelci.org//cip-gitlab/ci-pavel-linux-test/v4.4-st5-1797-gb2b8419761095/arm/multi_v7_defconfig/gcc-10/lab-cip/baseline-beaglebone-black.html
Rootfs: http://storage.kernelci.org/images/rootfs/buildroot/buildroot-baseline/20220513.0/armel/rootfs.cpio.gz


* baseline.dmesg.crit: https://kernelci.org/test/case/id/628bb6887adb84dce9a39c43
failing since 13 days (last pass: v5.10.109-cip5-384-g722204542e8a, first fail: v4.4-st5-260-gb0fe64f485ff)
1 lines

2022-05-23T16:29:38.460318 / #
2022-05-23T16:29:38.463146
2022-05-23T16:29:38.567574 / # #
2022-05-23T16:29:38.570316 #
2022-05-23T16:29:38.672087 / # export SHELL=/bin/sh
2022-05-23T16:29:38.674782 export SHELL=/bin/sh
2022-05-23T16:29:38.776203 / # . /lava-684346/environment
2022-05-23T16:29:38.778955 . /lava-684346/environment
2022-05-23T16:29:38.880367 / # /lava-684346/bin/lava-test-runner /lava-684346/0
2022-05-23T16:29:38.882700 /lava-684346/bin/lava-test-runner /lava-684346/0
... (9 line(s) more)



platform | arch | lab | compiler | defconfig | regressions
---------------------------+--------+---------------+----------+------------------------------+------------
beaglebone-black | arm | lab-broonie | gcc-10 | omap2plus_defconfig | 1

Details: https://kernelci.org/test/plan/id/628bb71aae6f4722d8a39c55

Results: 4 PASS, 1 FAIL, 2 SKIP
Full config: omap2plus_defconfig
Compiler: gcc-10 (arm-linux-gnueabihf-gcc (Debian 10.2.1-6) 10.2.1 20210110)
Plain log: https://storage.kernelci.org//cip-gitlab/ci-pavel-linux-test/v4.4-st5-1797-gb2b8419761095/arm/omap2plus_defconfig/gcc-10/lab-broonie/baseline-beaglebone-black.txt
HTML log: https://storage.kernelci.org//cip-gitlab/ci-pavel-linux-test/v4.4-st5-1797-gb2b8419761095/arm/omap2plus_defconfig/gcc-10/lab-broonie/baseline-beaglebone-black.html
Rootfs: http://storage.kernelci.org/images/rootfs/buildroot/buildroot-baseline/20220513.0/armel/rootfs.cpio.gz


* baseline.dmesg.crit: https://kernelci.org/test/case/id/628bb71aae6f4722d8a39c5e
failing since 13 days (last pass: v5.10.109-cip5-384-g722204542e8a, first fail: v4.4-st5-260-gb0fe64f485ff)
1 lines

2022-05-23T16:32:12.381966 / #
2022-05-23T16:32:12.389324
2022-05-23T16:32:12.492333 / # #
2022-05-23T16:32:12.498194 #
2022-05-23T16:32:12.599696 / # export SHELL=/bin/sh
2022-05-23T16:32:12.605685 export SHELL=/bin/sh
2022-05-23T16:32:12.707110 / # . /lava-164531/environment
2022-05-23T16:32:12.714781 . /lava-164531/environment
2022-05-23T16:32:12.815965 / # /lava-164531/bin/lava-test-runner /lava-164531/0
2022-05-23T16:32:12.821114 /lava-164531/bin/lava-test-runner /lava-164531/0
... (9 line(s) more)



platform | arch | lab | compiler | defconfig | regressions
---------------------------+--------+---------------+----------+------------------------------+------------
beaglebone-black | arm | lab-cip | gcc-10 | omap2plus_defconfig | 1

Details: https://kernelci.org/test/plan/id/628bb818d60822c2d1a39c22

Results: 4 PASS, 1 FAIL, 2 SKIP
Full config: omap2plus_defconfig
Compiler: gcc-10 (arm-linux-gnueabihf-gcc (Debian 10.2.1-6) 10.2.1 20210110)
Plain log: https://storage.kernelci.org//cip-gitlab/ci-pavel-linux-test/v4.4-st5-1797-gb2b8419761095/arm/omap2plus_defconfig/gcc-10/lab-cip/baseline-beaglebone-black.txt
HTML log: https://storage.kernelci.org//cip-gitlab/ci-pavel-linux-test/v4.4-st5-1797-gb2b8419761095/arm/omap2plus_defconfig/gcc-10/lab-cip/baseline-beaglebone-black.html
Rootfs: http://storage.kernelci.org/images/rootfs/buildroot/buildroot-baseline/20220513.0/armel/rootfs.cpio.gz


* baseline.dmesg.crit: https://kernelci.org/test/case/id/628bb818d60822c2d1a39c29
failing since 13 days (last pass: v5.10.109-cip5-384-g722204542e8a, first fail: v4.4-st5-260-gb0fe64f485ff)
1 lines

2022-05-23T16:36:21.946348 / #
2022-05-23T16:36:21.950998
2022-05-23T16:36:22.055473 / # #
2022-05-23T16:36:22.058961 #
2022-05-23T16:36:22.160719 / # export SHELL=/bin/sh
2022-05-23T16:36:22.163316 export SHELL=/bin/sh
2022-05-23T16:36:22.274708 / # . /lava-684353/environment
2022-05-23T16:36:22.277852 . /lava-684353/environment
2022-05-23T16:36:22.381302 / # /lava-684353/bin/lava-test-runner /lava-684353/0
2022-05-23T16:36:22.384340 /lava-684353/bin/lava-test-runner /lava-684353/0
... (9 line(s) more)



platform | arch | lab | compiler | defconfig | regressions
---------------------------+--------+---------------+----------+------------------------------+------------
hp-x360-12b-n4000-octopus | x86_64 | lab-collabora | gcc-10 | x86_64_defcon...6-chromebook | 1

Details: https://kernelci.org/test/plan/id/628bc4c26abde8a5f2a39bcd

Results: 0 PASS, 1 FAIL, 0 SKIP
Full config: x86_64_defconfig+x86-chromebook
Compiler: gcc-10 (gcc (Debian 10.2.1-6) 10.2.1 20210110)
Plain log: https://storage.kernelci.org//cip-gitlab/ci-pavel-linux-test/v4.4-st5-1797-gb2b8419761095/x86_64/x86_64_defconfig+x86-chromebook/gcc-10/lab-collabora/baseline-hp-x360-12b-n4000-octopus.txt
HTML log: https://storage.kernelci.org//cip-gitlab/ci-pavel-linux-test/v4.4-st5-1797-gb2b8419761095/x86_64/x86_64_defconfig+x86-chromebook/gcc-10/lab-collabora/baseline-hp-x360-12b-n4000-octopus.html
Rootfs: http://storage.kernelci.org/images/rootfs/buildroot/buildroot-baseline/20220513.0/x86/rootfs.cpio.gz


* baseline.login: https://kernelci.org/test/case/id/628bc4c26abde8a5f2a39bce
failing since 12 days (last pass: v5.10.109-cip5-384-g722204542e8a, first fail: v4.4-st5-23-gf7cf04ab668f1)



platform | arch | lab | compiler | defconfig | regressions
---------------------------+--------+---------------+----------+------------------------------+------------
juno-uboot | arm64 | lab-broonie | gcc-10 | defconfig | 1

Details: https://kernelci.org/test/plan/id/628bb848ee1affcabea39be8

Results: 0 PASS, 1 FAIL, 0 SKIP
Full config: defconfig
Compiler: gcc-10 (aarch64-linux-gnu-gcc (Debian 10.2.1-6) 10.2.1 20210110)
Plain log: https://storage.kernelci.org//cip-gitlab/ci-pavel-linux-test/v4.4-st5-1797-gb2b8419761095/arm64/defconfig/gcc-10/lab-broonie/baseline-juno-uboot.txt
HTML log: https://storage.kernelci.org//cip-gitlab/ci-pavel-linux-test/v4.4-st5-1797-gb2b8419761095/arm64/defconfig/gcc-10/lab-broonie/baseline-juno-uboot.html
Rootfs: http://storage.kernelci.org/images/rootfs/buildroot/buildroot-baseline/20220513.0/arm64/rootfs.cpio.gz


* baseline.login: https://kernelci.org/test/case/id/628bb848ee1affcabea39be9
failing since 12 days (last pass: v5.10.109-cip5-384-g722204542e8a, first fail: v4.4-st5-261-g4f0b5ddda6cf)



platform | arch | lab | compiler | defconfig | regressions
---------------------------+--------+---------------+----------+------------------------------+------------
meson8b-odroidc1 | arm | lab-baylibre | gcc-10 | multi_v7_defconfig | 1

Details: https://kernelci.org/test/plan/id/628bb6a81fdf123273a39bd1

Results: 4 PASS, 1 FAIL, 2 SKIP
Full config: multi_v7_defconfig
Compiler: gcc-10 (arm-linux-gnueabihf-gcc (Debian 10.2.1-6) 10.2.1 20210110)
Plain log: https://storage.kernelci.org//cip-gitlab/ci-pavel-linux-test/v4.4-st5-1797-gb2b8419761095/arm/multi_v7_defconfig/gcc-10/lab-baylibre/baseline-meson8b-odroidc1.txt
HTML log: https://storage.kernelci.org//cip-gitlab/ci-pavel-linux-test/v4.4-st5-1797-gb2b8419761095/arm/multi_v7_defconfig/gcc-10/lab-baylibre/baseline-meson8b-odroidc1.html
Rootfs: http://storage.kernelci.org/images/rootfs/buildroot/buildroot-baseline/20220513.0/armel/rootfs.cpio.gz


* baseline.bootrr.all-cpus-are-online: https://kernelci.org/test/case/id/628bb6a81fdf123273a39bd5
failing since 13 days (last pass: v5.10.109-cip5-384-g722204542e8a, first fail: v4.4-st5-260-gb0fe64f485ff)

2022-05-23T16:29:49.609809 /lava-2001626/1/../bin/lava-test-case
2022-05-23T16:29:49.610235 [ 17.327395] <LAVA_SIGNAL_TESTCASE TEST_CASE_ID=all-cpus-are-online RESULT=fail>
2022-05-23T16:29:49.610466 /lava-2001626/1/../bin/lava-test-case
2022-05-23T16:29:49.610679 [ 17.344446] <LAVA_SIGNAL_TESTCASE TEST_CASE_ID=tpm-chip-is-online RESULT=skip>
2022-05-23T16:29:49.610889 + set +x



platform | arch | lab | compiler | defconfig | regressions
---------------------------+--------+---------------+----------+------------------------------+------------
qemu_arm-virt-gicv2 | arm | lab-baylibre | gcc-10 | multi_v7_defconfig | 1

Details: https://kernelci.org/test/plan/id/628bb8b63d603bf478a39bd1

Results: 0 PASS, 1 FAIL, 0 SKIP
Full config: multi_v7_defconfig
Compiler: gcc-10 (arm-linux-gnueabihf-gcc (Debian 10.2.1-6) 10.2.1 20210110)
Plain log: https://storage.kernelci.org//cip-gitlab/ci-pavel-linux-test/v4.4-st5-1797-gb2b8419761095/arm/multi_v7_defconfig/gcc-10/lab-baylibre/baseline-qemu_arm-virt-gicv2.txt
HTML log: https://storage.kernelci.org//cip-gitlab/ci-pavel-linux-test/v4.4-st5-1797-gb2b8419761095/arm/multi_v7_defconfig/gcc-10/lab-baylibre/baseline-qemu_arm-virt-gicv2.html
Rootfs: http://storage.kernelci.org/images/rootfs/buildroot/buildroot-baseline/20220513.0/armel/rootfs.cpio.gz


* baseline.login: https://kernelci.org/test/case/id/628bb8b63d603bf478a39bd2
failing since 12 days (last pass: v5.10.109-cip5-384-g722204542e8a, first fail: v4.4-st5-260-gb0fe64f485ff)



platform | arch | lab | compiler | defconfig | regressions
---------------------------+--------+---------------+----------+------------------------------+------------
qemu_arm-virt-gicv2 | arm | lab-broonie | gcc-10 | multi_v7_defconfig | 1

Details: https://kernelci.org/test/plan/id/628bbd04d119219331a39c05

Results: 0 PASS, 1 FAIL, 0 SKIP
Full config: multi_v7_defconfig
Compiler: gcc-10 (arm-linux-gnueabihf-gcc (Debian 10.2.1-6) 10.2.1 20210110)
Plain log: https://storage.kernelci.org//cip-gitlab/ci-pavel-linux-test/v4.4-st5-1797-gb2b8419761095/arm/multi_v7_defconfig/gcc-10/lab-broonie/baseline-qemu_arm-virt-gicv2.txt
HTML log: https://storage.kernelci.org//cip-gitlab/ci-pavel-linux-test/v4.4-st5-1797-gb2b8419761095/arm/multi_v7_defconfig/gcc-10/lab-broonie/baseline-qemu_arm-virt-gicv2.html
Rootfs: http://storage.kernelci.org/images/rootfs/buildroot/buildroot-baseline/20220513.0/armel/rootfs.cpio.gz


* baseline.login: https://kernelci.org/test/case/id/628bbd04d119219331a39c06
failing since 12 days (last pass: v5.10.109-cip5-384-g722204542e8a, first fail: v4.4-st5-260-gb0fe64f485ff)



platform | arch | lab | compiler | defconfig | regressions
---------------------------+--------+---------------+----------+------------------------------+------------
qemu_arm-virt-gicv2-uefi | arm | lab-baylibre | gcc-10 | multi_v7_defconfig | 1

Details: https://kernelci.org/test/plan/id/628bb948e0151093dba39bf3

Results: 0 PASS, 1 FAIL, 0 SKIP
Full config: multi_v7_defconfig
Compiler: gcc-10 (arm-linux-gnueabihf-gcc (Debian 10.2.1-6) 10.2.1 20210110)
Plain log: https://storage.kernelci.org//cip-gitlab/ci-pavel-linux-test/v4.4-st5-1797-gb2b8419761095/arm/multi_v7_defconfig/gcc-10/lab-baylibre/baseline-qemu_arm-virt-gicv2-uefi.txt
HTML log: https://storage.kernelci.org//cip-gitlab/ci-pavel-linux-test/v4.4-st5-1797-gb2b8419761095/arm/multi_v7_defconfig/gcc-10/lab-baylibre/baseline-qemu_arm-virt-gicv2-uefi.html
Rootfs: http://storage.kernelci.org/images/rootfs/buildroot/buildroot-baseline/20220513.0/armel/rootfs.cpio.gz


* baseline.login: https://kernelci.org/test/case/id/628bb948e0151093dba39bf4
failing since 12 days (last pass: v5.10.109-cip5-384-g722204542e8a, first fail: v4.4-st5-260-gb0fe64f485ff)



platform | arch | lab | compiler | defconfig | regressions
---------------------------+--------+---------------+----------+------------------------------+------------
qemu_arm-virt-gicv2-uefi | arm | lab-broonie | gcc-10 | multi_v7_defconfig | 1

Details: https://kernelci.org/test/plan/id/628bbde0f29dcf32bfa39bea

Results: 0 PASS, 1 FAIL, 0 SKIP
Full config: multi_v7_defconfig
Compiler: gcc-10 (arm-linux-gnueabihf-gcc (Debian 10.2.1-6) 10.2.1 20210110)
Plain log: https://storage.kernelci.org//cip-gitlab/ci-pavel-linux-test/v4.4-st5-1797-gb2b8419761095/arm/multi_v7_defconfig/gcc-10/lab-broonie/baseline-qemu_arm-virt-gicv2-uefi.txt
HTML log: https://storage.kernelci.org//cip-gitlab/ci-pavel-linux-test/v4.4-st5-1797-gb2b8419761095/arm/multi_v7_defconfig/gcc-10/lab-broonie/baseline-qemu_arm-virt-gicv2-uefi.html
Rootfs: http://storage.kernelci.org/images/rootfs/buildroot/buildroot-baseline/20220513.0/armel/rootfs.cpio.gz


* baseline.login: https://kernelci.org/test/case/id/628bbde0f29dcf32bfa39beb
failing since 12 days (last pass: v5.10.109-cip5-384-g722204542e8a, first fail: v4.4-st5-260-gb0fe64f485ff)



platform | arch | lab | compiler | defconfig | regressions
---------------------------+--------+---------------+----------+------------------------------+------------
qemu_arm-virt-gicv3 | arm | lab-baylibre | gcc-10 | multi_v7_defconfig | 1

Details: https://kernelci.org/test/plan/id/628bb8b73d603bf478a39bd4

Results: 0 PASS, 1 FAIL, 0 SKIP
Full config: multi_v7_defconfig
Compiler: gcc-10 (arm-linux-gnueabihf-gcc (Debian 10.2.1-6) 10.2.1 20210110)
Plain log: https://storage.kernelci.org//cip-gitlab/ci-pavel-linux-test/v4.4-st5-1797-gb2b8419761095/arm/multi_v7_defconfig/gcc-10/lab-baylibre/baseline-qemu_arm-virt-gicv3.txt
HTML log: https://storage.kernelci.org//cip-gitlab/ci-pavel-linux-test/v4.4-st5-1797-gb2b8419761095/arm/multi_v7_defconfig/gcc-10/lab-baylibre/baseline-qemu_arm-virt-gicv3.html
Rootfs: http://storage.kernelci.org/images/rootfs/buildroot/buildroot-baseline/20220513.0/armel/rootfs.cpio.gz


* baseline.login: https://kernelci.org/test/case/id/628bb8b73d603bf478a39bd5
failing since 12 days (last pass: v5.10.109-cip5-384-g722204542e8a, first fail: v4.4-st5-260-gb0fe64f485ff)



platform | arch | lab | compiler | defconfig | regressions
---------------------------+--------+---------------+----------+------------------------------+------------
qemu_arm-virt-gicv3 | arm | lab-broonie | gcc-10 | multi_v7_defconfig | 1

Details: https://kernelci.org/test/plan/id/628bbd1808958719d6a39bcd

Results: 0 PASS, 1 FAIL, 0 SKIP
Full config: multi_v7_defconfig
Compiler: gcc-10 (arm-linux-gnueabihf-gcc (Debian 10.2.1-6) 10.2.1 20210110)
Plain log: https://storage.kernelci.org//cip-gitlab/ci-pavel-linux-test/v4.4-st5-1797-gb2b8419761095/arm/multi_v7_defconfig/gcc-10/lab-broonie/baseline-qemu_arm-virt-gicv3.txt
HTML log: https://storage.kernelci.org//cip-gitlab/ci-pavel-linux-test/v4.4-st5-1797-gb2b8419761095/arm/multi_v7_defconfig/gcc-10/lab-broonie/baseline-qemu_arm-virt-gicv3.html
Rootfs: http://storage.kernelci.org/images/rootfs/buildroot/buildroot-baseline/20220513.0/armel/rootfs.cpio.gz


* baseline.login: https://kernelci.org/test/case/id/628bbd1808958719d6a39bce
failing since 12 days (last pass: v5.10.109-cip5-384-g722204542e8a, first fail: v4.4-st5-260-gb0fe64f485ff)



platform | arch | lab | compiler | defconfig | regressions
---------------------------+--------+---------------+----------+------------------------------+------------
qemu_arm-virt-gicv3-uefi | arm | lab-baylibre | gcc-10 | multi_v7_defconfig | 1

Details: https://kernelci.org/test/plan/id/628bb947e0151093dba39bf0

Results: 0 PASS, 1 FAIL, 0 SKIP
Full config: multi_v7_defconfig
Compiler: gcc-10 (arm-linux-gnueabihf-gcc (Debian 10.2.1-6) 10.2.1 20210110)
Plain log: https://storage.kernelci.org//cip-gitlab/ci-pavel-linux-test/v4.4-st5-1797-gb2b8419761095/arm/multi_v7_defconfig/gcc-10/lab-baylibre/baseline-qemu_arm-virt-gicv3-uefi.txt
HTML log: https://storage.kernelci.org//cip-gitlab/ci-pavel-linux-test/v4.4-st5-1797-gb2b8419761095/arm/multi_v7_defconfig/gcc-10/lab-baylibre/baseline-qemu_arm-virt-gicv3-uefi.html
Rootfs: http://storage.kernelci.org/images/rootfs/buildroot/buildroot-baseline/20220513.0/armel/rootfs.cpio.gz


* baseline.login: https://kernelci.org/test/case/id/628bb947e0151093dba39bf1
failing since 12 days (last pass: v5.10.109-cip5-384-g722204542e8a, first fail: v4.4-st5-260-gb0fe64f485ff)



platform | arch | lab | compiler | defconfig | regressions
---------------------------+--------+---------------+----------+------------------------------+------------
qemu_arm-virt-gicv3-uefi | arm | lab-broonie | gcc-10 | multi_v7_defconfig | 1

Details: https://kernelci.org/test/plan/id/628bbcb436bad6d763a39bdb

Results: 0 PASS, 1 FAIL, 0 SKIP
Full config: multi_v7_defconfig
Compiler: gcc-10 (arm-linux-gnueabihf-gcc (Debian 10.2.1-6) 10.2.1 20210110)
Plain log: https://storage.kernelci.org//cip-gitlab/ci-pavel-linux-test/v4.4-st5-1797-gb2b8419761095/arm/multi_v7_defconfig/gcc-10/lab-broonie/baseline-qemu_arm-virt-gicv3-uefi.txt
HTML log: https://storage.kernelci.org//cip-gitlab/ci-pavel-linux-test/v4.4-st5-1797-gb2b8419761095/arm/multi_v7_defconfig/gcc-10/lab-broonie/baseline-qemu_arm-virt-gicv3-uefi.html
Rootfs: http://storage.kernelci.org/images/rootfs/buildroot/buildroot-baseline/20220513.0/armel/rootfs.cpio.gz


* baseline.login: https://kernelci.org/test/case/id/628bbcb436bad6d763a39bdc
failing since 12 days (last pass: v5.10.109-cip5-384-g722204542e8a, first fail: v4.4-st5-260-gb0fe64f485ff)



platform | arch | lab | compiler | defconfig | regressions
---------------------------+--------+---------------+----------+------------------------------+------------
qemu_arm64-virt-gicv2 | arm64 | lab-baylibre | gcc-10 | defconfig+arm64-chromebook | 1

Details: https://kernelci.org/test/plan/id/628bb671b9b8e2dacca39c27

Results: 0 PASS, 1 FAIL, 0 SKIP
Full config: defconfig+arm64-chromebook
Compiler: gcc-10 (aarch64-linux-gnu-gcc (Debian 10.2.1-6) 10.2.1 20210110)
Plain log: https://storage.kernelci.org//cip-gitlab/ci-pavel-linux-test/v4.4-st5-1797-gb2b8419761095/arm64/defconfig+arm64-chromebook/gcc-10/lab-baylibre/baseline-qemu_arm64-virt-gicv2.txt
HTML log: https://storage.kernelci.org//cip-gitlab/ci-pavel-linux-test/v4.4-st5-1797-gb2b8419761095/arm64/defconfig+arm64-chromebook/gcc-10/lab-baylibre/baseline-qemu_arm64-virt-gicv2.html
Rootfs: http://storage.kernelci.org/images/rootfs/buildroot/buildroot-baseline/20220513.0/arm64/rootfs.cpio.gz


* baseline.login: https://kernelci.org/test/case/id/628bb671b9b8e2dacca39c28
failing since 13 days (last pass: v4.19.233-516-ge5e741fbfc87, first fail: v5.10.109-cip5-384-g722204542e8a)



platform | arch | lab | compiler | defconfig | regressions
---------------------------+--------+---------------+----------+------------------------------+------------
qemu_arm64-virt-gicv2 | arm64 | lab-baylibre | gcc-10 | defconfig | 1

Details: https://kernelci.org/test/plan/id/628bb92fd6293ca003a39bdc

Results: 0 PASS, 1 FAIL, 0 SKIP
Full config: defconfig
Compiler: gcc-10 (aarch64-linux-gnu-gcc (Debian 10.2.1-6) 10.2.1 20210110)
Plain log: https://storage.kernelci.org//cip-gitlab/ci-pavel-linux-test/v4.4-st5-1797-gb2b8419761095/arm64/defconfig/gcc-10/lab-baylibre/baseline-qemu_arm64-virt-gicv2.txt
HTML log: https://storage.kernelci.org//cip-gitlab/ci-pavel-linux-test/v4.4-st5-1797-gb2b8419761095/arm64/defconfig/gcc-10/lab-baylibre/baseline-qemu_arm64-virt-gicv2.html
Rootfs: http://storage.kernelci.org/images/rootfs/buildroot/buildroot-baseline/20220513.0/arm64/rootfs.cpio.gz


* baseline.login: https://kernelci.org/test/case/id/628bb92fd6293ca003a39bdd
failing since 13 days (last pass: v4.19.233-516-ge5e741fbfc87, first fail: v5.10.109-cip5-384-g722204542e8a)



platform | arch | lab | compiler | defconfig | regressions
---------------------------+--------+---------------+----------+------------------------------+------------
qemu_arm64-virt-gicv2 | arm64 | lab-broonie | gcc-10 | defconfig+arm64-chromebook | 1

Details: https://kernelci.org/test/plan/id/628bb7c7274c9f0c94a39bec

Results: 0 PASS, 1 FAIL, 0 SKIP
Full config: defconfig+arm64-chromebook
Compiler: gcc-10 (aarch64-linux-gnu-gcc (Debian 10.2.1-6) 10.2.1 20210110)
Plain log: https://storage.kernelci.org//cip-gitlab/ci-pavel-linux-test/v4.4-st5-1797-gb2b8419761095/arm64/defconfig+arm64-chromebook/gcc-10/lab-broonie/baseline-qemu_arm64-virt-gicv2.txt
HTML log: https://storage.kernelci.org//cip-gitlab/ci-pavel-linux-test/v4.4-st5-1797-gb2b8419761095/arm64/defconfig+arm64-chromebook/gcc-10/lab-broonie/baseline-qemu_arm64-virt-gicv2.html
Rootfs: http://storage.kernelci.org/images/rootfs/buildroot/buildroot-baseline/20220513.0/arm64/rootfs.cpio.gz


* baseline.login: https://kernelci.org/test/case/id/628bb7c7274c9f0c94a39bed
failing since 13 days (last pass: v4.19.233-516-ge5e741fbfc87, first fail: v5.10.109-cip5-384-g722204542e8a)



platform | arch | lab | compiler | defconfig | regressions
---------------------------+--------+---------------+----------+------------------------------+------------
qemu_arm64-virt-gicv2 | arm64 | lab-broonie | gcc-10 | defconfig | 1

Details: https://kernelci.org/test/plan/id/628bbc8e3491b188f0a39bf0

Results: 0 PASS, 1 FAIL, 0 SKIP
Full config: defconfig
Compiler: gcc-10 (aarch64-linux-gnu-gcc (Debian 10.2.1-6) 10.2.1 20210110)
Plain log: https://storage.kernelci.org//cip-gitlab/ci-pavel-linux-test/v4.4-st5-1797-gb2b8419761095/arm64/defconfig/gcc-10/lab-broonie/baseline-qemu_arm64-virt-gicv2.txt
HTML log: https://storage.kernelci.org//cip-gitlab/ci-pavel-linux-test/v4.4-st5-1797-gb2b8419761095/arm64/defconfig/gcc-10/lab-broonie/baseline-qemu_arm64-virt-gicv2.html
Rootfs: http://storage.kernelci.org/images/rootfs/buildroot/buildroot-baseline/20220513.0/arm64/rootfs.cpio.gz


* baseline.login: https://kernelci.org/test/case/id/628bbc8e3491b188f0a39bf1
failing since 13 days (last pass: v4.19.233-516-ge5e741fbfc87, first fail: v5.10.109-cip5-384-g722204542e8a)



platform | arch | lab | compiler | defconfig | regressions
---------------------------+--------+---------------+----------+------------------------------+------------
qemu_arm64-virt-gicv2-uefi | arm64 | lab-baylibre | gcc-10 | defconfig+arm64-chromebook | 1

Details: https://kernelci.org/test/plan/id/628bb67634da8b12b7a39c1b

Results: 0 PASS, 1 FAIL, 0 SKIP
Full config: defconfig+arm64-chromebook
Compiler: gcc-10 (aarch64-linux-gnu-gcc (Debian 10.2.1-6) 10.2.1 20210110)
Plain log: https://storage.kernelci.org//cip-gitlab/ci-pavel-linux-test/v4.4-st5-1797-gb2b8419761095/arm64/defconfig+arm64-chromebook/gcc-10/lab-baylibre/baseline-qemu_arm64-virt-gicv2-uefi.txt
HTML log: https://storage.kernelci.org//cip-gitlab/ci-pavel-linux-test/v4.4-st5-1797-gb2b8419761095/arm64/defconfig+arm64-chromebook/gcc-10/lab-baylibre/baseline-qemu_arm64-virt-gicv2-uefi.html
Rootfs: http://storage.kernelci.org/images/rootfs/buildroot/buildroot-baseline/20220513.0/arm64/rootfs.cpio.gz


* baseline.login: https://kernelci.org/test/case/id/628bb67634da8b12b7a39c1c
failing since 13 days (last pass: v4.19.233-516-ge5e741fbfc87, first fail: v5.10.109-cip5-384-g722204542e8a)



platform | arch | lab | compiler | defconfig | regressions
---------------------------+--------+---------------+----------+------------------------------+------------
qemu_arm64-virt-gicv2-uefi | arm64 | lab-baylibre | gcc-10 | defconfig | 1

Details: https://kernelci.org/test/plan/id/628bb8f13544937908a39bdf

Results: 0 PASS, 1 FAIL, 0 SKIP
Full config: defconfig
Compiler: gcc-10 (aarch64-linux-gnu-gcc (Debian 10.2.1-6) 10.2.1 20210110)
Plain log: https://storage.kernelci.org//cip-gitlab/ci-pavel-linux-test/v4.4-st5-1797-gb2b8419761095/arm64/defconfig/gcc-10/lab-baylibre/baseline-qemu_arm64-virt-gicv2-uefi.txt
HTML log: https://storage.kernelci.org//cip-gitlab/ci-pavel-linux-test/v4.4-st5-1797-gb2b8419761095/arm64/defconfig/gcc-10/lab-baylibre/baseline-qemu_arm64-virt-gicv2-uefi.html
Rootfs: http://storage.kernelci.org/images/rootfs/buildroot/buildroot-baseline/20220513.0/arm64/rootfs.cpio.gz


* baseline.login: https://kernelci.org/test/case/id/628bb8f13544937908a39be0
failing since 13 days (last pass: v4.19.233-516-ge5e741fbfc87, first fail: v5.10.109-cip5-384-g722204542e8a)



platform | arch | lab | compiler | defconfig | regressions
---------------------------+--------+---------------+----------+------------------------------+------------
qemu_arm64-virt-gicv2-uefi | arm64 | lab-broonie | gcc-10 | defconfig+arm64-chromebook | 1

Details: https://kernelci.org/test/plan/id/628bb8179a9063be77a39c4f

Results: 0 PASS, 1 FAIL, 0 SKIP
Full config: defconfig+arm64-chromebook
Compiler: gcc-10 (aarch64-linux-gnu-gcc (Debian 10.2.1-6) 10.2.1 20210110)
Plain log: https://storage.kernelci.org//cip-gitlab/ci-pavel-linux-test/v4.4-st5-1797-gb2b8419761095/arm64/defconfig+arm64-chromebook/gcc-10/lab-broonie/baseline-qemu_arm64-virt-gicv2-uefi.txt
HTML log: https://storage.kernelci.org//cip-gitlab/ci-pavel-linux-test/v4.4-st5-1797-gb2b8419761095/arm64/defconfig+arm64-chromebook/gcc-10/lab-broonie/baseline-qemu_arm64-virt-gicv2-uefi.html
Rootfs: http://storage.kernelci.org/images/rootfs/buildroot/buildroot-baseline/20220513.0/arm64/rootfs.cpio.gz


* baseline.login: https://kernelci.org/test/case/id/628bb8179a9063be77a39c50
failing since 13 days (last pass: v4.19.233-516-ge5e741fbfc87, first fail: v5.10.109-cip5-384-g722204542e8a)



platform | arch | lab | compiler | defconfig | regressions
---------------------------+--------+---------------+----------+------------------------------+------------
qemu_arm64-virt-gicv2-uefi | arm64 | lab-broonie | gcc-10 | defconfig | 1

Details: https://kernelci.org/test/plan/id/628bbc782f0c6a4ddaa39bd1

Results: 0 PASS, 1 FAIL, 0 SKIP
Full config: defconfig
Compiler: gcc-10 (aarch64-linux-gnu-gcc (Debian 10.2.1-6) 10.2.1 20210110)
Plain log: https://storage.kernelci.org//cip-gitlab/ci-pavel-linux-test/v4.4-st5-1797-gb2b8419761095/arm64/defconfig/gcc-10/lab-broonie/baseline-qemu_arm64-virt-gicv2-uefi.txt
HTML log: https://storage.kernelci.org//cip-gitlab/ci-pavel-linux-test/v4.4-st5-1797-gb2b8419761095/arm64/defconfig/gcc-10/lab-broonie/baseline-qemu_arm64-virt-gicv2-uefi.html
Rootfs: http://storage.kernelci.org/images/rootfs/buildroot/buildroot-baseline/20220513.0/arm64/rootfs.cpio.gz


* baseline.login: https://kernelci.org/test/case/id/628bbc782f0c6a4ddaa39bd2
failing since 13 days (last pass: v4.19.233-516-ge5e741fbfc87, first fail: v5.10.109-cip5-384-g722204542e8a)



platform | arch | lab | compiler | defconfig | regressions
---------------------------+--------+---------------+----------+------------------------------+------------
qemu_arm64-virt-gicv3 | arm64 | lab-baylibre | gcc-10 | defconfig+arm64-chromebook | 1

Details: https://kernelci.org/test/plan/id/628bb67334da8b12b7a39c06

Results: 0 PASS, 1 FAIL, 0 SKIP
Full config: defconfig+arm64-chromebook
Compiler: gcc-10 (aarch64-linux-gnu-gcc (Debian 10.2.1-6) 10.2.1 20210110)
Plain log: https://storage.kernelci.org//cip-gitlab/ci-pavel-linux-test/v4.4-st5-1797-gb2b8419761095/arm64/defconfig+arm64-chromebook/gcc-10/lab-baylibre/baseline-qemu_arm64-virt-gicv3.txt
HTML log: https://storage.kernelci.org//cip-gitlab/ci-pavel-linux-test/v4.4-st5-1797-gb2b8419761095/arm64/defconfig+arm64-chromebook/gcc-10/lab-baylibre/baseline-qemu_arm64-virt-gicv3.html
Rootfs: http://storage.kernelci.org/images/rootfs/buildroot/buildroot-baseline/20220513.0/arm64/rootfs.cpio.gz


* baseline.login: https://kernelci.org/test/case/id/628bb67334da8b12b7a39c07
failing since 13 days (last pass: v4.19.233-516-ge5e741fbfc87, first fail: v5.10.109-cip5-384-g722204542e8a)



platform | arch | lab | compiler | defconfig | regressions
---------------------------+--------+---------------+----------+------------------------------+------------
qemu_arm64-virt-gicv3 | arm64 | lab-baylibre | gcc-10 | defconfig | 1

Details: https://kernelci.org/test/plan/id/628bb8f49cd7c0b5dea39bcd

Results: 0 PASS, 1 FAIL, 0 SKIP
Full config: defconfig
Compiler: gcc-10 (aarch64-linux-gnu-gcc (Debian 10.2.1-6) 10.2.1 20210110)
Plain log: https://storage.kernelci.org//cip-gitlab/ci-pavel-linux-test/v4.4-st5-1797-gb2b8419761095/arm64/defconfig/gcc-10/lab-baylibre/baseline-qemu_arm64-virt-gicv3.txt
HTML log: https://storage.kernelci.org//cip-gitlab/ci-pavel-linux-test/v4.4-st5-1797-gb2b8419761095/arm64/defconfig/gcc-10/lab-baylibre/baseline-qemu_arm64-virt-gicv3.html
Rootfs: http://storage.kernelci.org/images/rootfs/buildroot/buildroot-baseline/20220513.0/arm64/rootfs.cpio.gz


* baseline.login: https://kernelci.org/test/case/id/628bb8f49cd7c0b5dea39bce
failing since 13 days (last pass: v4.19.233-516-ge5e741fbfc87, first fail: v5.10.109-cip5-384-g722204542e8a)



platform | arch | lab | compiler | defconfig | regressions
---------------------------+--------+---------------+----------+------------------------------+------------
qemu_arm64-virt-gicv3 | arm64 | lab-broonie | gcc-10 | defconfig+arm64-chromebook | 1

Details: https://kernelci.org/test/plan/id/628bb7db7eb6091a0fa39bcd

Results: 0 PASS, 1 FAIL, 0 SKIP
Full config: defconfig+arm64-chromebook
Compiler: gcc-10 (aarch64-linux-gnu-gcc (Debian 10.2.1-6) 10.2.1 20210110)
Plain log: https://storage.kernelci.org//cip-gitlab/ci-pavel-linux-test/v4.4-st5-1797-gb2b8419761095/arm64/defconfig+arm64-chromebook/gcc-10/lab-broonie/baseline-qemu_arm64-virt-gicv3.txt
HTML log: https://storage.kernelci.org//cip-gitlab/ci-pavel-linux-test/v4.4-st5-1797-gb2b8419761095/arm64/defconfig+arm64-chromebook/gcc-10/lab-broonie/baseline-qemu_arm64-virt-gicv3.html
Rootfs: http://storage.kernelci.org/images/rootfs/buildroot/buildroot-baseline/20220513.0/arm64/rootfs.cpio.gz


* baseline.login: https://kernelci.org/test/case/id/628bb7db7eb6091a0fa39bce
failing since 13 days (last pass: v4.19.233-516-ge5e741fbfc87, first fail: v5.10.109-cip5-384-g722204542e8a)



platform | arch | lab | compiler | defconfig | regressions
---------------------------+--------+---------------+----------+------------------------------+------------
qemu_arm64-virt-gicv3 | arm64 | lab-broonie | gcc-10 | defconfig | 1

Details: https://kernelci.org/test/plan/id/628bbc7a32e7d00759a39bd2

Results: 0 PASS, 1 FAIL, 0 SKIP
Full config: defconfig
Compiler: gcc-10 (aarch64-linux-gnu-gcc (Debian 10.2.1-6) 10.2.1 20210110)
Plain log: https://storage.kernelci.org//cip-gitlab/ci-pavel-linux-test/v4.4-st5-1797-gb2b8419761095/arm64/defconfig/gcc-10/lab-broonie/baseline-qemu_arm64-virt-gicv3.txt
HTML log: https://storage.kernelci.org//cip-gitlab/ci-pavel-linux-test/v4.4-st5-1797-gb2b8419761095/arm64/defconfig/gcc-10/lab-broonie/baseline-qemu_arm64-virt-gicv3.html
Rootfs: http://storage.kernelci.org/images/rootfs/buildroot/buildroot-baseline/20220513.0/arm64/rootfs.cpio.gz


* baseline.login: https://kernelci.org/test/case/id/628bbc7a32e7d00759a39bd3
failing since 13 days (last pass: v4.19.233-516-ge5e741fbfc87, first fail: v5.10.109-cip5-384-g722204542e8a)



platform | arch | lab | compiler | defconfig | regressions
---------------------------+--------+---------------+----------+------------------------------+------------
qemu_arm64-virt-gicv3-uefi | arm64 | lab-baylibre | gcc-10 | defconfig+arm64-chromebook | 1

Details: https://kernelci.org/test/plan/id/628bb67434da8b12b7a39c09

Results: 0 PASS, 1 FAIL, 0 SKIP
Full config: defconfig+arm64-chromebook
Compiler: gcc-10 (aarch64-linux-gnu-gcc (Debian 10.2.1-6) 10.2.1 20210110)
Plain log: https://storage.kernelci.org//cip-gitlab/ci-pavel-linux-test/v4.4-st5-1797-gb2b8419761095/arm64/defconfig+arm64-chromebook/gcc-10/lab-baylibre/baseline-qemu_arm64-virt-gicv3-uefi.txt
HTML log: https://storage.kernelci.org//cip-gitlab/ci-pavel-linux-test/v4.4-st5-1797-gb2b8419761095/arm64/defconfig+arm64-chromebook/gcc-10/lab-baylibre/baseline-qemu_arm64-virt-gicv3-uefi.html
Rootfs: http://storage.kernelci.org/images/rootfs/buildroot/buildroot-baseline/20220513.0/arm64/rootfs.cpio.gz


* baseline.login: https://kernelci.org/test/case/id/628bb67434da8b12b7a39c0a
failing since 13 days (last pass: v4.19.233-516-ge5e741fbfc87, first fail: v5.10.109-cip5-384-g722204542e8a)



platform | arch | lab | compiler | defconfig | regressions
---------------------------+--------+---------------+----------+------------------------------+------------
qemu_arm64-virt-gicv3-uefi | arm64 | lab-baylibre | gcc-10 | defconfig | 1

Details: https://kernelci.org/test/plan/id/628bb91b9cd7c0b5dea39c17

Results: 0 PASS, 1 FAIL, 0 SKIP
Full config: defconfig
Compiler: gcc-10 (aarch64-linux-gnu-gcc (Debian 10.2.1-6) 10.2.1 20210110)
Plain log: https://storage.kernelci.org//cip-gitlab/ci-pavel-linux-test/v4.4-st5-1797-gb2b8419761095/arm64/defconfig/gcc-10/lab-baylibre/baseline-qemu_arm64-virt-gicv3-uefi.txt
HTML log: https://storage.kernelci.org//cip-gitlab/ci-pavel-linux-test/v4.4-st5-1797-gb2b8419761095/arm64/defconfig/gcc-10/lab-baylibre/baseline-qemu_arm64-virt-gicv3-uefi.html
Rootfs: http://storage.kernelci.org/images/rootfs/buildroot/buildroot-baseline/20220513.0/arm64/rootfs.cpio.gz


* baseline.login: https://kernelci.org/test/case/id/628bb91b9cd7c0b5dea39c18
failing since 13 days (last pass: v4.19.233-516-ge5e741fbfc87, first fail: v5.10.109-cip5-384-g722204542e8a)



platform | arch | lab | compiler | defconfig | regressions
---------------------------+--------+---------------+----------+------------------------------+------------
qemu_arm64-virt-gicv3-uefi | arm64 | lab-broonie | gcc-10 | defconfig+arm64-chromebook | 1

Details: https://kernelci.org/test/plan/id/628bb803f891c4318da39bd9

Results: 0 PASS, 1 FAIL, 0 SKIP
Full config: defconfig+arm64-chromebook
Compiler: gcc-10 (aarch64-linux-gnu-gcc (Debian 10.2.1-6) 10.2.1 20210110)
Plain log: https://storage.kernelci.org//cip-gitlab/ci-pavel-linux-test/v4.4-st5-1797-gb2b8419761095/arm64/defconfig+arm64-chromebook/gcc-10/lab-broonie/baseline-qemu_arm64-virt-gicv3-uefi.txt
HTML log: https://storage.kernelci.org//cip-gitlab/ci-pavel-linux-test/v4.4-st5-1797-gb2b8419761095/arm64/defconfig+arm64-chromebook/gcc-10/lab-broonie/baseline-qemu_arm64-virt-gicv3-uefi.html
Rootfs: http://storage.kernelci.org/images/rootfs/buildroot/buildroot-baseline/20220513.0/arm64/rootfs.cpio.gz


* baseline.login: https://kernelci.org/test/case/id/628bb803f891c4318da39bda
failing since 13 days (last pass: v4.19.233-516-ge5e741fbfc87, first fail: v5.10.109-cip5-384-g722204542e8a)



platform | arch | lab | compiler | defconfig | regressions
---------------------------+--------+---------------+----------+------------------------------+------------
qemu_arm64-virt-gicv3-uefi | arm64 | lab-broonie | gcc-10 | defconfig | 1

Details: https://kernelci.org/test/plan/id/628bbc8d32e7d00759a39bf1

Results: 0 PASS, 1 FAIL, 0 SKIP
Full config: defconfig
Compiler: gcc-10 (aarch64-linux-gnu-gcc (Debian 10.2.1-6) 10.2.1 20210110)
Plain log: https://storage.kernelci.org//cip-gitlab/ci-pavel-linux-test/v4.4-st5-1797-gb2b8419761095/arm64/defconfig/gcc-10/lab-broonie/baseline-qemu_arm64-virt-gicv3-uefi.txt
HTML log: https://storage.kernelci.org//cip-gitlab/ci-pavel-linux-test/v4.4-st5-1797-gb2b8419761095/arm64/defconfig/gcc-10/lab-broonie/baseline-qemu_arm64-virt-gicv3-uefi.html
Rootfs: http://storage.kernelci.org/images/rootfs/buildroot/buildroot-baseline/20220513.0/arm64/rootfs.cpio.gz


* baseline.login: https://kernelci.org/test/case/id/628bbc8d32e7d00759a39bf2
failing since 13 days (last pass: v4.19.233-516-ge5e741fbfc87, first fail: v5.10.109-cip5-384-g722204542e8a)



platform | arch | lab | compiler | defconfig | regressions
---------------------------+--------+---------------+----------+------------------------------+------------
qemu_x86_64-uefi-mixed | x86_64 | lab-baylibre | gcc-10 | x86_64_defconfig | 1

Details: https://kernelci.org/test/plan/id/628bb6c4e7c2c5e18da39be8

Results: 0 PASS, 1 FAIL, 0 SKIP
Full config: x86_64_defconfig
Compiler: gcc-10 (gcc (Debian 10.2.1-6) 10.2.1 20210110)
Plain log: https://storage.kernelci.org//cip-gitlab/ci-pavel-linux-test/v4.4-st5-1797-gb2b8419761095/x86_64/x86_64_defconfig/gcc-10/lab-baylibre/baseline-qemu_x86_64-uefi-mixed.txt
HTML log: https://storage.kernelci.org//cip-gitlab/ci-pavel-linux-test/v4.4-st5-1797-gb2b8419761095/x86_64/x86_64_defconfig/gcc-10/lab-baylibre/baseline-qemu_x86_64-uefi-mixed.html
Rootfs: http://storage.kernelci.org/images/rootfs/buildroot/buildroot-baseline/20220513.0/x86/rootfs.cpio.gz


* baseline.login: https://kernelci.org/test/case/id/628bb6c4e7c2c5e18da39be9
failing since 12 days (last pass: v5.10.109-cip5-384-g722204542e8a, first fail: v4.4-st5-23-gf7cf04ab668f1)



platform | arch | lab | compiler | defconfig | regressions
---------------------------+--------+---------------+----------+------------------------------+------------
qemu_x86_64-uefi-mixed | x86_64 | lab-baylibre | gcc-10 | x86_64_defcon...6-chromebook | 1

Details: https://kernelci.org/test/plan/id/628bb852ca95b1d42ca39bdd

Results: 0 PASS, 1 FAIL, 0 SKIP
Full config: x86_64_defconfig+x86-chromebook
Compiler: gcc-10 (gcc (Debian 10.2.1-6) 10.2.1 20210110)
Plain log: https://storage.kernelci.org//cip-gitlab/ci-pavel-linux-test/v4.4-st5-1797-gb2b8419761095/x86_64/x86_64_defconfig+x86-chromebook/gcc-10/lab-baylibre/baseline-qemu_x86_64-uefi-mixed.txt
HTML log: https://storage.kernelci.org//cip-gitlab/ci-pavel-linux-test/v4.4-st5-1797-gb2b8419761095/x86_64/x86_64_defconfig+x86-chromebook/gcc-10/lab-baylibre/baseline-qemu_x86_64-uefi-mixed.html
Rootfs: http://storage.kernelci.org/images/rootfs/buildroot/buildroot-baseline/20220513.0/x86/rootfs.cpio.gz


* baseline.login: https://kernelci.org/test/case/id/628bb852ca95b1d42ca39bde
failing since 12 days (last pass: v5.10.109-cip5-384-g722204542e8a, first fail: v4.4-st5-23-gf7cf04ab668f1)



platform | arch | lab | compiler | defconfig | regressions
---------------------------+--------+---------------+----------+------------------------------+------------
qemu_x86_64-uefi-mixed | x86_64 | lab-broonie | gcc-10 | x86_64_defconfig | 1

Details: https://kernelci.org/test/plan/id/628bb8b88783c496f8a39bed

Results: 0 PASS, 1 FAIL, 0 SKIP
Full config: x86_64_defconfig
Compiler: gcc-10 (gcc (Debian 10.2.1-6) 10.2.1 20210110)
Plain log: https://storage.kernelci.org//cip-gitlab/ci-pavel-linux-test/v4.4-st5-1797-gb2b8419761095/x86_64/x86_64_defconfig/gcc-10/lab-broonie/baseline-qemu_x86_64-uefi-mixed.txt
HTML log: https://storage.kernelci.org//cip-gitlab/ci-pavel-linux-test/v4.4-st5-1797-gb2b8419761095/x86_64/x86_64_defconfig/gcc-10/lab-broonie/baseline-qemu_x86_64-uefi-mixed.html
Rootfs: http://storage.kernelci.org/images/rootfs/buildroot/buildroot-baseline/20220513.0/x86/rootfs.cpio.gz


* baseline.login: https://kernelci.org/test/case/id/628bb8b88783c496f8a39bee
failing since 12 days (last pass: v5.10.109-cip5-384-g722204542e8a, first fail: v4.4-st5-23-gf7cf04ab668f1)



platform | arch | lab | compiler | defconfig | regressions
---------------------------+--------+---------------+----------+------------------------------+------------
qemu_x86_64-uefi-mixed | x86_64 | lab-broonie | gcc-10 | x86_64_defcon...6-chromebook | 1

Details: https://kernelci.org/test/plan/id/628bbafc766ce5040ba39be8

Results: 0 PASS, 1 FAIL, 0 SKIP
Full config: x86_64_defconfig+x86-chromebook
Compiler: gcc-10 (gcc (Debian 10.2.1-6) 10.2.1 20210110)
Plain log: https://storage.kernelci.org//cip-gitlab/ci-pavel-linux-test/v4.4-st5-1797-gb2b8419761095/x86_64/x86_64_defconfig+x86-chromebook/gcc-10/lab-broonie/baseline-qemu_x86_64-uefi-mixed.txt
HTML log: https://storage.kernelci.org//cip-gitlab/ci-pavel-linux-test/v4.4-st5-1797-gb2b8419761095/x86_64/x86_64_defconfig+x86-chromebook/gcc-10/lab-broonie/baseline-qemu_x86_64-uefi-mixed.html
Rootfs: http://storage.kernelci.org/images/rootfs/buildroot/buildroot-baseline/20220513.0/x86/rootfs.cpio.gz


* baseline.login: https://kernelci.org/test/case/id/628bbafc766ce5040ba39be9
failing since 12 days (last pass: v5.10.109-cip5-384-g722204542e8a, first fail: v4.4-st5-23-gf7cf04ab668f1)


cip-gitlab/ci/pavel/linux-test baseline-nfs: 17 runs, 12 regressions (v4.4-st5-1797-gb2b8419761095) #kernelci

kernelci.org bot <bot@...>
 

cip-gitlab/ci/pavel/linux-test baseline-nfs: 17 runs, 12 regressions (v4.4-st5-1797-gb2b8419761095)

Regressions Summary
-------------------

platform | arch | lab | compiler | defconfig | regressions
--------------------------+--------+---------------+----------+------------------------------+------------
asus-C433TA-AJ0005-rammus | x86_64 | lab-collabora | gcc-10 | x86_64_defcon...6-chromebook | 1
asus-C436FA-Flip-hatch | x86_64 | lab-collabora | gcc-10 | x86_64_defcon...6-chromebook | 1
asus-C523NA-A20057-coral | x86_64 | lab-collabora | gcc-10 | x86_64_defcon...6-chromebook | 1
asus-cx9400-volteer | x86_64 | lab-collabora | gcc-10 | x86_64_defcon...6-chromebook | 1
beaglebone-black | arm | lab-broonie | gcc-10 | multi_v7_defconfig | 1
beaglebone-black | arm | lab-cip | gcc-10 | multi_v7_defconfig | 1
beaglebone-black | arm | lab-broonie | gcc-10 | omap2plus_defconfig | 1
beaglebone-black | arm | lab-cip | gcc-10 | omap2plus_defconfig | 1
hp-11A-G6-EE-grunt | x86_64 | lab-collabora | gcc-10 | x86_64_defcon...6-chromebook | 1
hp-x360-12b-n4000-octopus | x86_64 | lab-collabora | gcc-10 | x86_64_defcon...6-chromebook | 1
hp-x360-14-G1-sona | x86_64 | lab-collabora | gcc-10 | x86_64_defcon...6-chromebook | 1
juno-uboot | arm64 | lab-broonie | gcc-10 | defconfig | 1

Details: https://kernelci.org/test/job/cip-gitlab/branch/ci%2Fpavel%2Flinux-test/kernel/v4.4-st5-1797-gb2b8419761095/plan/baseline-nfs/

Test: baseline-nfs
Tree: cip-gitlab
Branch: ci/pavel/linux-test
Describe: v4.4-st5-1797-gb2b8419761095
URL: https://gitlab.com/cip-project/cip-kernel/linux-cip.git
SHA: b2b8419761095643d782c4cb4a982131b3efb6b8


Test Regressions
----------------


platform | arch | lab | compiler | defconfig | regressions
--------------------------+--------+---------------+----------+------------------------------+------------
asus-C433TA-AJ0005-rammus | x86_64 | lab-collabora | gcc-10 | x86_64_defcon...6-chromebook | 1

Details: https://kernelci.org/test/plan/id/628bb61469f70a531da39c4c

Results: 0 PASS, 1 FAIL, 0 SKIP
Full config: x86_64_defconfig+x86-chromebook
Compiler: gcc-10 (gcc (Debian 10.2.1-6) 10.2.1 20210110)
Plain log: https://storage.kernelci.org//cip-gitlab/ci-pavel-linux-test/v4.4-st5-1797-gb2b8419761095/x86_64/x86_64_defconfig+x86-chromebook/gcc-10/lab-collabora/baseline-nfs-asus-C433TA-AJ0005-rammus.txt
HTML log: https://storage.kernelci.org//cip-gitlab/ci-pavel-linux-test/v4.4-st5-1797-gb2b8419761095/x86_64/x86_64_defconfig+x86-chromebook/gcc-10/lab-collabora/baseline-nfs-asus-C433TA-AJ0005-rammus.html
Rootfs: http://storage.kernelci.org/images/rootfs/debian/bullseye/20220513.0/amd64/initrd.cpio.gz


* baseline-nfs.login: https://kernelci.org/test/case/id/628bb61469f70a531da39c4d
failing since 12 days (last pass: v5.10.109-cip5-384-g722204542e8a, first fail: v4.4-st5-23-gf7cf04ab668f1)



platform | arch | lab | compiler | defconfig | regressions
--------------------------+--------+---------------+----------+------------------------------+------------
asus-C436FA-Flip-hatch | x86_64 | lab-collabora | gcc-10 | x86_64_defcon...6-chromebook | 1

Details: https://kernelci.org/test/plan/id/628bbab31d6e395e9ea39bf5

Results: 0 PASS, 1 FAIL, 0 SKIP
Full config: x86_64_defconfig+x86-chromebook
Compiler: gcc-10 (gcc (Debian 10.2.1-6) 10.2.1 20210110)
Plain log: https://storage.kernelci.org//cip-gitlab/ci-pavel-linux-test/v4.4-st5-1797-gb2b8419761095/x86_64/x86_64_defconfig+x86-chromebook/gcc-10/lab-collabora/baseline-nfs-asus-C436FA-Flip-hatch.txt
HTML log: https://storage.kernelci.org//cip-gitlab/ci-pavel-linux-test/v4.4-st5-1797-gb2b8419761095/x86_64/x86_64_defconfig+x86-chromebook/gcc-10/lab-collabora/baseline-nfs-asus-C436FA-Flip-hatch.html
Rootfs: http://storage.kernelci.org/images/rootfs/debian/bullseye/20220513.0/amd64/initrd.cpio.gz


* baseline-nfs.login: https://kernelci.org/test/case/id/628bbab31d6e395e9ea39bf6
failing since 12 days (last pass: v5.10.109-cip5-384-g722204542e8a, first fail: v4.4-st5-23-gf7cf04ab668f1)



platform | arch | lab | compiler | defconfig | regressions
--------------------------+--------+---------------+----------+------------------------------+------------
asus-C523NA-A20057-coral | x86_64 | lab-collabora | gcc-10 | x86_64_defcon...6-chromebook | 1

Details: https://kernelci.org/test/plan/id/628bba9659e98be588a39bd8

Results: 0 PASS, 1 FAIL, 0 SKIP
Full config: x86_64_defconfig+x86-chromebook
Compiler: gcc-10 (gcc (Debian 10.2.1-6) 10.2.1 20210110)
Plain log: https://storage.kernelci.org//cip-gitlab/ci-pavel-linux-test/v4.4-st5-1797-gb2b8419761095/x86_64/x86_64_defconfig+x86-chromebook/gcc-10/lab-collabora/baseline-nfs-asus-C523NA-A20057-coral.txt
HTML log: https://storage.kernelci.org//cip-gitlab/ci-pavel-linux-test/v4.4-st5-1797-gb2b8419761095/x86_64/x86_64_defconfig+x86-chromebook/gcc-10/lab-collabora/baseline-nfs-asus-C523NA-A20057-coral.html
Rootfs: http://storage.kernelci.org/images/rootfs/debian/bullseye/20220513.0/amd64/initrd.cpio.gz


* baseline-nfs.login: https://kernelci.org/test/case/id/628bba9659e98be588a39bd9
failing since 7 days (last pass: v4.4.302-cip69-50-gba851b77071ca, first fail: v4.4-st5-208-g5e70bc68d09e)



platform | arch | lab | compiler | defconfig | regressions
--------------------------+--------+---------------+----------+------------------------------+------------
asus-cx9400-volteer | x86_64 | lab-collabora | gcc-10 | x86_64_defcon...6-chromebook | 1

Details: https://kernelci.org/test/plan/id/628bb6e39fd4928edba39bec

Results: 0 PASS, 1 FAIL, 0 SKIP
Full config: x86_64_defconfig+x86-chromebook
Compiler: gcc-10 (gcc (Debian 10.2.1-6) 10.2.1 20210110)
Plain log: https://storage.kernelci.org//cip-gitlab/ci-pavel-linux-test/v4.4-st5-1797-gb2b8419761095/x86_64/x86_64_defconfig+x86-chromebook/gcc-10/lab-collabora/baseline-nfs-asus-cx9400-volteer.txt
HTML log: https://storage.kernelci.org//cip-gitlab/ci-pavel-linux-test/v4.4-st5-1797-gb2b8419761095/x86_64/x86_64_defconfig+x86-chromebook/gcc-10/lab-collabora/baseline-nfs-asus-cx9400-volteer.html
Rootfs: http://storage.kernelci.org/images/rootfs/debian/bullseye/20220513.0/amd64/initrd.cpio.gz


* baseline-nfs.login: https://kernelci.org/test/case/id/628bb6e39fd4928edba39bed
failing since 12 days (last pass: v5.10.109-cip5-384-g722204542e8a, first fail: v4.4-st5-23-gf7cf04ab668f1)



platform | arch | lab | compiler | defconfig | regressions
--------------------------+--------+---------------+----------+------------------------------+------------
beaglebone-black | arm | lab-broonie | gcc-10 | multi_v7_defconfig | 1

Details: https://kernelci.org/test/plan/id/628bbac64dbac7278fa39be6

Results: 3 PASS, 1 FAIL, 1 SKIP
Full config: multi_v7_defconfig
Compiler: gcc-10 (arm-linux-gnueabihf-gcc (Debian 10.2.1-6) 10.2.1 20210110)
Plain log: https://storage.kernelci.org//cip-gitlab/ci-pavel-linux-test/v4.4-st5-1797-gb2b8419761095/arm/multi_v7_defconfig/gcc-10/lab-broonie/baseline-nfs-beaglebone-black.txt
HTML log: https://storage.kernelci.org//cip-gitlab/ci-pavel-linux-test/v4.4-st5-1797-gb2b8419761095/arm/multi_v7_defconfig/gcc-10/lab-broonie/baseline-nfs-beaglebone-black.html
Rootfs: http://storage.kernelci.org/images/rootfs/debian/bullseye/20220513.0/armhf/initrd.cpio.gz


* baseline-nfs.dmesg.crit: https://kernelci.org/test/case/id/628bbac64dbac7278fa39bed
failing since 13 days (last pass: v5.10.109-cip5-384-g722204542e8a, first fail: v4.4-st5-260-gb0fe64f485ff)
1 lines

2022-05-23T16:47:34.689968 / #
2022-05-23T16:47:34.696947
2022-05-23T16:47:39.711848 / # export NFS_ROOTFS='/var/lib/lava/dispatcher/tmp/164492/extract-nfsrootfs-v9ukoutf'
2022-05-23T16:47:39.722830 export NFS_ROOTFS='/var/lib/lava/dispatcher/tmp/164492/extract-nfsrootfs-v9ukoutf'
2022-05-23T16:47:42.013896 / # export NFS_SERVER_IP='192.168.56.230'
2022-05-23T16:47:42.024922 export NFS_SERVER_IP='192.168.56.230'
2022-05-23T16:47:42.130154 / # #
2022-05-23T16:47:42.137139 #
2022-05-23T16:47:42.239703 / # export SHELL=/bin/sh
2022-05-23T16:47:42.246560 export SHELL=/bin/sh
... (13 line(s) more)



platform | arch | lab | compiler | defconfig | regressions
--------------------------+--------+---------------+----------+------------------------------+------------
beaglebone-black | arm | lab-cip | gcc-10 | multi_v7_defconfig | 1

Details: https://kernelci.org/test/plan/id/628bb714ae6f4722d8a39c4c

Results: 3 PASS, 1 FAIL, 1 SKIP
Full config: multi_v7_defconfig
Compiler: gcc-10 (arm-linux-gnueabihf-gcc (Debian 10.2.1-6) 10.2.1 20210110)
Plain log: https://storage.kernelci.org//cip-gitlab/ci-pavel-linux-test/v4.4-st5-1797-gb2b8419761095/arm/multi_v7_defconfig/gcc-10/lab-cip/baseline-nfs-beaglebone-black.txt
HTML log: https://storage.kernelci.org//cip-gitlab/ci-pavel-linux-test/v4.4-st5-1797-gb2b8419761095/arm/multi_v7_defconfig/gcc-10/lab-cip/baseline-nfs-beaglebone-black.html
Rootfs: http://storage.kernelci.org/images/rootfs/debian/bullseye/20220513.0/armhf/initrd.cpio.gz


* baseline-nfs.dmesg.crit: https://kernelci.org/test/case/id/628bb714ae6f4722d8a39c51
failing since 13 days (last pass: v5.10.109-cip5-384-g722204542e8a, first fail: v4.4-st5-260-gb0fe64f485ff)
1 lines

2022-05-23T16:32:01.592647 / #
2022-05-23T16:32:01.594948
2022-05-23T16:32:06.604425 / # export NFS_ROOTFS='/var/lib/lava/dispatcher/tmp/684349/extract-nfsrootfs-daamjuva'
2022-05-23T16:32:06.615117 export NFS_ROOTFS='/var/lib/lava/dispatcher/tmp/684349/extract-nfsrootfs-daamjuva'
2022-05-23T16:32:08.781652 / # export NFS_SERVER_IP='192.168.11.5'
2022-05-23T16:32:08.792359 export NFS_SERVER_IP='192.168.11.5'
2022-05-23T16:32:08.895716 / # #
2022-05-23T16:32:08.898065 #
2022-05-23T16:32:09.001186 / # export SHELL=/bin/sh
2022-05-23T16:32:09.003526 export SHELL=/bin/sh
... (13 line(s) more)



platform | arch | lab | compiler | defconfig | regressions
--------------------------+--------+---------------+----------+------------------------------+------------
beaglebone-black | arm | lab-broonie | gcc-10 | omap2plus_defconfig | 1

Details: https://kernelci.org/test/plan/id/628bbb660d18c63212a39c15

Results: 3 PASS, 1 FAIL, 1 SKIP
Full config: omap2plus_defconfig
Compiler: gcc-10 (arm-linux-gnueabihf-gcc (Debian 10.2.1-6) 10.2.1 20210110)
Plain log: https://storage.kernelci.org//cip-gitlab/ci-pavel-linux-test/v4.4-st5-1797-gb2b8419761095/arm/omap2plus_defconfig/gcc-10/lab-broonie/baseline-nfs-beaglebone-black.txt
HTML log: https://storage.kernelci.org//cip-gitlab/ci-pavel-linux-test/v4.4-st5-1797-gb2b8419761095/arm/omap2plus_defconfig/gcc-10/lab-broonie/baseline-nfs-beaglebone-black.html
Rootfs: http://storage.kernelci.org/images/rootfs/debian/bullseye/20220513.0/armhf/initrd.cpio.gz


* baseline-nfs.dmesg.crit: https://kernelci.org/test/case/id/628bbb660d18c63212a39c1c
failing since 13 days (last pass: v5.10.109-cip5-384-g722204542e8a, first fail: v4.4-st5-260-gb0fe64f485ff)
1 lines

2022-05-23T16:50:31.102685 / #
2022-05-23T16:50:31.108772
2022-05-23T16:50:36.128670 / # export NFS_ROOTFS='/var/lib/lava/dispatcher/tmp/164529/extract-nfsrootfs-rib_tfqf'
2022-05-23T16:50:36.139220 export NFS_ROOTFS='/var/lib/lava/dispatcher/tmp/164529/extract-nfsrootfs-rib_tfqf'
2022-05-23T16:50:38.432692 / # export NFS_SERVER_IP='192.168.56.230'
2022-05-23T16:50:38.443168 export NFS_SERVER_IP='192.168.56.230'
2022-05-23T16:50:38.551656 / # #
2022-05-23T16:50:38.556518 #
2022-05-23T16:50:38.669014 / # export SHELL=/bin/sh
2022-05-23T16:50:38.673875 export SHELL=/bin/sh
... (13 line(s) more)



platform | arch | lab | compiler | defconfig | regressions
--------------------------+--------+---------------+----------+------------------------------+------------
beaglebone-black | arm | lab-cip | gcc-10 | omap2plus_defconfig | 1

Details: https://kernelci.org/test/plan/id/628bb7b526df67dab5a39beb

Results: 3 PASS, 1 FAIL, 1 SKIP
Full config: omap2plus_defconfig
Compiler: gcc-10 (arm-linux-gnueabihf-gcc (Debian 10.2.1-6) 10.2.1 20210110)
Plain log: https://storage.kernelci.org//cip-gitlab/ci-pavel-linux-test/v4.4-st5-1797-gb2b8419761095/arm/omap2plus_defconfig/gcc-10/lab-cip/baseline-nfs-beaglebone-black.txt
HTML log: https://storage.kernelci.org//cip-gitlab/ci-pavel-linux-test/v4.4-st5-1797-gb2b8419761095/arm/omap2plus_defconfig/gcc-10/lab-cip/baseline-nfs-beaglebone-black.html
Rootfs: http://storage.kernelci.org/images/rootfs/debian/bullseye/20220513.0/armhf/initrd.cpio.gz


* baseline-nfs.dmesg.crit: https://kernelci.org/test/case/id/628bb7b526df67dab5a39bf0
failing since 13 days (last pass: v5.10.109-cip5-384-g722204542e8a, first fail: v4.4-st5-260-gb0fe64f485ff)
1 lines

2022-05-23T16:34:29.883179 / #
2022-05-23T16:34:29.886097
2022-05-23T16:34:34.897917 / # export NFS_ROOTFS='/var/lib/lava/dispatcher/tmp/684351/extract-nfsrootfs-adlar4px'
2022-05-23T16:34:34.908607 export NFS_ROOTFS='/var/lib/lava/dispatcher/tmp/684351/extract-nfsrootfs-adlar4px'
2022-05-23T16:34:37.082000 / # export NFS_SERVER_IP='192.168.11.5'
2022-05-23T16:34:37.092673 export NFS_SERVER_IP='192.168.11.5'
2022-05-23T16:34:37.199395 / # #
2022-05-23T16:34:37.202135 #
2022-05-23T16:34:37.314911 / # export SHELL=/bin/sh
2022-05-23T16:34:37.317526 export SHELL=/bin/sh
... (13 line(s) more)



platform | arch | lab | compiler | defconfig | regressions
--------------------------+--------+---------------+----------+------------------------------+------------
hp-11A-G6-EE-grunt | x86_64 | lab-collabora | gcc-10 | x86_64_defcon...6-chromebook | 1

Details: https://kernelci.org/test/plan/id/628bbc3b4ebb5b75d5a39be7

Results: 0 PASS, 1 FAIL, 0 SKIP
Full config: x86_64_defconfig+x86-chromebook
Compiler: gcc-10 (gcc (Debian 10.2.1-6) 10.2.1 20210110)
Plain log: https://storage.kernelci.org//cip-gitlab/ci-pavel-linux-test/v4.4-st5-1797-gb2b8419761095/x86_64/x86_64_defconfig+x86-chromebook/gcc-10/lab-collabora/baseline-nfs-hp-11A-G6-EE-grunt.txt
HTML log: https://storage.kernelci.org//cip-gitlab/ci-pavel-linux-test/v4.4-st5-1797-gb2b8419761095/x86_64/x86_64_defconfig+x86-chromebook/gcc-10/lab-collabora/baseline-nfs-hp-11A-G6-EE-grunt.html
Rootfs: http://storage.kernelci.org/images/rootfs/debian/bullseye/20220513.0/amd64/initrd.cpio.gz


* baseline-nfs.login: https://kernelci.org/test/case/id/628bbc3b4ebb5b75d5a39be8
failing since 12 days (last pass: v5.10.109-cip5-384-g722204542e8a, first fail: v4.4-st5-23-gf7cf04ab668f1)



platform | arch | lab | compiler | defconfig | regressions
--------------------------+--------+---------------+----------+------------------------------+------------
hp-x360-12b-n4000-octopus | x86_64 | lab-collabora | gcc-10 | x86_64_defcon...6-chromebook | 1

Details: https://kernelci.org/test/plan/id/628bc5fc94a300d272a39c3a

Results: 0 PASS, 1 FAIL, 0 SKIP
Full config: x86_64_defconfig+x86-chromebook
Compiler: gcc-10 (gcc (Debian 10.2.1-6) 10.2.1 20210110)
Plain log: https://storage.kernelci.org//cip-gitlab/ci-pavel-linux-test/v4.4-st5-1797-gb2b8419761095/x86_64/x86_64_defconfig+x86-chromebook/gcc-10/lab-collabora/baseline-nfs-hp-x360-12b-n4000-octopus.txt
HTML log: https://storage.kernelci.org//cip-gitlab/ci-pavel-linux-test/v4.4-st5-1797-gb2b8419761095/x86_64/x86_64_defconfig+x86-chromebook/gcc-10/lab-collabora/baseline-nfs-hp-x360-12b-n4000-octopus.html
Rootfs: http://storage.kernelci.org/images/rootfs/debian/bullseye/20220513.0/amd64/initrd.cpio.gz


* baseline-nfs.login: https://kernelci.org/test/case/id/628bc5fc94a300d272a39c3b
failing since 12 days (last pass: v5.10.109-cip5-384-g722204542e8a, first fail: v4.4-st5-23-gf7cf04ab668f1)



platform | arch | lab | compiler | defconfig | regressions
--------------------------+--------+---------------+----------+------------------------------+------------
hp-x360-14-G1-sona | x86_64 | lab-collabora | gcc-10 | x86_64_defcon...6-chromebook | 1

Details: https://kernelci.org/test/plan/id/628bbdd3ffeaa1a8e8a39bde

Results: 0 PASS, 1 FAIL, 0 SKIP
Full config: x86_64_defconfig+x86-chromebook
Compiler: gcc-10 (gcc (Debian 10.2.1-6) 10.2.1 20210110)
Plain log: https://storage.kernelci.org//cip-gitlab/ci-pavel-linux-test/v4.4-st5-1797-gb2b8419761095/x86_64/x86_64_defconfig+x86-chromebook/gcc-10/lab-collabora/baseline-nfs-hp-x360-14-G1-sona.txt
HTML log: https://storage.kernelci.org//cip-gitlab/ci-pavel-linux-test/v4.4-st5-1797-gb2b8419761095/x86_64/x86_64_defconfig+x86-chromebook/gcc-10/lab-collabora/baseline-nfs-hp-x360-14-G1-sona.html
Rootfs: http://storage.kernelci.org/images/rootfs/debian/bullseye/20220513.0/amd64/initrd.cpio.gz


* baseline-nfs.login: https://kernelci.org/test/case/id/628bbdd3ffeaa1a8e8a39bdf
failing since 12 days (last pass: v5.10.109-cip5-384-g722204542e8a, first fail: v4.4-st5-23-gf7cf04ab668f1)



platform | arch | lab | compiler | defconfig | regressions
--------------------------+--------+---------------+----------+------------------------------+------------
juno-uboot | arm64 | lab-broonie | gcc-10 | defconfig | 1

Details: https://kernelci.org/test/plan/id/628bbec336f96dbd7ba39c04

Results: 0 PASS, 1 FAIL, 0 SKIP
Full config: defconfig
Compiler: gcc-10 (aarch64-linux-gnu-gcc (Debian 10.2.1-6) 10.2.1 20210110)
Plain log: https://storage.kernelci.org//cip-gitlab/ci-pavel-linux-test/v4.4-st5-1797-gb2b8419761095/arm64/defconfig/gcc-10/lab-broonie/baseline-nfs-juno-uboot.txt
HTML log: https://storage.kernelci.org//cip-gitlab/ci-pavel-linux-test/v4.4-st5-1797-gb2b8419761095/arm64/defconfig/gcc-10/lab-broonie/baseline-nfs-juno-uboot.html
Rootfs: http://storage.kernelci.org/images/rootfs/debian/bullseye/20220513.0/arm64/initrd.cpio.gz


* baseline-nfs.login: https://kernelci.org/test/case/id/628bbec336f96dbd7ba39c05
failing since 12 days (last pass: v5.10.109-cip5-384-g722204542e8a, first fail: v4.4-st5-261-g4f0b5ddda6cf)


cip-gitlab/ci/pavel/linux-test baseline-cip-nfs: 5 runs, 5 regressions (v4.4-st5-1797-gb2b8419761095) #kernelci

kernelci.org bot <bot@...>
 

cip-gitlab/ci/pavel/linux-test baseline-cip-nfs: 5 runs, 5 regressions (v4.4-st5-1797-gb2b8419761095)

Regressions Summary
-------------------

platform | arch | lab | compiler | defconfig | regressions
-------------------+--------+---------------+----------+------------------------------+------------
beaglebone-black | arm | lab-broonie | gcc-10 | multi_v7_defconfig | 1
beaglebone-black | arm | lab-cip | gcc-10 | multi_v7_defconfig | 1
beaglebone-black | arm | lab-broonie | gcc-10 | omap2plus_defconfig | 1
beaglebone-black | arm | lab-cip | gcc-10 | omap2plus_defconfig | 1
hp-11A-G6-EE-grunt | x86_64 | lab-collabora | gcc-10 | x86_64_defcon...6-chromebook | 1

Details: https://kernelci.org/test/job/cip-gitlab/branch/ci%2Fpavel%2Flinux-test/kernel/v4.4-st5-1797-gb2b8419761095/plan/baseline-cip-nfs/

Test: baseline-cip-nfs
Tree: cip-gitlab
Branch: ci/pavel/linux-test
Describe: v4.4-st5-1797-gb2b8419761095
URL: https://gitlab.com/cip-project/cip-kernel/linux-cip.git
SHA: b2b8419761095643d782c4cb4a982131b3efb6b8


Test Regressions
----------------


platform | arch | lab | compiler | defconfig | regressions
-------------------+--------+---------------+----------+------------------------------+------------
beaglebone-black | arm | lab-broonie | gcc-10 | multi_v7_defconfig | 1

Details: https://kernelci.org/test/plan/id/628bba26b13ceb0ff1a39bef

Results: 0 PASS, 1 FAIL, 0 SKIP
Full config: multi_v7_defconfig
Compiler: gcc-10 (arm-linux-gnueabihf-gcc (Debian 10.2.1-6) 10.2.1 20210110)
Plain log: https://storage.kernelci.org//cip-gitlab/ci-pavel-linux-test/v4.4-st5-1797-gb2b8419761095/arm/multi_v7_defconfig/gcc-10/lab-broonie/baseline-cip-nfs-beaglebone-black.txt
HTML log: https://storage.kernelci.org//cip-gitlab/ci-pavel-linux-test/v4.4-st5-1797-gb2b8419761095/arm/multi_v7_defconfig/gcc-10/lab-broonie/baseline-cip-nfs-beaglebone-black.html
Rootfs: https://storage.kernelci.org/images/rootfs/cip/20211105/qemu-arm/cip-core-image-kernelci-cip-core-buster-qemu-arm-initrd.img.gz


* baseline-cip-nfs.login: https://kernelci.org/test/case/id/628bba26b13ceb0ff1a39bf0
failing since 12 days (last pass: v5.10.109-cip5-384-g722204542e8a, first fail: v4.4-st5-260-gb0fe64f485ff)



platform | arch | lab | compiler | defconfig | regressions
-------------------+--------+---------------+----------+------------------------------+------------
beaglebone-black | arm | lab-cip | gcc-10 | multi_v7_defconfig | 1

Details: https://kernelci.org/test/plan/id/628bb6ef9fd4928edba39c08

Results: 3 PASS, 1 FAIL, 0 SKIP
Full config: multi_v7_defconfig
Compiler: gcc-10 (arm-linux-gnueabihf-gcc (Debian 10.2.1-6) 10.2.1 20210110)
Plain log: https://storage.kernelci.org//cip-gitlab/ci-pavel-linux-test/v4.4-st5-1797-gb2b8419761095/arm/multi_v7_defconfig/gcc-10/lab-cip/baseline-cip-nfs-beaglebone-black.txt
HTML log: https://storage.kernelci.org//cip-gitlab/ci-pavel-linux-test/v4.4-st5-1797-gb2b8419761095/arm/multi_v7_defconfig/gcc-10/lab-cip/baseline-cip-nfs-beaglebone-black.html
Rootfs: https://storage.kernelci.org/images/rootfs/cip/20211105/qemu-arm/cip-core-image-kernelci-cip-core-buster-qemu-arm-initrd.img.gz


* baseline-cip-nfs.dmesg.crit: https://kernelci.org/test/case/id/628bb6ef9fd4928edba39c0b
failing since 13 days (last pass: v5.10.109-cip5-384-g722204542e8a, first fail: v4.4-st5-260-gb0fe64f485ff)
1 lines

2022-05-23T16:31:10.211882 / #
2022-05-23T16:31:10.219333
2022-05-23T16:31:15.248851 / # export NFS_ROOTFS='/var/lib/lava/dispatcher/tmp/684347/extract-nfsrootfs-gekwtr0m'
2022-05-23T16:31:15.259775 export NFS_ROOTFS='/var/lib/lava/dispatcher/tmp/684347/extract-nfsrootfs-</lib/lava/dispatcher/tmp/684347/extract-nfsrootfs-g ekwtr0m'
2022-05-23T16:31:17.316277 / # export NFS_SERVER_IP='172.16.3.3'
2022-05-23T16:31:17.327149 export NFS_SERVER_IP='172.16.3.3'
2022-05-23T16:31:17.442246 / # #
2022-05-23T16:31:17.449069 #
2022-05-23T16:31:17.564017 / # export SHELL=/bin/sh
2022-05-23T16:31:17.571526 export SHELL=/bin/sh
... (13 line(s) more)



platform | arch | lab | compiler | defconfig | regressions
-------------------+--------+---------------+----------+------------------------------+------------
beaglebone-black | arm | lab-broonie | gcc-10 | omap2plus_defconfig | 1

Details: https://kernelci.org/test/plan/id/628bbc1a9c0d3d4daaa39bd7

Results: 3 PASS, 1 FAIL, 0 SKIP
Full config: omap2plus_defconfig
Compiler: gcc-10 (arm-linux-gnueabihf-gcc (Debian 10.2.1-6) 10.2.1 20210110)
Plain log: https://storage.kernelci.org//cip-gitlab/ci-pavel-linux-test/v4.4-st5-1797-gb2b8419761095/arm/omap2plus_defconfig/gcc-10/lab-broonie/baseline-cip-nfs-beaglebone-black.txt
HTML log: https://storage.kernelci.org//cip-gitlab/ci-pavel-linux-test/v4.4-st5-1797-gb2b8419761095/arm/omap2plus_defconfig/gcc-10/lab-broonie/baseline-cip-nfs-beaglebone-black.html
Rootfs: https://storage.kernelci.org/images/rootfs/cip/20211105/qemu-arm/cip-core-image-kernelci-cip-core-buster-qemu-arm-initrd.img.gz


* baseline-cip-nfs.dmesg.crit: https://kernelci.org/test/case/id/628bbc1a9c0d3d4daaa39bdc
failing since 13 days (last pass: v5.10.109-cip5-384-g722204542e8a, first fail: v4.4-st5-260-gb0fe64f485ff)
1 lines

2022-05-23T16:53:16.014155 / #
2022-05-23T16:53:16.022900
2022-05-23T16:53:21.109307 / # export NFS_ROOTFS='/var/lib/lava/dispatcher/tmp/164530/extract-nfsrootfs-qjdwy51x'
2022-05-23T16:53:21.120371 export NFS_ROOTFS='/var/lib/lava/dispatcher/tmp/164530/extract-nfsrootfs-</lib/lava/dispatcher/tmp/164530/extract-nfsrootfs-q jdwy51x'
2022-05-23T16:53:23.483314 / # export NFS_SERVER_IP='192.168.56.230'
2022-05-23T16:53:23.494325 export NFS_SERVER_IP='192.168.56.230'
2022-05-23T16:53:23.642843 / # #
2022-05-23T16:53:23.647627 #
2022-05-23T16:53:23.792773 / # export SHELL=/bin/sh
2022-05-23T16:53:23.797619 export SHELL=/bin/sh
... (13 line(s) more)



platform | arch | lab | compiler | defconfig | regressions
-------------------+--------+---------------+----------+------------------------------+------------
beaglebone-black | arm | lab-cip | gcc-10 | omap2plus_defconfig | 1

Details: https://kernelci.org/test/plan/id/628bb7dfbb4f3066c7a39bcd

Results: 3 PASS, 1 FAIL, 0 SKIP
Full config: omap2plus_defconfig
Compiler: gcc-10 (arm-linux-gnueabihf-gcc (Debian 10.2.1-6) 10.2.1 20210110)
Plain log: https://storage.kernelci.org//cip-gitlab/ci-pavel-linux-test/v4.4-st5-1797-gb2b8419761095/arm/omap2plus_defconfig/gcc-10/lab-cip/baseline-cip-nfs-beaglebone-black.txt
HTML log: https://storage.kernelci.org//cip-gitlab/ci-pavel-linux-test/v4.4-st5-1797-gb2b8419761095/arm/omap2plus_defconfig/gcc-10/lab-cip/baseline-cip-nfs-beaglebone-black.html
Rootfs: https://storage.kernelci.org/images/rootfs/cip/20211105/qemu-arm/cip-core-image-kernelci-cip-core-buster-qemu-arm-initrd.img.gz


* baseline-cip-nfs.dmesg.crit: https://kernelci.org/test/case/id/628bb7dfbb4f3066c7a39bd0
failing since 13 days (last pass: v5.10.109-cip5-384-g722204542e8a, first fail: v4.4-st5-260-gb0fe64f485ff)
1 lines

2022-05-23T16:35:22.827021 / #
2022-05-23T16:35:22.836071
2022-05-23T16:35:27.850248 / # export NFS_ROOTFS='/var/lib/lava/dispatcher/tmp/684352/extract-nfsrootfs-9l78wzcz'
2022-05-23T16:35:27.861259 export NFS_ROOTFS='/var/lib/lava/dispatcher/tmp/684352/extract-nfsrootfs-</lib/lava/dispatcher/tmp/684352/extract-nfsrootfs-9 l78wzcz'
2022-05-23T16:35:29.930374 / # export NFS_SERVER_IP='172.16.3.3'
2022-05-23T16:35:29.940926 export NFS_SERVER_IP='172.16.3.3'
2022-05-23T16:35:30.066979 / # #
2022-05-23T16:35:30.073832 #
2022-05-23T16:35:30.201863 / # export SHELL=/bin/sh
2022-05-23T16:35:30.209070 export SHELL=/bin/sh
... (13 line(s) more)



platform | arch | lab | compiler | defconfig | regressions
-------------------+--------+---------------+----------+------------------------------+------------
hp-11A-G6-EE-grunt | x86_64 | lab-collabora | gcc-10 | x86_64_defcon...6-chromebook | 1

Details: https://kernelci.org/test/plan/id/628bc31ac3a82d6c0aa39c55

Results: 0 PASS, 1 FAIL, 0 SKIP
Full config: x86_64_defconfig+x86-chromebook
Compiler: gcc-10 (gcc (Debian 10.2.1-6) 10.2.1 20210110)
Plain log: https://storage.kernelci.org//cip-gitlab/ci-pavel-linux-test/v4.4-st5-1797-gb2b8419761095/x86_64/x86_64_defconfig+x86-chromebook/gcc-10/lab-collabora/baseline-cip-nfs-hp-11A-G6-EE-grunt.txt
HTML log: https://storage.kernelci.org//cip-gitlab/ci-pavel-linux-test/v4.4-st5-1797-gb2b8419761095/x86_64/x86_64_defconfig+x86-chromebook/gcc-10/lab-collabora/baseline-cip-nfs-hp-11A-G6-EE-grunt.html
Rootfs: https://storage.kernelci.org/images/rootfs/cip/20211105/qemu-amd64/cip-core-image-kernelci-cip-core-buster-qemu-amd64-initrd.img.gz


* baseline-cip-nfs.login: https://kernelci.org/test/case/id/628bc31ac3a82d6c0aa39c56
failing since 12 days (last pass: v5.10.109-cip5-384-g722204542e8a, first fail: v4.4-st5-23-gf7cf04ab668f1)


cip-gitlab/ci/pavel/linux-test build: 176 builds: 5 failed, 171 passed, 6 errors, 35 warnings (v4.4-st5-1797-gb2b8419761095) #kernelci

kernelci.org bot <bot@...>
 

cip-gitlab/ci/pavel/linux-test build: 176 builds: 5 failed, 171 passed, 6 errors, 35 warnings (v4.4-st5-1797-gb2b8419761095)

Full Build Summary: https://kernelci.org/build/cip-gitlab/branch/ci%2Fpavel%2Flinux-test/kernel/v4.4-st5-1797-gb2b8419761095/

Tree: cip-gitlab
Branch: ci/pavel/linux-test
Git Describe: v4.4-st5-1797-gb2b8419761095
Git Commit: b2b8419761095643d782c4cb4a982131b3efb6b8
Git URL: https://gitlab.com/cip-project/cip-kernel/linux-cip.git
Built: 6 unique architectures

Build Failures Detected:

arm:
rpc_defconfig: (gcc-10) FAIL

mips:
fuloong2e_defconfig: (gcc-10) FAIL
ip27_defconfig: (gcc-10) FAIL
ip28_defconfig: (gcc-10) FAIL
lemote2f_defconfig: (gcc-10) FAIL

Errors and Warnings Detected:

arc:

arm64:
defconfig (gcc-10): 1 warning
defconfig+arm64-chromebook (gcc-10): 1 warning

arm:
clps711x_defconfig (gcc-10): 1 warning
davinci_all_defconfig (gcc-10): 1 warning
lpc32xx_defconfig (gcc-10): 1 warning
mini2440_defconfig (gcc-10): 1 warning
mxs_defconfig (gcc-10): 1 warning
omap1_defconfig (gcc-10): 1 warning
omap2plus_defconfig (gcc-10): 1 warning
rpc_defconfig (gcc-10): 2 errors
s3c2410_defconfig (gcc-10): 1 warning

i386:
i386_defconfig (gcc-10): 2 warnings

mips:
fuloong2e_defconfig (gcc-10): 2 errors
ip22_defconfig (gcc-10): 1 warning
lemote2f_defconfig (gcc-10): 2 errors
mtx1_defconfig (gcc-10): 3 warnings

x86_64:
allnoconfig (gcc-10): 4 warnings
tinyconfig (gcc-10): 3 warnings
x86_64_defconfig (gcc-10): 6 warnings
x86_64_defconfig+x86-chromebook (gcc-10): 6 warnings

Errors summary:

4 cc1: error: ‘-mloongson-mmi’ must be used with ‘-mhard-float’
1 arm-linux-gnueabihf-gcc: error: unrecognized -march target: armv3
1 arm-linux-gnueabihf-gcc: error: missing argument to ‘-march=’

Warnings summary:

7 arch/x86/kernel/process.c:456: Warning: no instruction mnemonic suffix given and no register operands; using default for `btr'
4 arch/x86/entry/entry_64.S:487: Warning: no instruction mnemonic suffix given and no register operands; using default for `btr'
4 arch/x86/entry/entry_64.S:1660: Warning: no instruction mnemonic suffix given and no register operands; using default for `sysret'
3 ld: warning: creating DT_TEXTREL in a PIE
2 sound/pci/echoaudio/echoaudio_dsp.c:647:9: warning: iteration 1073741824 invokes undefined behavior [-Waggressive-loop-optimizations]
2 ld: arch/x86/boot/compressed/head_64.o: warning: relocation in read-only section `.head.text'
2 drivers/tty/serial/samsung.c:1780:34: warning: array ‘s3c24xx_uart_dt_match’ assumed to have one element
2 drivers/net/ethernet/apm/xgene/xgene_enet_main.c:32:36: warning: array ‘xgene_enet_acpi_match’ assumed to have one element
1 sound/pci/echoaudio/echoaudio_dsp.c:658:9: warning: iteration 1073741824 invokes undefined behavior [-Waggressive-loop-optimizations]
1 ld: arch/x86/boot/compressed/head_32.o: warning: relocation in read-only section `.head.text'
1 drivers/net/ethernet/seeq/sgiseeq.c:804:26: warning: passing argument 5 of ‘dma_free_attrs’ makes pointer from integer without a cast [-Wint-conversion]
1 drivers/gpio/gpio-omap.c:1161:34: warning: array ‘omap_gpio_match’ assumed to have one element
1 drivers/cpufreq/ti-cpufreq.c:250:24: warning: passing argument 1 of ‘PTR_ERR_OR_ZERO’ makes pointer from integer without a cast [-Wint-conversion]
1 arch/arm/mach-mxs/mach-mxs.c:285:26: warning: duplicate ‘const’ declaration specifier [-Wduplicate-decl-specifier]
1 arch/arm/mach-lpc32xx/phy3250.c:215:36: warning: duplicate ‘const’ declaration specifier [-Wduplicate-decl-specifier]
1 arch/arm/mach-davinci/da8xx-dt.c:23:34: warning: duplicate ‘const’ declaration specifier [-Wduplicate-decl-specifier]
1 arch/arm/mach-clps711x/board-autcpu12.c:163:26: warning: duplicate ‘const’ declaration specifier [-Wduplicate-decl-specifier]

================================================================================

Detailed per-defconfig build reports:

--------------------------------------------------------------------------------
acs5k_defconfig (arm, gcc-10) — PASS, 0 errors, 0 warnings, 0 section mismatches

--------------------------------------------------------------------------------
acs5k_tiny_defconfig (arm, gcc-10) — PASS, 0 errors, 0 warnings, 0 section mismatches

--------------------------------------------------------------------------------
allnoconfig (x86_64, gcc-10) — PASS, 0 errors, 4 warnings, 0 section mismatches

Warnings:
arch/x86/entry/entry_64.S:487: Warning: no instruction mnemonic suffix given and no register operands; using default for `btr'
arch/x86/entry/entry_64.S:1660: Warning: no instruction mnemonic suffix given and no register operands; using default for `sysret'
arch/x86/kernel/process.c:456: Warning: no instruction mnemonic suffix given and no register operands; using default for `btr'
arch/x86/kernel/process.c:456: Warning: no instruction mnemonic suffix given and no register operands; using default for `btr'

--------------------------------------------------------------------------------
allnoconfig (i386, gcc-10) — PASS, 0 errors, 0 warnings, 0 section mismatches

--------------------------------------------------------------------------------
allnoconfig (arm, gcc-10) — PASS, 0 errors, 0 warnings, 0 section mismatches

--------------------------------------------------------------------------------
allnoconfig (mips, gcc-10) — PASS, 0 errors, 0 warnings, 0 section mismatches

--------------------------------------------------------------------------------
allnoconfig (arc, gcc-10) — PASS, 0 errors, 0 warnings, 0 section mismatches

--------------------------------------------------------------------------------
am200epdkit_defconfig (arm, gcc-10) — PASS, 0 errors, 0 warnings, 0 section mismatches

--------------------------------------------------------------------------------
ar7_defconfig (mips, gcc-10) — PASS, 0 errors, 0 warnings, 0 section mismatches

--------------------------------------------------------------------------------
assabet_defconfig (arm, gcc-10) — PASS, 0 errors, 0 warnings, 0 section mismatches

--------------------------------------------------------------------------------
at91_dt_defconfig (arm, gcc-10) — PASS, 0 errors, 0 warnings, 0 section mismatches

--------------------------------------------------------------------------------
ath79_defconfig (mips, gcc-10) — PASS, 0 errors, 0 warnings, 0 section mismatches

--------------------------------------------------------------------------------
axm55xx_defconfig (arm, gcc-10) — PASS, 0 errors, 0 warnings, 0 section mismatches

--------------------------------------------------------------------------------
axs103_defconfig (arc, gcc-10) — PASS, 0 errors, 0 warnings, 0 section mismatches

--------------------------------------------------------------------------------
axs103_smp_defconfig (arc, gcc-10) — PASS, 0 errors, 0 warnings, 0 section mismatches

--------------------------------------------------------------------------------
bcm2835_defconfig (arm, gcc-10) — PASS, 0 errors, 0 warnings, 0 section mismatches

--------------------------------------------------------------------------------
bcm47xx_defconfig (mips, gcc-10) — PASS, 0 errors, 0 warnings, 0 section mismatches

--------------------------------------------------------------------------------
bcm63xx_defconfig (mips, gcc-10) — PASS, 0 errors, 0 warnings, 0 section mismatches

--------------------------------------------------------------------------------
bcm_defconfig (arm, gcc-10) — PASS, 0 errors, 0 warnings, 0 section mismatches

--------------------------------------------------------------------------------
bmips_be_defconfig (mips, gcc-10) — PASS, 0 errors, 0 warnings, 0 section mismatches

--------------------------------------------------------------------------------
bmips_stb_defconfig (mips, gcc-10) — PASS, 0 errors, 0 warnings, 0 section mismatches

--------------------------------------------------------------------------------
capcella_defconfig (mips, gcc-10) — PASS, 0 errors, 0 warnings, 0 section mismatches

--------------------------------------------------------------------------------
cavium_octeon_defconfig (mips, gcc-10) — PASS, 0 errors, 0 warnings, 0 section mismatches

--------------------------------------------------------------------------------
cerfcube_defconfig (arm, gcc-10) — PASS, 0 errors, 0 warnings, 0 section mismatches

--------------------------------------------------------------------------------
ci20_defconfig (mips, gcc-10) — PASS, 0 errors, 0 warnings, 0 section mismatches

--------------------------------------------------------------------------------
clps711x_defconfig (arm, gcc-10) — PASS, 0 errors, 1 warning, 0 section mismatches

Warnings:
arch/arm/mach-clps711x/board-autcpu12.c:163:26: warning: duplicate ‘const’ declaration specifier [-Wduplicate-decl-specifier]

--------------------------------------------------------------------------------
cm_x2xx_defconfig (arm, gcc-10) — PASS, 0 errors, 0 warnings, 0 section mismatches

--------------------------------------------------------------------------------
cm_x300_defconfig (arm, gcc-10) — PASS, 0 errors, 0 warnings, 0 section mismatches

--------------------------------------------------------------------------------
colibri_pxa270_defconfig (arm, gcc-10) — PASS, 0 errors, 0 warnings, 0 section mismatches

--------------------------------------------------------------------------------
colibri_pxa300_defconfig (arm, gcc-10) — PASS, 0 errors, 0 warnings, 0 section mismatches

--------------------------------------------------------------------------------
collie_defconfig (arm, gcc-10) — PASS, 0 errors, 0 warnings, 0 section mismatches

--------------------------------------------------------------------------------
corgi_defconfig (arm, gcc-10) — PASS, 0 errors, 0 warnings, 0 section mismatches

--------------------------------------------------------------------------------
davinci_all_defconfig (arm, gcc-10) — PASS, 0 errors, 1 warning, 0 section mismatches

Warnings:
arch/arm/mach-davinci/da8xx-dt.c:23:34: warning: duplicate ‘const’ declaration specifier [-Wduplicate-decl-specifier]

--------------------------------------------------------------------------------
decstation_defconfig (mips, gcc-10) — PASS, 0 errors, 0 warnings, 0 section mismatches

--------------------------------------------------------------------------------
defconfig (arm64, gcc-10) — PASS, 0 errors, 1 warning, 0 section mismatches

Warnings:
drivers/net/ethernet/apm/xgene/xgene_enet_main.c:32:36: warning: array ‘xgene_enet_acpi_match’ assumed to have one element

--------------------------------------------------------------------------------
defconfig+arm64-chromebook (arm64, gcc-10) — PASS, 0 errors, 1 warning, 0 section mismatches

Warnings:
drivers/net/ethernet/apm/xgene/xgene_enet_main.c:32:36: warning: array ‘xgene_enet_acpi_match’ assumed to have one element

--------------------------------------------------------------------------------
dove_defconfig (arm, gcc-10) — PASS, 0 errors, 0 warnings, 0 section mismatches

--------------------------------------------------------------------------------
e55_defconfig (mips, gcc-10) — PASS, 0 errors, 0 warnings, 0 section mismatches

--------------------------------------------------------------------------------
ebsa110_defconfig (arm, gcc-10) — PASS, 0 errors, 0 warnings, 0 section mismatches

--------------------------------------------------------------------------------
efm32_defconfig (arm, gcc-10) — PASS, 0 errors, 0 warnings, 0 section mismatches

--------------------------------------------------------------------------------
em_x270_defconfig (arm, gcc-10) — PASS, 0 errors, 0 warnings, 0 section mismatches

--------------------------------------------------------------------------------
ep93xx_defconfig (arm, gcc-10) — PASS, 0 errors, 0 warnings, 0 section mismatches

--------------------------------------------------------------------------------
eseries_pxa_defconfig (arm, gcc-10) — PASS, 0 errors, 0 warnings, 0 section mismatches

--------------------------------------------------------------------------------
exynos_defconfig (arm, gcc-10) — PASS, 0 errors, 0 warnings, 0 section mismatches

--------------------------------------------------------------------------------
ezx_defconfig (arm, gcc-10) — PASS, 0 errors, 0 warnings, 0 section mismatches

--------------------------------------------------------------------------------
footbridge_defconfig (arm, gcc-10) — PASS, 0 errors, 0 warnings, 0 section mismatches

--------------------------------------------------------------------------------
fuloong2e_defconfig (mips, gcc-10) — FAIL, 2 errors, 0 warnings, 0 section mismatches

Errors:
cc1: error: ‘-mloongson-mmi’ must be used with ‘-mhard-float’
cc1: error: ‘-mloongson-mmi’ must be used with ‘-mhard-float’

--------------------------------------------------------------------------------
gpr_defconfig (mips, gcc-10) — PASS, 0 errors, 0 warnings, 0 section mismatches

--------------------------------------------------------------------------------
h3600_defconfig (arm, gcc-10) — PASS, 0 errors, 0 warnings, 0 section mismatches

--------------------------------------------------------------------------------
h5000_defconfig (arm, gcc-10) — PASS, 0 errors, 0 warnings, 0 section mismatches

--------------------------------------------------------------------------------
hackkit_defconfig (arm, gcc-10) — PASS, 0 errors, 0 warnings, 0 section mismatches

--------------------------------------------------------------------------------
hisi_defconfig (arm, gcc-10) — PASS, 0 errors, 0 warnings, 0 section mismatches

--------------------------------------------------------------------------------
i386_defconfig (i386, gcc-10) — PASS, 0 errors, 2 warnings, 0 section mismatches

Warnings:
ld: arch/x86/boot/compressed/head_32.o: warning: relocation in read-only section `.head.text'
ld: warning: creating DT_TEXTREL in a PIE

--------------------------------------------------------------------------------
imote2_defconfig (arm, gcc-10) — PASS, 0 errors, 0 warnings, 0 section mismatches

--------------------------------------------------------------------------------
imx_v4_v5_defconfig (arm, gcc-10) — PASS, 0 errors, 0 warnings, 0 section mismatches

--------------------------------------------------------------------------------
imx_v6_v7_defconfig (arm, gcc-10) — PASS, 0 errors, 0 warnings, 0 section mismatches

--------------------------------------------------------------------------------
integrator_defconfig (arm, gcc-10) — PASS, 0 errors, 0 warnings, 0 section mismatches

--------------------------------------------------------------------------------
iop13xx_defconfig (arm, gcc-10) — PASS, 0 errors, 0 warnings, 0 section mismatches

--------------------------------------------------------------------------------
iop32x_defconfig (arm, gcc-10) — PASS, 0 errors, 0 warnings, 0 section mismatches

--------------------------------------------------------------------------------
iop33x_defconfig (arm, gcc-10) — PASS, 0 errors, 0 warnings, 0 section mismatches

--------------------------------------------------------------------------------
ip22_defconfig (mips, gcc-10) — PASS, 0 errors, 1 warning, 0 section mismatches

Warnings:
drivers/net/ethernet/seeq/sgiseeq.c:804:26: warning: passing argument 5 of ‘dma_free_attrs’ makes pointer from integer without a cast [-Wint-conversion]

--------------------------------------------------------------------------------
ip27_defconfig (mips, gcc-10) — FAIL, 0 errors, 0 warnings, 0 section mismatches

--------------------------------------------------------------------------------
ip28_defconfig (mips, gcc-10) — FAIL, 0 errors, 0 warnings, 0 section mismatches

--------------------------------------------------------------------------------
ip32_defconfig (mips, gcc-10) — PASS, 0 errors, 0 warnings, 0 section mismatches

--------------------------------------------------------------------------------
ixp4xx_defconfig (arm, gcc-10) — PASS, 0 errors, 0 warnings, 0 section mismatches

--------------------------------------------------------------------------------
jazz_defconfig (mips, gcc-10) — PASS, 0 errors, 0 warnings, 0 section mismatches

--------------------------------------------------------------------------------
jmr3927_defconfig (mips, gcc-10) — PASS, 0 errors, 0 warnings, 0 section mismatches

--------------------------------------------------------------------------------
jornada720_defconfig (arm, gcc-10) — PASS, 0 errors, 0 warnings, 0 section mismatches

--------------------------------------------------------------------------------
keystone_defconfig (arm, gcc-10) — PASS, 0 errors, 0 warnings, 0 section mismatches

--------------------------------------------------------------------------------
ks8695_defconfig (arm, gcc-10) — PASS, 0 errors, 0 warnings, 0 section mismatches

--------------------------------------------------------------------------------
lart_defconfig (arm, gcc-10) — PASS, 0 errors, 0 warnings, 0 section mismatches

--------------------------------------------------------------------------------
lasat_defconfig (mips, gcc-10) — PASS, 0 errors, 0 warnings, 0 section mismatches

--------------------------------------------------------------------------------
lemote2f_defconfig (mips, gcc-10) — FAIL, 2 errors, 0 warnings, 0 section mismatches

Errors:
cc1: error: ‘-mloongson-mmi’ must be used with ‘-mhard-float’
cc1: error: ‘-mloongson-mmi’ must be used with ‘-mhard-float’

--------------------------------------------------------------------------------
loongson3_defconfig (mips, gcc-10) — PASS, 0 errors, 0 warnings, 0 section mismatches

--------------------------------------------------------------------------------
lpc18xx_defconfig (arm, gcc-10) — PASS, 0 errors, 0 warnings, 0 section mismatches

--------------------------------------------------------------------------------
lpc32xx_defconfig (arm, gcc-10) — PASS, 0 errors, 1 warning, 0 section mismatches

Warnings:
arch/arm/mach-lpc32xx/phy3250.c:215:36: warning: duplicate ‘const’ declaration specifier [-Wduplicate-decl-specifier]

--------------------------------------------------------------------------------
ls1b_defconfig (mips, gcc-10) — PASS, 0 errors, 0 warnings, 0 section mismatches

--------------------------------------------------------------------------------
lubbock_defconfig (arm, gcc-10) — PASS, 0 errors, 0 warnings, 0 section mismatches

--------------------------------------------------------------------------------
magician_defconfig (arm, gcc-10) — PASS, 0 errors, 0 warnings, 0 section mismatches

--------------------------------------------------------------------------------
mainstone_defconfig (arm, gcc-10) — PASS, 0 errors, 0 warnings, 0 section mismatches

--------------------------------------------------------------------------------
malta_defconfig (mips, gcc-10) — PASS, 0 errors, 0 warnings, 0 section mismatches

--------------------------------------------------------------------------------
malta_kvm_guest_defconfig (mips, gcc-10) — PASS, 0 errors, 0 warnings, 0 section mismatches

--------------------------------------------------------------------------------
malta_qemu_32r6_defconfig (mips, gcc-10) — PASS, 0 errors, 0 warnings, 0 section mismatches

--------------------------------------------------------------------------------
maltaaprp_defconfig (mips, gcc-10) — PASS, 0 errors, 0 warnings, 0 section mismatches

--------------------------------------------------------------------------------
maltasmvp_defconfig (mips, gcc-10) — PASS, 0 errors, 0 warnings, 0 section mismatches

--------------------------------------------------------------------------------
maltasmvp_eva_defconfig (mips, gcc-10) — PASS, 0 errors, 0 warnings, 0 section mismatches

--------------------------------------------------------------------------------
maltaup_defconfig (mips, gcc-10) — PASS, 0 errors, 0 warnings, 0 section mismatches

--------------------------------------------------------------------------------
maltaup_xpa_defconfig (mips, gcc-10) — PASS, 0 errors, 0 warnings, 0 section mismatches

--------------------------------------------------------------------------------
markeins_defconfig (mips, gcc-10) — PASS, 0 errors, 0 warnings, 0 section mismatches

--------------------------------------------------------------------------------
mini2440_defconfig (arm, gcc-10) — PASS, 0 errors, 1 warning, 0 section mismatches

Warnings:
drivers/tty/serial/samsung.c:1780:34: warning: array ‘s3c24xx_uart_dt_match’ assumed to have one element

--------------------------------------------------------------------------------
mips_paravirt_defconfig (mips, gcc-10) — PASS, 0 errors, 0 warnings, 0 section mismatches

--------------------------------------------------------------------------------
mmp2_defconfig (arm, gcc-10) — PASS, 0 errors, 0 warnings, 0 section mismatches

--------------------------------------------------------------------------------
mpc30x_defconfig (mips, gcc-10) — PASS, 0 errors, 0 warnings, 0 section mismatches

--------------------------------------------------------------------------------
msp71xx_defconfig (mips, gcc-10) — PASS, 0 errors, 0 warnings, 0 section mismatches

--------------------------------------------------------------------------------
mtx1_defconfig (mips, gcc-10) — PASS, 0 errors, 3 warnings, 0 section mismatches

Warnings:
sound/pci/echoaudio/echoaudio_dsp.c:647:9: warning: iteration 1073741824 invokes undefined behavior [-Waggressive-loop-optimizations]
sound/pci/echoaudio/echoaudio_dsp.c:658:9: warning: iteration 1073741824 invokes undefined behavior [-Waggressive-loop-optimizations]
sound/pci/echoaudio/echoaudio_dsp.c:647:9: warning: iteration 1073741824 invokes undefined behavior [-Waggressive-loop-optimizations]

--------------------------------------------------------------------------------
multi_v5_defconfig (arm, gcc-10) — PASS, 0 errors, 0 warnings, 0 section mismatches

--------------------------------------------------------------------------------
multi_v7_defconfig (arm, gcc-10) — PASS, 0 errors, 0 warnings, 0 section mismatches

--------------------------------------------------------------------------------
mv78xx0_defconfig (arm, gcc-10) — PASS, 0 errors, 0 warnings, 0 section mismatches

--------------------------------------------------------------------------------
mvebu_v5_defconfig (arm, gcc-10) — PASS, 0 errors, 0 warnings, 0 section mismatches

--------------------------------------------------------------------------------
mvebu_v7_defconfig (arm, gcc-10) — PASS, 0 errors, 0 warnings, 0 section mismatches

--------------------------------------------------------------------------------
mxs_defconfig (arm, gcc-10) — PASS, 0 errors, 1 warning, 0 section mismatches

Warnings:
arch/arm/mach-mxs/mach-mxs.c:285:26: warning: duplicate ‘const’ declaration specifier [-Wduplicate-decl-specifier]

--------------------------------------------------------------------------------
neponset_defconfig (arm, gcc-10) — PASS, 0 errors, 0 warnings, 0 section mismatches

--------------------------------------------------------------------------------
netwinder_defconfig (arm, gcc-10) — PASS, 0 errors, 0 warnings, 0 section mismatches

--------------------------------------------------------------------------------
netx_defconfig (arm, gcc-10) — PASS, 0 errors, 0 warnings, 0 section mismatches

--------------------------------------------------------------------------------
nhk8815_defconfig (arm, gcc-10) — PASS, 0 errors, 0 warnings, 0 section mismatches

--------------------------------------------------------------------------------
nlm_xlp_defconfig (mips, gcc-10) — PASS, 0 errors, 0 warnings, 0 section mismatches

--------------------------------------------------------------------------------
nlm_xlr_defconfig (mips, gcc-10) — PASS, 0 errors, 0 warnings, 0 section mismatches

--------------------------------------------------------------------------------
nsim_hs_defconfig (arc, gcc-10) — PASS, 0 errors, 0 warnings, 0 section mismatches

--------------------------------------------------------------------------------
nsim_hs_smp_defconfig (arc, gcc-10) — PASS, 0 errors, 0 warnings, 0 section mismatches

--------------------------------------------------------------------------------
nsimosci_hs_defconfig (arc, gcc-10) — PASS, 0 errors, 0 warnings, 0 section mismatches

--------------------------------------------------------------------------------
nsimosci_hs_smp_defconfig (arc, gcc-10) — PASS, 0 errors, 0 warnings, 0 section mismatches

--------------------------------------------------------------------------------
nuc910_defconfig (arm, gcc-10) — PASS, 0 errors, 0 warnings, 0 section mismatches

--------------------------------------------------------------------------------
nuc950_defconfig (arm, gcc-10) — PASS, 0 errors, 0 warnings, 0 section mismatches

--------------------------------------------------------------------------------
nuc960_defconfig (arm, gcc-10) — PASS, 0 errors, 0 warnings, 0 section mismatches

--------------------------------------------------------------------------------
omap1_defconfig (arm, gcc-10) — PASS, 0 errors, 1 warning, 0 section mismatches

Warnings:
drivers/gpio/gpio-omap.c:1161:34: warning: array ‘omap_gpio_match’ assumed to have one element

--------------------------------------------------------------------------------
omap2plus_defconfig (arm, gcc-10) — PASS, 0 errors, 1 warning, 0 section mismatches

Warnings:
drivers/cpufreq/ti-cpufreq.c:250:24: warning: passing argument 1 of ‘PTR_ERR_OR_ZERO’ makes pointer from integer without a cast [-Wint-conversion]

--------------------------------------------------------------------------------
palmz72_defconfig (arm, gcc-10) — PASS, 0 errors, 0 warnings, 0 section mismatches

--------------------------------------------------------------------------------
pcm027_defconfig (arm, gcc-10) — PASS, 0 errors, 0 warnings, 0 section mismatches

--------------------------------------------------------------------------------
pleb_defconfig (arm, gcc-10) — PASS, 0 errors, 0 warnings, 0 section mismatches

--------------------------------------------------------------------------------
pnx8335_stb225_defconfig (mips, gcc-10) — PASS, 0 errors, 0 warnings, 0 section mismatches

--------------------------------------------------------------------------------
prima2_defconfig (arm, gcc-10) — PASS, 0 errors, 0 warnings, 0 section mismatches

--------------------------------------------------------------------------------
pxa168_defconfig (arm, gcc-10) — PASS, 0 errors, 0 warnings, 0 section mismatches

--------------------------------------------------------------------------------
pxa255-idp_defconfig (arm, gcc-10) — PASS, 0 errors, 0 warnings, 0 section mismatches

--------------------------------------------------------------------------------
pxa3xx_defconfig (arm, gcc-10) — PASS, 0 errors, 0 warnings, 0 section mismatches

--------------------------------------------------------------------------------
pxa910_defconfig (arm, gcc-10) — PASS, 0 errors, 0 warnings, 0 section mismatches

--------------------------------------------------------------------------------
qcom_defconfig (arm, gcc-10) — PASS, 0 errors, 0 warnings, 0 section mismatches

--------------------------------------------------------------------------------
qi_lb60_defconfig (mips, gcc-10) — PASS, 0 errors, 0 warnings, 0 section mismatches

--------------------------------------------------------------------------------
raumfeld_defconfig (arm, gcc-10) — PASS, 0 errors, 0 warnings, 0 section mismatches

--------------------------------------------------------------------------------
rb532_defconfig (mips, gcc-10) — PASS, 0 errors, 0 warnings, 0 section mismatches

--------------------------------------------------------------------------------
rbtx49xx_defconfig (mips, gcc-10) — PASS, 0 errors, 0 warnings, 0 section mismatches

--------------------------------------------------------------------------------
realview_defconfig (arm, gcc-10) — PASS, 0 errors, 0 warnings, 0 section mismatches

--------------------------------------------------------------------------------
rm200_defconfig (mips, gcc-10) — PASS, 0 errors, 0 warnings, 0 section mismatches

--------------------------------------------------------------------------------
rpc_defconfig (arm, gcc-10) — FAIL, 2 errors, 0 warnings, 0 section mismatches

Errors:
arm-linux-gnueabihf-gcc: error: unrecognized -march target: armv3
arm-linux-gnueabihf-gcc: error: missing argument to ‘-march=’

--------------------------------------------------------------------------------
rt305x_defconfig (mips, gcc-10) — PASS, 0 errors, 0 warnings, 0 section mismatches

--------------------------------------------------------------------------------
s3c2410_defconfig (arm, gcc-10) — PASS, 0 errors, 1 warning, 0 section mismatches

Warnings:
drivers/tty/serial/samsung.c:1780:34: warning: array ‘s3c24xx_uart_dt_match’ assumed to have one element

--------------------------------------------------------------------------------
s5pv210_defconfig (arm, gcc-10) — PASS, 0 errors, 0 warnings, 0 section mismatches

--------------------------------------------------------------------------------
sama5_defconfig (arm, gcc-10) — PASS, 0 errors, 0 warnings, 0 section mismatches

--------------------------------------------------------------------------------
sb1250_swarm_defconfig (mips, gcc-10) — PASS, 0 errors, 0 warnings, 0 section mismatches

--------------------------------------------------------------------------------
sead3_defconfig (mips, gcc-10) — PASS, 0 errors, 0 warnings, 0 section mismatches

--------------------------------------------------------------------------------
sead3micro_defconfig (mips, gcc-10) — PASS, 0 errors, 0 warnings, 0 section mismatches

--------------------------------------------------------------------------------
shannon_defconfig (arm, gcc-10) — PASS, 0 errors, 0 warnings, 0 section mismatches

--------------------------------------------------------------------------------
shmobile_defconfig (arm, gcc-10) — PASS, 0 errors, 0 warnings, 0 section mismatches

--------------------------------------------------------------------------------
simpad_defconfig (arm, gcc-10) — PASS, 0 errors, 0 warnings, 0 section mismatches

--------------------------------------------------------------------------------
socfpga_defconfig (arm, gcc-10) — PASS, 0 errors, 0 warnings, 0 section mismatches

--------------------------------------------------------------------------------
spear13xx_defconfig (arm, gcc-10) — PASS, 0 errors, 0 warnings, 0 section mismatches

--------------------------------------------------------------------------------
spear3xx_defconfig (arm, gcc-10) — PASS, 0 errors, 0 warnings, 0 section mismatches

--------------------------------------------------------------------------------
spear6xx_defconfig (arm, gcc-10) — PASS, 0 errors, 0 warnings, 0 section mismatches

--------------------------------------------------------------------------------
spitz_defconfig (arm, gcc-10) — PASS, 0 errors, 0 warnings, 0 section mismatches

--------------------------------------------------------------------------------
stm32_defconfig (arm, gcc-10) — PASS, 0 errors, 0 warnings, 0 section mismatches

--------------------------------------------------------------------------------
sunxi_defconfig (arm, gcc-10) — PASS, 0 errors, 0 warnings, 0 section mismatches

--------------------------------------------------------------------------------
tb0219_defconfig (mips, gcc-10) — PASS, 0 errors, 0 warnings, 0 section mismatches

--------------------------------------------------------------------------------
tb0226_defconfig (mips, gcc-10) — PASS, 0 errors, 0 warnings, 0 section mismatches

--------------------------------------------------------------------------------
tb0287_defconfig (mips, gcc-10) — PASS, 0 errors, 0 warnings, 0 section mismatches

--------------------------------------------------------------------------------
tct_hammer_defconfig (arm, gcc-10) — PASS, 0 errors, 0 warnings, 0 section mismatches

--------------------------------------------------------------------------------
tegra_defconfig (arm, gcc-10) — PASS, 0 errors, 0 warnings, 0 section mismatches

--------------------------------------------------------------------------------
tinyconfig (mips, gcc-10) — PASS, 0 errors, 0 warnings, 0 section mismatches

--------------------------------------------------------------------------------
tinyconfig (x86_64, gcc-10) — PASS, 0 errors, 3 warnings, 0 section mismatches

Warnings:
arch/x86/entry/entry_64.S:487: Warning: no instruction mnemonic suffix given and no register operands; using default for `btr'
arch/x86/entry/entry_64.S:1660: Warning: no instruction mnemonic suffix given and no register operands; using default for `sysret'
arch/x86/kernel/process.c:456: Warning: no instruction mnemonic suffix given and no register operands; using default for `btr'

--------------------------------------------------------------------------------
tinyconfig (i386, gcc-10) — PASS, 0 errors, 0 warnings, 0 section mismatches

--------------------------------------------------------------------------------
tinyconfig (arc, gcc-10) — PASS, 0 errors, 0 warnings, 0 section mismatches

--------------------------------------------------------------------------------
tinyconfig (arm, gcc-10) — PASS, 0 errors, 0 warnings, 0 section mismatches

--------------------------------------------------------------------------------
trizeps4_defconfig (arm, gcc-10) — PASS, 0 errors, 0 warnings, 0 section mismatches

--------------------------------------------------------------------------------
u300_defconfig (arm, gcc-10) — PASS, 0 errors, 0 warnings, 0 section mismatches

--------------------------------------------------------------------------------
u8500_defconfig (arm, gcc-10) — PASS, 0 errors, 0 warnings, 0 section mismatches

--------------------------------------------------------------------------------
vdk_hs38_defconfig (arc, gcc-10) — PASS, 0 errors, 0 warnings, 0 section mismatches

--------------------------------------------------------------------------------
vdk_hs38_smp_defconfig (arc, gcc-10) — PASS, 0 errors, 0 warnings, 0 section mismatches

--------------------------------------------------------------------------------
versatile_defconfig (arm, gcc-10) — PASS, 0 errors, 0 warnings, 0 section mismatches

--------------------------------------------------------------------------------
vexpress_defconfig (arm, gcc-10) — PASS, 0 errors, 0 warnings, 0 section mismatches

--------------------------------------------------------------------------------
vf610m4_defconfig (arm, gcc-10) — PASS, 0 errors, 0 warnings, 0 section mismatches

--------------------------------------------------------------------------------
viper_defconfig (arm, gcc-10) — PASS, 0 errors, 0 warnings, 0 section mismatches

--------------------------------------------------------------------------------
vt8500_v6_v7_defconfig (arm, gcc-10) — PASS, 0 errors, 0 warnings, 0 section mismatches

--------------------------------------------------------------------------------
workpad_defconfig (mips, gcc-10) — PASS, 0 errors, 0 warnings, 0 section mismatches

--------------------------------------------------------------------------------
x86_64_defconfig (x86_64, gcc-10) — PASS, 0 errors, 6 warnings, 0 section mismatches

Warnings:
arch/x86/entry/entry_64.S:487: Warning: no instruction mnemonic suffix given and no register operands; using default for `btr'
arch/x86/entry/entry_64.S:1660: Warning: no instruction mnemonic suffix given and no register operands; using default for `sysret'
arch/x86/kernel/process.c:456: Warning: no instruction mnemonic suffix given and no register operands; using default for `btr'
arch/x86/kernel/process.c:456: Warning: no instruction mnemonic suffix given and no register operands; using default for `btr'
ld: arch/x86/boot/compressed/head_64.o: warning: relocation in read-only section `.head.text'
ld: warning: creating DT_TEXTREL in a PIE

--------------------------------------------------------------------------------
x86_64_defconfig+x86-chromebook (x86_64, gcc-10) — PASS, 0 errors, 6 warnings, 0 section mismatches

Warnings:
arch/x86/entry/entry_64.S:487: Warning: no instruction mnemonic suffix given and no register operands; using default for `btr'
arch/x86/entry/entry_64.S:1660: Warning: no instruction mnemonic suffix given and no register operands; using default for `sysret'
arch/x86/kernel/process.c:456: Warning: no instruction mnemonic suffix given and no register operands; using default for `btr'
arch/x86/kernel/process.c:456: Warning: no instruction mnemonic suffix given and no register operands; using default for `btr'
ld: arch/x86/boot/compressed/head_64.o: warning: relocation in read-only section `.head.text'
ld: warning: creating DT_TEXTREL in a PIE

--------------------------------------------------------------------------------
xcep_defconfig (arm, gcc-10) — PASS, 0 errors, 0 warnings, 0 section mismatches

--------------------------------------------------------------------------------
zeus_defconfig (arm, gcc-10) — PASS, 0 errors, 0 warnings, 0 section mismatches

--------------------------------------------------------------------------------
zx_defconfig (arm, gcc-10) — PASS, 0 errors, 0 warnings, 0 section mismatches

---
For more info write to <info@...>


[ANNOUNCE] v4.4.302-cip69-rt39 (-rt232)

Pavel Machek
 

Hi!

New realtime trees should be available at kernel.org.

Trees are available at

https://git.kernel.org/pub/scm/linux/kernel/git/cip/linux-cip.git/log/?h=linux-4.4.y-cip-rt
https://git.kernel.org/pub/scm/linux/kernel/git/cip/linux-cip.git/log/?h=linux-4.4.y-cip-rt-rebase

And their content should be identical.

This is first release after start of 4.4 self-maintainance. IOW "be
careful" :-).

Best regards,
Pavel

--
DENX Software Engineering GmbH, Managing Director: Wolfgang Denk
HRB 165235 Munich, Office: Kirchenstr.5, D-82194 Groebenzell, Germany


CIP talks at OSS Sumit / ELCE

Urs Gleim
 

Dear all,

please be aware that the deadline for CFP is May 30.

https://events.linuxfoundation.org/open-source-summit-europe/program/cfp/

Best regards,
Urs

--
Urs Gleim
Head of Smart Embedded Systems

Siemens AG, Technology, Otto-Hahn-Ring 6, 81739 Munich, Germany
mobile: +49 (173) 7068922, mailto:urs.gleim@...

Siemens Aktiengesellschaft: Chairman of the Supervisory Board: Jim Hagemann Snabe; Managing Board: Roland Busch, Chairman, President and Chief Executive Officer; Klaus Helmrich, Cedrik Neike, Matthias Rebellius, Ralf P. Thomas, Judith Wiese; Registered offices: Berlin and Munich, Germany; Commercial registries: Berlin-Charlottenburg, HRB 12300, Munich, HRB 6684; WEEE-Reg.-No. DE 23691322

 


Followup to "nfc: st21nfca: Fix potential buffer overflows in EVT_TRANSACTION" #cip

theflamefire89@...
 

Hi all,
I noticed that the mentioned patch (https://git.kernel.org/pub/scm/linux/kernel/git/cip/linux-cip.git/commit/?h=linux-4.4.y-st&id=b2df16de20b3f2ee6dbaf86b474e1bd87ddd8d51) made it into various CIP branches, e.g. linux-4.4.y-st.
It fixes potential OOB writes.
However it also introduces memory leaks due to the new return statements leaking the allocated `transaction`, i.e. it misses a `devm_kfree(dev, transaction);` in those cases.
Furthermore there is also a logic error and potential OOB read issues which are fixed in various Android kernel forks. See e.g. https://android-review.linaro.org/plugins/gitiles/kernel/hikey-linaro/+/bf7ef8f2d57cd1f5f1846dd58ff9309efad58252

I haven't found patches for that in the upstream kernels and I do not know the policy regarding such issues / not-yet-upstream patches.
Anyway, those issues exist and at least for some there are patches and adding the missing devm_kfree is trivial, so I wanted to make you aware of that.

Thanks,
Flamefire


CIP IRC weekly meeting today on libera.chat

Jan Kiszka
 

Hi all,

Kindly be reminded to attend the weekly meeting through IRC to discuss
technical topics with CIP kernel today. Our channel is the following:

irc:irc.libera.chat:6667/cip

The IRC meeting is scheduled to UTC (GMT) 12:00:

https://www.timeanddate.com/worldclock/meetingdetails.html?year=2022&month=5&day=19&hour=12&min=0&sec=0&p1=224&p2=179&p3=136&p4=37&p5=241&p6=248

USWest USEast UK DE TW JP
05:00 08:00 13:00 14:00 20:00 21:00

Last meeting minutes:
https://ircbot.wl.linuxfoundation.org/meetings/cip/2022/05/cip.2022-05-12-12.00.log.html

* Action items
1. Resolve/filter irrelevant failures of KernelCI for 4.4-cip - patersonc & alicefm
* Kernel maintenance updates
* Kernel testing
* AOB

Jan


Re: linux-4.4.y-cip-rebase: patches in wrong order?

Nobuhiro Iwamatsu
 

Hi,

This was unexpected for me, may be unexpected for our users, and would
make -cip-rt release different to previous ones. COuld we get order of
patches be

git log:
[CIP patches]
[-st patches]
[Greg's stable tree]
[Linus tree]
Indeed.
I will revert to the commit order above, and force-push.
I updated linux-4.4.y-cip-rebases branch and v4.4.302-cip69-rebase.

Best regards,
Nobuhiro



-----Original Message-----
From: iwamatsu nobuhiro(岩松 信洋 □SWC◯ACT)
Sent: Thursday, May 19, 2022 8:40 AM
To: cip-dev@...; iwamatsu@...
Subject: RE: [cip-dev] linux-4.4.y-cip-rebase: patches in wrong order?

Hi Pavel,

Sorry, reply was late.


In previous linux-4.4.y-cip-rebases, order of patches was:

git log:
[CIP patches]
[Greg's stable tree]
[Linus tree]

With start of self-maintainance, we now have:

git log:
[-st patches]
[CIP patches]
[Greg's stable tree]
[Linus tree]

This was unexpected for me, may be unexpected for our users, and would
make -cip-rt release different to previous ones. COuld we get order of
patches be

git log:
[CIP patches]
[-st patches]
[Greg's stable tree]
[Linus tree]
Indeed.
I will revert to the commit order above, and force-push.

Best regards,
Nobuhiro


New CVE entries this week

Masami Ichikawa
 

Hi !

It's this week's CVE report.

This week reported 9 new CVEs and 10 updated CVEs.

* New CVEs

CVE-2022-0171: KVM: cache incoherence issue in SEV API may lead to kernel crash

CVSS v3 score is not assigned.

Bug was found in KVM SEV API that non-root users crash the host kernel
by creating a confidential guest vm instance in AMD CPU that supports
AMD's SEV.

Introduced by commit f980f9c ("x86/sev-es: Compile early handler code
into kernel image") which was merged in 5.10-rc1.
Kernel versions less than 5.10 are not affected.

Fixed status

mainline: [683412ccf61294d727ead4a73d97397396e69a6b]

CVE-2022-1247: kernel: A race condition bug in rose_connect()

CVSS v3 score is not assigned.

A race condition bug was found in the rose driver(Amateur Radio X.25
PLP (Rose)).
No CIP member enables CONFIG_ROSE.

Fixed status

Not fixed yet.

CVE-2022-1679: Use-After-Free in ath9k_htc_probe_device() could cause
an escalation of privileges

CVSS v3 score is not assigned.

An UAF bug was found in ath9k_htc_probe_device() in the ath9k driver.
This vulnerability allows a local attacker to crash system or
potentially escalate their privileges on the system
Patch is available(https://lore.kernel.org/lkml/87ilqc7jv9.fsf@kernel.org/t/)
but not merged into the mainline yet.

This issue was introduced by commit fb9987d ("ath9k_htc: Support for
AR9271 chipset.") which was merged in 2.6.35-rc1.

Fixed status

Not fixed yet.

CVE-2022-30594: ptrace: Check PTRACE_O_SUSPEND_SECCOMP permission on
PTRACE_SEIZE

CVSS v3 score is not assigned.

Missing permission check bug was found in the seccomp module by using
the PTRACE_SEIZE flag.
This bug was introduced by commit 13c4a90 ("seccomp: add ptrace
options for suspend/resume") that was merged in 4.3-rc1.

Fixed status

mainline: [ee1fee900537b5d9560e9f937402de5ddc8412f3]
stable/4.14: [f1442ed84c43610ca8ab77deb9ca991e7354746c]
stable/4.19: [b1f438f872dcda10a79e6aeaf06fd52dfb15a6ab]
stable/4.9: [4f96b94a8342fac058117962f1a76fc7ebd1c245]
stable/5.10: [5a41a3033a9344d7683340e3d83f5435ffb06501]
stable/5.15: [b6d75218ff65f4d63c9cf4986f6c55666fb90a1a]
stable/5.17: [4d51bbc8a3799febf50471eb6888b1b58e87111e]
stable/5.4: [2458ecd21f29a3e5571d7d97764c043083deed5e]

CVE-2022-1734: nfc: nfcmrvl: main: reorder destructive operations in
nfcmrvl_nci_unregister_dev to avoid bug

CVSS v3 score is not assigned.

A reorder destructive operations bug found in the nfc module which
leads to double free/UAF/null pointer dereference bugs.
This bug was introduced by commit 194c68 ("NFC: nfcmrvl: add firmware
download support") that was merged in 4.4.
No CIP member enables CONFIG_NFC_MRVL.

Fixed status

mainline: [d270453a0d9ec10bb8a802a142fb1b3601a83098]
stable/4.14: [ced30680fb1c7c1daae39a9384d23cd1a022585f]
stable/4.19: [b266f492b2af82269aaaab871ac3949420ae678c]
stable/4.9: [4721695be941626e4b18b89e0641e36fc385cfd8]
stable/5.10: [1961c5a688edb53fe3bc25cbda57f47adf12563c]
stable/5.15: [b8f2b836e7d0a553b886654e8b3925a85862d2eb]
stable/5.17: [f4bfbac45121c8638db5eacb1ebbb61ee956c668]
stable/5.4: [33d3e76fc7a7037f402246c824d750542e2eb37f]

CVE-2022-29581: net/sched: cls_u32: fix netns refcount changes in u32_change()

CVSS v3 score is 7.8 HIGH.

Improper update of reference count bug was found in net/sched module.
This bug allows a local attacker to cause privilege escalation.

The mainline and cip kernels, and stable kernels were fixed.
This bug was introduced by commit 35c55fc156d8 ("cls_u32: use
tcf_exts_get_net() before call_rcu()" in 4.14.

Fixed status

mainline: [3db09e762dc79584a69c10d74a6b98f89a9979f8]
stable/4.14: [0511cdd41a03ab396602dded4e778c5edcd8dcd1]
stable/4.19: [75b0cc7904da7b40c6e8f2cf3ec4223b292b1184]
stable/5.10: [43ce33a68e2bcc431097e1075aad5393d0bf53ba]
stable/5.15: [ba9e9a794fd1689bf7e8a7452c55f3d3cbda7728]
stable/5.17: [64c87076791198b23da730186b0c141d9a6ce80c]
stable/5.4: [5a4f3eba211a532b2eb5045102ad3ceea5e9f0f9]

CVE-2022-1116: Integer Overflow or Wraparound vulnerability in io_uring

CVSS v3 score is 7.8 HIGH.

This bug is the 5.4 kernel specific issue. The commit cac68d1
("io_uring: grab ->fs as part of async offload") introduced this
issue.

Fixed status

stable/5.4: [1a623d361ffe5cecd4244a02f449528416360038]

CVE-2022-1671: A NULL pointer dereference flaw was found in
rxrpc_preparse_s in net/rxrpc/server_key.c

CVSS v3 score is not assigned.

A null pointer dereference bug in net/rxrpc/server_key.c in
rxrpc_preparse_s. This bug allows a local attacker to crash the system
or leak internal kernel information.

This vulnerability was introduced by 12da59f ("rxrpc: Hand server key
parsing off to the security class") which was merged in 5.11-rc1.
Linux kernel versions less than 5.11 are not affected.

Fixed status

mainline: [ff8376ade4f668130385839cef586a0990f8ef87]
stable/5.15: [432297011caf71dbc95c3365a65adf365e79aff3]
stable/5.17: [4e1f670e1b440dc783dbeb881d575bca31474f73]

* Updated CVEs

CVE-2021-26401: The speculative execution window of AMD LFENCE/JMP
mitigation (MITIGATION V2-2) may be large enough to be exploited on
AMD CPUs.

Added more patches to mainline, 4.19, 4.9, and 5.10.

Fixed status

mainline: [244d00b5dd4755f8df892c86cab35fb2cfd4f14b,
e9b6013a7ce31535b04b02ba99babefe8a8599fa,
eafd987d4a82c7bb5aa12f0e3b4f8f3dea93e678,
0de05d056afdb00eca8c7bbb0c79a3438daf700c]
stable/4.14: [85938688be23ecd36a06757096896b2779b80d97]
stable/4.19: [d3cb3a6927222268a10b2f12dfb8c9444f7cc39e,
c034d344e733a3ac574dd09e39e911a50025c607,
8bfdba77595aee5c3e83ed1c9994c35d6d409605,
9711b12a3f4c0fc73dd257c1e467e6e42155a5f1]
stable/4.9: [b6a1aec08a84ccb331ce526c051df074150cf3c5,
0db1c4307aded2c5e618654f9341a249e0c1051f,
8edabefdc13294a9b15671937d165b948cf34d69,
0753760184745250e39018bb25ba77557390fe91]
stable/5.10: [2fdf67a1d215574c31b1a716f80fa0fdccd401d7,
e335384560d1e106b609e8febd7e0427075a8938,
cc9e3e55bde71b2fac1494f503d5ffc560c7fb8d,
d04937ae94903087279e4a016b7741cdee59d521]
stable/5.15: [a56566d7a957c34811384d6300a53a97be94cd20]
stable/5.4: [b1bacf22a847d21a12900bd6a1eacaecb5bca253]

CVE-2022-0494: block-map: add __GFP_ZERO flag for alloc_page in
function bio_copy_kern

5.10 and 5.4 were fixed this week.

Fixed status

mainline: [cc8f7fe1f5eab010191aa4570f27641876fa1267]
stable/5.10: [a439819f4797f0846c7cffa9475f44aef23c541f]
stable/5.15: [a1ba98731518b811ff90009505c1aebf6e400bc2]
stable/5.16: [f8c61361a4f52c2a186269982587facc852dba62]
stable/5.4: [c7337efd1d11acb6f84c68ffee57d3f312e87b24]

CVE-2022-1048: race condition in snd_pcm_hw_free leading to use-after-free

5.4 was fixed this week

Fixed status

mainline: [92ee3c60ec9fe64404dc035e7c41277d74aa26cb,
dca947d4d26dbf925a64a6cfb2ddbc035e831a3d,
3c3201f8c7bb77eb53b08a3ca8d9a4ddc500b4c0,
69534c48ba8ce552ce383b3dfdb271ffe51820c3]
stable/5.10: [0f6947f5f5208f6ebd4d76a82a4757e2839a23f8,
8527c8f052fb42091c6569cb928e472376a4a889,
a38440f006974e693f92a1ea10f819eccc4dcc37,
b560d670c87d7d40b3cf6949246fa4c7aa65a00a]
stable/5.15: [33061d0fba51d2bf70a2ef9645f703c33fe8e438,
47711ff10c7e126702cfa725f6d86ef529d15a5f,
cb6a39c5ebd0a125c420c5a10999813daaece019,
51fce708ab8986a9879ee5da946a2cc120f1036d]
stable/5.16: [0090c13cbbdffd7da079ac56f80373a9a1be0bf8,
4d1b0ace2d56dc27cc4921eda7fae57f77f03eb5,
e1ff3a347ed1531eec40a24c47eab15f0efbf835,
a21d2f323b5a978dedf9ff1d50f101f85e39b3f2]
stable/5.17: [1bbf82d9f961414d6c76a08f7f843ea068e0ab7b,
dd2f8c684da3e226e5ec7a81c89ff5fd4a957a03,
e9d05532252ec41d000021d3cf40f3a2084fd5f9,
5ed8f8e3c4e59d0396b9ccf2e639711e24295bb6]
stable/5.4: [fbeb492694ce0441053de57699e1e2b7bc148a69,
08d1807f097a63ea00a7067dad89c1c81cb2115e,
2a559eec81acf4836d190d32b1e965d0c587c7ae,
37b12c16beb6f6c1c3c678c1aacbc46525c250f7]

CVE-2022-1195: kernel: A possible race condition (use-after-free) in
drivers/net/hamradio/6pack ( mkiss.c) after unregister_netdev

4.14 was fixed this week.

Fixed status

mainline: [3e0588c291d6ce225f2b891753ca41d45ba42469,
0b9111922b1f399aba6ed1e1b8f2079c3da1aed8,
81b1d548d00bcd028303c4f3150fa753b9b8aa71,
b2f37aead1b82a770c48b5d583f35ec22aabb61e]
stable/4.14: [eaa816a86e629cbcc0a94f38391fee09231628c7,
feb3d627facbf5df5cc0fc3dd4b64c5b8cb7ceff,
1a15c23af256aacd9284194bee4c9327ce657ff9,
a7b0ae2cc486fcb601f9f9d87d98138cc7b7f7f9]
stable/4.19: [896193a02a2981e60c40d4614fd095ce92135ccd,
b68f41c6320b2b7fbb54a95f07a69f3dc7e56c59,
9d2a1b180f0d5fdf0844cb4c740fafd67bebb9d2,
3befa9b67f2205f10c3b01cc687672e3969be569]
stable/4.9: [8a1a314965a17c62084a056b4f2cb7a770854c90,
83ba6ec97c74fb1a60f7779a26b6a94b28741d8a]
stable/5.10: [450121075a6a6f1d50f97225d3396315309d61a1,
7dd52af1eb5798f590d9d9e1c56ed8f5744ee0ca,
80a4df14643f78b14f1e8e2c7f9ca3da41b01654,
cfa98ffc42f16a432b77e438e2fefcdb942eeb04]
stable/5.15: [cb6c99aedd2c843056a598a8907a6128cb07603b,
c799c18a287e024e1c885da329aad8f719b255c3,
9873fe0f3857c500fa21f92fe43b2a177e8de208,
03d00f7f1815ec00dab5035851b3de83afd054a8]
stable/5.4: [ef5f7bfa19e3fc366f4c6d1a841ceaddf7a9f5d4,
7361a35bf33064da203e521357acc4fccb8927e5,
c9af90f0c6b8c461426abfe50f495dc5608399ba,
a5c6a13e9056d87805ba3042c208fbd4164ad22b]

CVE-2022-1419: drm/vgem: Close use-after-free race in vgem_gem_create

4.14 and 4.19 were fixed this week.

Fixed status

mainline: [4b848f20eda5974020f043ca14bacf7a7e634fc8]
stable/4.14: [d2b8e8fbac9f175388d2808ade90d86402642b01]
stable/4.19: [df2c1f38939aabb8c6beca108f08b90f050b9ebc]
stable/5.4: [3ea7f138cec139be98f8bb9fc1a6b432003f834e]

CVE-2021-39713: locking issue in net/sched module

4.9 was fixed this week.

Fixed status

mainline: [e368fdb61d8e7c67ac70791b23345b26d7bbc661,
9d7e82cec35c027756ec97e274f878251f271181,
3a7d0d07a386716b459b00783b11a8211cefcc0f,
86bd446b5cebd783187ea3772ff258210de77d99,
6f99528e9797794b91b43321fbbc93fe772b0803]
stable/4.19: [ae214e04b95ff64a4b0e9aab6742520bfde6ff0c,
da1d324088c40fa0a382224c466175fc5c704106,
f602ed9f8574512e7ea1ab65c3db7ba71053bf27,
92833e8b5db6c209e9311ac8c6a44d3bf1856659,
cd25f1099284a0cbe916344fc1e6c1ffed6c5306]
stable/4.9: [2b29404f4eea7da878a8a8c5b301d9adf6f56d55]

CVE-2022-1012: secure_seq: use the 64 bits of the siphash for port
offset calculation

The mainline was fixed this week. Fixed in the mainline in 5.18-rc6.
This issue was introduced by commit 7cd23e5 ("secure_seq: use SipHash
in place of MD5") which was merged in 4.11-rc1.

Added fixed commits to 4.19, 5.10, 5.15, and 5.17 this week.

Fixed status

mainline: [b2d057560b8107c633b39aabe517ff9d93f285e3,
9e9b70ae923baf2b5e8a0ea4fd0c8451801ac526,
4dfa9b438ee34caca4e6a4e5e961641807367f6f,
ca7af0402550f9a0b3316d5f1c30904e42ed257d,
e9261476184be1abd486c9434164b2acbe0ed6c2,
4c2c8f03a5ab7cb04ec64724d7d176d00bcc91e5,
e8161345ddbb66e449abde10d2fdce93f867eba9]
stable/4.19: [abcf4e1277d169b82dd7ee290006487ed16016ce]
stable/5.10: [d254309aab27fdcdc68e6bc9c663e51f3e7b37dc]
stable/5.15: [1a8ee547da2b64d6a2aedbd38a691578eff14718,
ff01554d8755bdbe2aec2e2cff322d95f328cb89,
f41f6336bfc43500e4e94ada703cd5aebb91789e,
b763fce193b42048444afd85d066b136288ad2c8,
4a3eefa399e675c4a5239497832a72733281a20f,
952a238d779eea4ecb2f8deb5004c8f56be79bc9,
f26c6f9404e1d6f3bfc9780ffba82a01a595d147]
stable/5.17: [6976724355f5fdada89de528730f9a7b4928f2e3,
27003fa8b581098aa9768bc03f82d5654368cb02,
3a8081f81323e1550c241157244318db166b660e,
c2cef1db8f8aa81330fee4538a1158e1f6fd5bd1,
01e16c23823a057667feb5cf26ba0c963fef6afd,
e3ee7bb47d6509c3e8a3e96e5d8e3bf21549b6e8,
5034cbb361e1c447911a15b1d3982d5df7aa17b9]

CVE-2022-1048: race condition in snd_pcm_hw_free leading to use-after-free

4.14 and 4.19 were fixed this week.

Fixed status

mainline: [92ee3c60ec9fe64404dc035e7c41277d74aa26cb,
dca947d4d26dbf925a64a6cfb2ddbc035e831a3d,
3c3201f8c7bb77eb53b08a3ca8d9a4ddc500b4c0,
69534c48ba8ce552ce383b3dfdb271ffe51820c3]
stable/4.14: [a42aa926843acca96c0dfbde2e835b8137f2f092,
73867cb2bc7dfa7fbd219e53a0b68d253d8fda09,
a1d54f97da10f7eea4817d8aae09cf20c40fa111,
e7786c445bb67a9a6e64f66ebd6b7215b153ff7d]
stable/4.19: [9cb6c40a6ebe4a0cfc9d6a181958211682cffea9,
b3830197aa7413c65767cf5a1aa8775c83f0dbf7,
47cef5937a43a412405ea54ad6e0a91d2890493e,
e14dca613e0a6ddc2bf6e360f16936a9f865205b]
stable/5.10: [0f6947f5f5208f6ebd4d76a82a4757e2839a23f8,
8527c8f052fb42091c6569cb928e472376a4a889,
a38440f006974e693f92a1ea10f819eccc4dcc37,
b560d670c87d7d40b3cf6949246fa4c7aa65a00a]
stable/5.15: [33061d0fba51d2bf70a2ef9645f703c33fe8e438,
47711ff10c7e126702cfa725f6d86ef529d15a5f,
cb6a39c5ebd0a125c420c5a10999813daaece019,
51fce708ab8986a9879ee5da946a2cc120f1036d]
stable/5.16: [0090c13cbbdffd7da079ac56f80373a9a1be0bf8,
4d1b0ace2d56dc27cc4921eda7fae57f77f03eb5,
e1ff3a347ed1531eec40a24c47eab15f0efbf835,
a21d2f323b5a978dedf9ff1d50f101f85e39b3f2]
stable/5.17: [1bbf82d9f961414d6c76a08f7f843ea068e0ab7b,
dd2f8c684da3e226e5ec7a81c89ff5fd4a957a03,
e9d05532252ec41d000021d3cf40f3a2084fd5f9,
5ed8f8e3c4e59d0396b9ccf2e639711e24295bb6]
stable/5.4: [fbeb492694ce0441053de57699e1e2b7bc148a69,
08d1807f097a63ea00a7067dad89c1c81cb2115e,
2a559eec81acf4836d190d32b1e965d0c587c7ae,
37b12c16beb6f6c1c3c678c1aacbc46525c250f7]

CVE-2022-28893: SUNRPC: Ensure we flush any closed sockets before xs_xprt_free()

5.10 and 5.15 were fixed this week. all stable kernels are fixed.

Fixed status

mainline: [f00432063db1a0db484e85193eccc6845435b80e]
stable/5.10: [e68b60ae29de10c7bd7636e227164a8dbe305a82]
stable/5.15: [54f6834b283d9b4d070b0639d9ef5e1d156fe7b0]
stable/5.16: [7a0921a23cae42e9fa5ce964f6907181b6dc80d8]
stable/5.17: [d21287d8a4589dd8513038f887ece980fbc399cf]

CVE-2022-1652: A concurrency use-after-free in bad_flp_intr

An UAF bug in floppy driver. The mainline was fixed this week.

Fixed status

mainline: [f71f01394f742fc4558b3f9f4c7ef4c4cf3b07c8]

Currently tracking CVEs

CVE-2021-31615: Unencrypted Bluetooth Low Energy baseband links in
Bluetooth Core Specifications 4.0 through 5.2

There is no fix information.

CVE-2020-26556: kernel: malleable commitment Bluetooth Mesh Provisioning

No fix information.

CVE-2020-26557: kernel: predictable Authvalue in Bluetooth Mesh
Provisioning Leads to MITM

No fix information.

CVE-2020-26559: kernel: Authvalue leak in Bluetooth Mesh Provisioning

No fix information.

CVE-2020-26560: kernel: impersonation attack in Bluetooth Mesh Provisioning

No fix information.

Regards,
--
Masami Ichikawa
Cybertrust Japan Co., Ltd.

Email :masami.ichikawa@...
:masami.ichikawa@...


Re: linux-4.4.y-cip-rebase: patches in wrong order?

Nobuhiro Iwamatsu
 

Hi Pavel,

Sorry, reply was late.


In previous linux-4.4.y-cip-rebases, order of patches was:

git log:
[CIP patches]
[Greg's stable tree]
[Linus tree]

With start of self-maintainance, we now have:

git log:
[-st patches]
[CIP patches]
[Greg's stable tree]
[Linus tree]

This was unexpected for me, may be unexpected for our users, and would
make -cip-rt release different to previous ones. COuld we get order of patches
be

git log:
[CIP patches]
[-st patches]
[Greg's stable tree]
[Linus tree]
Indeed.
I will revert to the commit order above, and force-push.

Best regards,
Nobuhiro


cip-gitlab/ci/iwamatsu/linux-5.10.y-cip-rc kselftest-seccomp: 6 runs, 1 regressions (v5.10.115-cip7-81-gd05f72e501084) #kernelci

kernelci.org bot <bot@...>
 

cip-gitlab/ci/iwamatsu/linux-5.10.y-cip-rc kselftest-seccomp: 6 runs, 1 regressions (v5.10.115-cip7-81-gd05f72e501084)

Regressions Summary
-------------------

platform | arch | lab | compiler | defconfig | regressions
-----------------------------+-------+--------------+----------+---------------------+------------
meson-gxl-s905x-libretech-cc | arm64 | lab-baylibre | gcc-10 | defconfig+kselftest | 1

Details: https://kernelci.org/test/job/cip-gitlab/branch/ci%2Fiwamatsu%2Flinux-5.10.y-cip-rc/kernel/v5.10.115-cip7-81-gd05f72e501084/plan/kselftest-seccomp/

Test: kselftest-seccomp
Tree: cip-gitlab
Branch: ci/iwamatsu/linux-5.10.y-cip-rc
Describe: v5.10.115-cip7-81-gd05f72e501084
URL: https://gitlab.com/cip-project/cip-kernel/linux-cip.git
SHA: d05f72e501084803c8658a71668fc1aadb075165


Test Regressions
----------------


platform | arch | lab | compiler | defconfig | regressions
-----------------------------+-------+--------------+----------+---------------------+------------
meson-gxl-s905x-libretech-cc | arm64 | lab-baylibre | gcc-10 | defconfig+kselftest | 1

Details: https://kernelci.org/test/plan/id/62854b382864d7a96ea39bf1

Results: 0 PASS, 1 FAIL, 0 SKIP
Full config: defconfig+kselftest
Compiler: gcc-10 (aarch64-linux-gnu-gcc (Debian 10.2.1-6) 10.2.1 20210110)
Plain log: https://storage.kernelci.org//cip-gitlab/ci-iwamatsu-linux-5.10.y-cip-rc/v5.10.115-cip7-81-gd05f72e501084/arm64/defconfig+kselftest/gcc-10/lab-baylibre/kselftest-seccomp-meson-gxl-s905x-libretech-cc.txt
HTML log: https://storage.kernelci.org//cip-gitlab/ci-iwamatsu-linux-5.10.y-cip-rc/v5.10.115-cip7-81-gd05f72e501084/arm64/defconfig+kselftest/gcc-10/lab-baylibre/kselftest-seccomp-meson-gxl-s905x-libretech-cc.html
Rootfs: http://storage.kernelci.org/images/rootfs/debian/bullseye-kselftest/20220513.0/arm64/initrd.cpio.gz


* kselftest-seccomp.login: https://kernelci.org/test/case/id/62854b382864d7a96ea39bf2
new failure (last pass: v5.10.112-cip6-289-g2969e096d186)


cip-gitlab/ci/iwamatsu/linux-5.10.y-cip-rc kselftest-futex: 9 runs, 1 regressions (v5.10.115-cip7-81-gd05f72e501084) #kernelci

kernelci.org bot <bot@...>
 

cip-gitlab/ci/iwamatsu/linux-5.10.y-cip-rc kselftest-futex: 9 runs, 1 regressions (v5.10.115-cip7-81-gd05f72e501084)

Regressions Summary
-------------------

platform | arch | lab | compiler | defconfig | regressions
-----------------------------+-------+--------------+----------+-----------+------------
meson-gxl-s905x-libretech-cc | arm64 | lab-baylibre | gcc-10 | defconfig | 1

Details: https://kernelci.org/test/job/cip-gitlab/branch/ci%2Fiwamatsu%2Flinux-5.10.y-cip-rc/kernel/v5.10.115-cip7-81-gd05f72e501084/plan/kselftest-futex/

Test: kselftest-futex
Tree: cip-gitlab
Branch: ci/iwamatsu/linux-5.10.y-cip-rc
Describe: v5.10.115-cip7-81-gd05f72e501084
URL: https://gitlab.com/cip-project/cip-kernel/linux-cip.git
SHA: d05f72e501084803c8658a71668fc1aadb075165


Test Regressions
----------------


platform | arch | lab | compiler | defconfig | regressions
-----------------------------+-------+--------------+----------+-----------+------------
meson-gxl-s905x-libretech-cc | arm64 | lab-baylibre | gcc-10 | defconfig | 1

Details: https://kernelci.org/test/plan/id/628549a622fad9f6eca39be6

Results: 0 PASS, 1 FAIL, 0 SKIP
Full config: defconfig
Compiler: gcc-10 (aarch64-linux-gnu-gcc (Debian 10.2.1-6) 10.2.1 20210110)
Plain log: https://storage.kernelci.org//cip-gitlab/ci-iwamatsu-linux-5.10.y-cip-rc/v5.10.115-cip7-81-gd05f72e501084/arm64/defconfig/gcc-10/lab-baylibre/kselftest-futex-meson-gxl-s905x-libretech-cc.txt
HTML log: https://storage.kernelci.org//cip-gitlab/ci-iwamatsu-linux-5.10.y-cip-rc/v5.10.115-cip7-81-gd05f72e501084/arm64/defconfig/gcc-10/lab-baylibre/kselftest-futex-meson-gxl-s905x-libretech-cc.html
Rootfs: http://storage.kernelci.org/images/rootfs/debian/bullseye-kselftest/20220513.0/arm64/initrd.cpio.gz


* kselftest-futex.login: https://kernelci.org/test/case/id/628549a622fad9f6eca39be7
failing since 6 days (last pass: v5.10.112-cip6-218-g8253434cd56a, first fail: v5.10.112-cip6-289-g2969e096d186)


cip-gitlab/ci/iwamatsu/linux-5.10.y-cip-rc kselftest-filesystems: 10 runs, 1 regressions (v5.10.115-cip7-81-gd05f72e501084) #kernelci

kernelci.org bot <bot@...>
 

cip-gitlab/ci/iwamatsu/linux-5.10.y-cip-rc kselftest-filesystems: 10 runs, 1 regressions (v5.10.115-cip7-81-gd05f72e501084)

Regressions Summary
-------------------

platform | arch | lab | compiler | defconfig | regressions
-------------------+--------+---------------+----------+------------------------------+------------
hp-11A-G6-EE-grunt | x86_64 | lab-collabora | gcc-10 | x86_64_defcon...6-chromebook | 1

Details: https://kernelci.org/test/job/cip-gitlab/branch/ci%2Fiwamatsu%2Flinux-5.10.y-cip-rc/kernel/v5.10.115-cip7-81-gd05f72e501084/plan/kselftest-filesystems/

Test: kselftest-filesystems
Tree: cip-gitlab
Branch: ci/iwamatsu/linux-5.10.y-cip-rc
Describe: v5.10.115-cip7-81-gd05f72e501084
URL: https://gitlab.com/cip-project/cip-kernel/linux-cip.git
SHA: d05f72e501084803c8658a71668fc1aadb075165


Test Regressions
----------------


platform | arch | lab | compiler | defconfig | regressions
-------------------+--------+---------------+----------+------------------------------+------------
hp-11A-G6-EE-grunt | x86_64 | lab-collabora | gcc-10 | x86_64_defcon...6-chromebook | 1

Details: https://kernelci.org/test/plan/id/6285462874fa629c2da39bcd

Results: 0 PASS, 1 FAIL, 0 SKIP
Full config: x86_64_defconfig+x86-chromebook
Compiler: gcc-10 (gcc (Debian 10.2.1-6) 10.2.1 20210110)
Plain log: https://storage.kernelci.org//cip-gitlab/ci-iwamatsu-linux-5.10.y-cip-rc/v5.10.115-cip7-81-gd05f72e501084/x86_64/x86_64_defconfig+x86-chromebook/gcc-10/lab-collabora/kselftest-filesystems-hp-11A-G6-EE-grunt.txt
HTML log: https://storage.kernelci.org//cip-gitlab/ci-iwamatsu-linux-5.10.y-cip-rc/v5.10.115-cip7-81-gd05f72e501084/x86_64/x86_64_defconfig+x86-chromebook/gcc-10/lab-collabora/kselftest-filesystems-hp-11A-G6-EE-grunt.html
Rootfs: http://storage.kernelci.org/images/rootfs/debian/bullseye-kselftest/20220513.0/amd64/initrd.cpio.gz


* kselftest-filesystems.login: https://kernelci.org/test/case/id/6285462874fa629c2da39bce
new failure (last pass: v5.10.112-cip6-289-g2969e096d186)


cip-gitlab/ci/iwamatsu/linux-5.10.y-cip-rc baseline: 119 runs, 17 regressions (v5.10.115-cip7-81-gd05f72e501084) #kernelci

kernelci.org bot <bot@...>
 

cip-gitlab/ci/iwamatsu/linux-5.10.y-cip-rc baseline: 119 runs, 17 regressions (v5.10.115-cip7-81-gd05f72e501084)

Regressions Summary
-------------------

platform | arch | lab | compiler | defconfig | regressions
---------------------------+-------+---------------+----------+----------------------------+------------
qemu_arm64-virt-gicv2 | arm64 | lab-baylibre | gcc-10 | defconfig | 1
qemu_arm64-virt-gicv2 | arm64 | lab-baylibre | gcc-10 | defconfig+arm64-chromebook | 1
qemu_arm64-virt-gicv2 | arm64 | lab-broonie | gcc-10 | defconfig | 1
qemu_arm64-virt-gicv2 | arm64 | lab-broonie | gcc-10 | defconfig+arm64-chromebook | 1
qemu_arm64-virt-gicv2-uefi | arm64 | lab-baylibre | gcc-10 | defconfig | 1
qemu_arm64-virt-gicv2-uefi | arm64 | lab-baylibre | gcc-10 | defconfig+arm64-chromebook | 1
qemu_arm64-virt-gicv2-uefi | arm64 | lab-broonie | gcc-10 | defconfig | 1
qemu_arm64-virt-gicv2-uefi | arm64 | lab-broonie | gcc-10 | defconfig+arm64-chromebook | 1
qemu_arm64-virt-gicv3 | arm64 | lab-baylibre | gcc-10 | defconfig | 1
qemu_arm64-virt-gicv3 | arm64 | lab-baylibre | gcc-10 | defconfig+arm64-chromebook | 1
qemu_arm64-virt-gicv3 | arm64 | lab-broonie | gcc-10 | defconfig | 1
qemu_arm64-virt-gicv3 | arm64 | lab-broonie | gcc-10 | defconfig+arm64-chromebook | 1
qemu_arm64-virt-gicv3-uefi | arm64 | lab-baylibre | gcc-10 | defconfig | 1
qemu_arm64-virt-gicv3-uefi | arm64 | lab-baylibre | gcc-10 | defconfig+arm64-chromebook | 1
qemu_arm64-virt-gicv3-uefi | arm64 | lab-broonie | gcc-10 | defconfig | 1
qemu_arm64-virt-gicv3-uefi | arm64 | lab-broonie | gcc-10 | defconfig+arm64-chromebook | 1
rk3399-gru-kevin | arm64 | lab-collabora | gcc-10 | defconfig+arm64-chromebook | 1

Details: https://kernelci.org/test/job/cip-gitlab/branch/ci%2Fiwamatsu%2Flinux-5.10.y-cip-rc/kernel/v5.10.115-cip7-81-gd05f72e501084/plan/baseline/

Test: baseline
Tree: cip-gitlab
Branch: ci/iwamatsu/linux-5.10.y-cip-rc
Describe: v5.10.115-cip7-81-gd05f72e501084
URL: https://gitlab.com/cip-project/cip-kernel/linux-cip.git
SHA: d05f72e501084803c8658a71668fc1aadb075165


Test Regressions
----------------


platform | arch | lab | compiler | defconfig | regressions
---------------------------+-------+---------------+----------+----------------------------+------------
qemu_arm64-virt-gicv2 | arm64 | lab-baylibre | gcc-10 | defconfig | 1

Details: https://kernelci.org/test/plan/id/6285464ce32d523f71a39bd8

Results: 0 PASS, 1 FAIL, 0 SKIP
Full config: defconfig
Compiler: gcc-10 (aarch64-linux-gnu-gcc (Debian 10.2.1-6) 10.2.1 20210110)
Plain log: https://storage.kernelci.org//cip-gitlab/ci-iwamatsu-linux-5.10.y-cip-rc/v5.10.115-cip7-81-gd05f72e501084/arm64/defconfig/gcc-10/lab-baylibre/baseline-qemu_arm64-virt-gicv2.txt
HTML log: https://storage.kernelci.org//cip-gitlab/ci-iwamatsu-linux-5.10.y-cip-rc/v5.10.115-cip7-81-gd05f72e501084/arm64/defconfig/gcc-10/lab-baylibre/baseline-qemu_arm64-virt-gicv2.html
Rootfs: http://storage.kernelci.org/images/rootfs/buildroot/buildroot-baseline/20220513.0/arm64/rootfs.cpio.gz


* baseline.login: https://kernelci.org/test/case/id/6285464ce32d523f71a39bd9
failing since 8 days (last pass: v5.10.112-cip6-88-gf3397cadb2dd6, first fail: v5.10.112-cip6-218-g8253434cd56a)



platform | arch | lab | compiler | defconfig | regressions
---------------------------+-------+---------------+----------+----------------------------+------------
qemu_arm64-virt-gicv2 | arm64 | lab-baylibre | gcc-10 | defconfig+arm64-chromebook | 1

Details: https://kernelci.org/test/plan/id/6285490d9fcd2a2fa0a39bf2

Results: 0 PASS, 1 FAIL, 0 SKIP
Full config: defconfig+arm64-chromebook
Compiler: gcc-10 (aarch64-linux-gnu-gcc (Debian 10.2.1-6) 10.2.1 20210110)
Plain log: https://storage.kernelci.org//cip-gitlab/ci-iwamatsu-linux-5.10.y-cip-rc/v5.10.115-cip7-81-gd05f72e501084/arm64/defconfig+arm64-chromebook/gcc-10/lab-baylibre/baseline-qemu_arm64-virt-gicv2.txt
HTML log: https://storage.kernelci.org//cip-gitlab/ci-iwamatsu-linux-5.10.y-cip-rc/v5.10.115-cip7-81-gd05f72e501084/arm64/defconfig+arm64-chromebook/gcc-10/lab-baylibre/baseline-qemu_arm64-virt-gicv2.html
Rootfs: http://storage.kernelci.org/images/rootfs/buildroot/buildroot-baseline/20220513.0/arm64/rootfs.cpio.gz


* baseline.login: https://kernelci.org/test/case/id/6285490d9fcd2a2fa0a39bf3
failing since 6 days (last pass: v5.10.112-cip6-88-gf3397cadb2dd6, first fail: v5.10.112-cip6-289-g2969e096d186)



platform | arch | lab | compiler | defconfig | regressions
---------------------------+-------+---------------+----------+----------------------------+------------
qemu_arm64-virt-gicv2 | arm64 | lab-broonie | gcc-10 | defconfig | 1

Details: https://kernelci.org/test/plan/id/62854682ad9e4edb34a39bd8

Results: 0 PASS, 1 FAIL, 0 SKIP
Full config: defconfig
Compiler: gcc-10 (aarch64-linux-gnu-gcc (Debian 10.2.1-6) 10.2.1 20210110)
Plain log: https://storage.kernelci.org//cip-gitlab/ci-iwamatsu-linux-5.10.y-cip-rc/v5.10.115-cip7-81-gd05f72e501084/arm64/defconfig/gcc-10/lab-broonie/baseline-qemu_arm64-virt-gicv2.txt
HTML log: https://storage.kernelci.org//cip-gitlab/ci-iwamatsu-linux-5.10.y-cip-rc/v5.10.115-cip7-81-gd05f72e501084/arm64/defconfig/gcc-10/lab-broonie/baseline-qemu_arm64-virt-gicv2.html
Rootfs: http://storage.kernelci.org/images/rootfs/buildroot/buildroot-baseline/20220513.0/arm64/rootfs.cpio.gz


* baseline.login: https://kernelci.org/test/case/id/62854682ad9e4edb34a39bd9
failing since 8 days (last pass: v5.10.112-cip6-88-gf3397cadb2dd6, first fail: v5.10.112-cip6-218-g8253434cd56a)



platform | arch | lab | compiler | defconfig | regressions
---------------------------+-------+---------------+----------+----------------------------+------------
qemu_arm64-virt-gicv2 | arm64 | lab-broonie | gcc-10 | defconfig+arm64-chromebook | 1

Details: https://kernelci.org/test/plan/id/62854b0a76b29aa870a39be7

Results: 0 PASS, 1 FAIL, 0 SKIP
Full config: defconfig+arm64-chromebook
Compiler: gcc-10 (aarch64-linux-gnu-gcc (Debian 10.2.1-6) 10.2.1 20210110)
Plain log: https://storage.kernelci.org//cip-gitlab/ci-iwamatsu-linux-5.10.y-cip-rc/v5.10.115-cip7-81-gd05f72e501084/arm64/defconfig+arm64-chromebook/gcc-10/lab-broonie/baseline-qemu_arm64-virt-gicv2.txt
HTML log: https://storage.kernelci.org//cip-gitlab/ci-iwamatsu-linux-5.10.y-cip-rc/v5.10.115-cip7-81-gd05f72e501084/arm64/defconfig+arm64-chromebook/gcc-10/lab-broonie/baseline-qemu_arm64-virt-gicv2.html
Rootfs: http://storage.kernelci.org/images/rootfs/buildroot/buildroot-baseline/20220513.0/arm64/rootfs.cpio.gz


* baseline.login: https://kernelci.org/test/case/id/62854b0a76b29aa870a39be8
failing since 6 days (last pass: v5.10.112-cip6-88-gf3397cadb2dd6, first fail: v5.10.112-cip6-289-g2969e096d186)



platform | arch | lab | compiler | defconfig | regressions
---------------------------+-------+---------------+----------+----------------------------+------------
qemu_arm64-virt-gicv2-uefi | arm64 | lab-baylibre | gcc-10 | defconfig | 1

Details: https://kernelci.org/test/plan/id/6285464ae32d523f71a39bd2

Results: 0 PASS, 1 FAIL, 0 SKIP
Full config: defconfig
Compiler: gcc-10 (aarch64-linux-gnu-gcc (Debian 10.2.1-6) 10.2.1 20210110)
Plain log: https://storage.kernelci.org//cip-gitlab/ci-iwamatsu-linux-5.10.y-cip-rc/v5.10.115-cip7-81-gd05f72e501084/arm64/defconfig/gcc-10/lab-baylibre/baseline-qemu_arm64-virt-gicv2-uefi.txt
HTML log: https://storage.kernelci.org//cip-gitlab/ci-iwamatsu-linux-5.10.y-cip-rc/v5.10.115-cip7-81-gd05f72e501084/arm64/defconfig/gcc-10/lab-baylibre/baseline-qemu_arm64-virt-gicv2-uefi.html
Rootfs: http://storage.kernelci.org/images/rootfs/buildroot/buildroot-baseline/20220513.0/arm64/rootfs.cpio.gz


* baseline.login: https://kernelci.org/test/case/id/6285464ae32d523f71a39bd3
failing since 8 days (last pass: v5.10.112-cip6-88-gf3397cadb2dd6, first fail: v5.10.112-cip6-218-g8253434cd56a)



platform | arch | lab | compiler | defconfig | regressions
---------------------------+-------+---------------+----------+----------------------------+------------
qemu_arm64-virt-gicv2-uefi | arm64 | lab-baylibre | gcc-10 | defconfig+arm64-chromebook | 1

Details: https://kernelci.org/test/plan/id/6285490b9fcd2a2fa0a39be9

Results: 0 PASS, 1 FAIL, 0 SKIP
Full config: defconfig+arm64-chromebook
Compiler: gcc-10 (aarch64-linux-gnu-gcc (Debian 10.2.1-6) 10.2.1 20210110)
Plain log: https://storage.kernelci.org//cip-gitlab/ci-iwamatsu-linux-5.10.y-cip-rc/v5.10.115-cip7-81-gd05f72e501084/arm64/defconfig+arm64-chromebook/gcc-10/lab-baylibre/baseline-qemu_arm64-virt-gicv2-uefi.txt
HTML log: https://storage.kernelci.org//cip-gitlab/ci-iwamatsu-linux-5.10.y-cip-rc/v5.10.115-cip7-81-gd05f72e501084/arm64/defconfig+arm64-chromebook/gcc-10/lab-baylibre/baseline-qemu_arm64-virt-gicv2-uefi.html
Rootfs: http://storage.kernelci.org/images/rootfs/buildroot/buildroot-baseline/20220513.0/arm64/rootfs.cpio.gz


* baseline.login: https://kernelci.org/test/case/id/6285490b9fcd2a2fa0a39bea
failing since 6 days (last pass: v5.10.112-cip6-88-gf3397cadb2dd6, first fail: v5.10.112-cip6-289-g2969e096d186)



platform | arch | lab | compiler | defconfig | regressions
---------------------------+-------+---------------+----------+----------------------------+------------
qemu_arm64-virt-gicv2-uefi | arm64 | lab-broonie | gcc-10 | defconfig | 1

Details: https://kernelci.org/test/plan/id/6285466cb0dcc2bc59a39bcd

Results: 0 PASS, 1 FAIL, 0 SKIP
Full config: defconfig
Compiler: gcc-10 (aarch64-linux-gnu-gcc (Debian 10.2.1-6) 10.2.1 20210110)
Plain log: https://storage.kernelci.org//cip-gitlab/ci-iwamatsu-linux-5.10.y-cip-rc/v5.10.115-cip7-81-gd05f72e501084/arm64/defconfig/gcc-10/lab-broonie/baseline-qemu_arm64-virt-gicv2-uefi.txt
HTML log: https://storage.kernelci.org//cip-gitlab/ci-iwamatsu-linux-5.10.y-cip-rc/v5.10.115-cip7-81-gd05f72e501084/arm64/defconfig/gcc-10/lab-broonie/baseline-qemu_arm64-virt-gicv2-uefi.html
Rootfs: http://storage.kernelci.org/images/rootfs/buildroot/buildroot-baseline/20220513.0/arm64/rootfs.cpio.gz


* baseline.login: https://kernelci.org/test/case/id/6285466cb0dcc2bc59a39bce
failing since 8 days (last pass: v5.10.112-cip6-88-gf3397cadb2dd6, first fail: v5.10.112-cip6-218-g8253434cd56a)



platform | arch | lab | compiler | defconfig | regressions
---------------------------+-------+---------------+----------+----------------------------+------------
qemu_arm64-virt-gicv2-uefi | arm64 | lab-broonie | gcc-10 | defconfig+arm64-chromebook | 1

Details: https://kernelci.org/test/plan/id/62854b09715b993544a39bdb

Results: 0 PASS, 1 FAIL, 0 SKIP
Full config: defconfig+arm64-chromebook
Compiler: gcc-10 (aarch64-linux-gnu-gcc (Debian 10.2.1-6) 10.2.1 20210110)
Plain log: https://storage.kernelci.org//cip-gitlab/ci-iwamatsu-linux-5.10.y-cip-rc/v5.10.115-cip7-81-gd05f72e501084/arm64/defconfig+arm64-chromebook/gcc-10/lab-broonie/baseline-qemu_arm64-virt-gicv2-uefi.txt
HTML log: https://storage.kernelci.org//cip-gitlab/ci-iwamatsu-linux-5.10.y-cip-rc/v5.10.115-cip7-81-gd05f72e501084/arm64/defconfig+arm64-chromebook/gcc-10/lab-broonie/baseline-qemu_arm64-virt-gicv2-uefi.html
Rootfs: http://storage.kernelci.org/images/rootfs/buildroot/buildroot-baseline/20220513.0/arm64/rootfs.cpio.gz


* baseline.login: https://kernelci.org/test/case/id/62854b09715b993544a39bdc
failing since 6 days (last pass: v5.10.112-cip6-88-gf3397cadb2dd6, first fail: v5.10.112-cip6-289-g2969e096d186)



platform | arch | lab | compiler | defconfig | regressions
---------------------------+-------+---------------+----------+----------------------------+------------
qemu_arm64-virt-gicv3 | arm64 | lab-baylibre | gcc-10 | defconfig | 1

Details: https://kernelci.org/test/plan/id/6285464b4b657eefd4a39be0

Results: 0 PASS, 1 FAIL, 0 SKIP
Full config: defconfig
Compiler: gcc-10 (aarch64-linux-gnu-gcc (Debian 10.2.1-6) 10.2.1 20210110)
Plain log: https://storage.kernelci.org//cip-gitlab/ci-iwamatsu-linux-5.10.y-cip-rc/v5.10.115-cip7-81-gd05f72e501084/arm64/defconfig/gcc-10/lab-baylibre/baseline-qemu_arm64-virt-gicv3.txt
HTML log: https://storage.kernelci.org//cip-gitlab/ci-iwamatsu-linux-5.10.y-cip-rc/v5.10.115-cip7-81-gd05f72e501084/arm64/defconfig/gcc-10/lab-baylibre/baseline-qemu_arm64-virt-gicv3.html
Rootfs: http://storage.kernelci.org/images/rootfs/buildroot/buildroot-baseline/20220513.0/arm64/rootfs.cpio.gz


* baseline.login: https://kernelci.org/test/case/id/6285464b4b657eefd4a39be1
failing since 8 days (last pass: v5.10.112-cip6-88-gf3397cadb2dd6, first fail: v5.10.112-cip6-218-g8253434cd56a)



platform | arch | lab | compiler | defconfig | regressions
---------------------------+-------+---------------+----------+----------------------------+------------
qemu_arm64-virt-gicv3 | arm64 | lab-baylibre | gcc-10 | defconfig+arm64-chromebook | 1

Details: https://kernelci.org/test/plan/id/6285490f857735ed38a39bd6

Results: 0 PASS, 1 FAIL, 0 SKIP
Full config: defconfig+arm64-chromebook
Compiler: gcc-10 (aarch64-linux-gnu-gcc (Debian 10.2.1-6) 10.2.1 20210110)
Plain log: https://storage.kernelci.org//cip-gitlab/ci-iwamatsu-linux-5.10.y-cip-rc/v5.10.115-cip7-81-gd05f72e501084/arm64/defconfig+arm64-chromebook/gcc-10/lab-baylibre/baseline-qemu_arm64-virt-gicv3.txt
HTML log: https://storage.kernelci.org//cip-gitlab/ci-iwamatsu-linux-5.10.y-cip-rc/v5.10.115-cip7-81-gd05f72e501084/arm64/defconfig+arm64-chromebook/gcc-10/lab-baylibre/baseline-qemu_arm64-virt-gicv3.html
Rootfs: http://storage.kernelci.org/images/rootfs/buildroot/buildroot-baseline/20220513.0/arm64/rootfs.cpio.gz


* baseline.login: https://kernelci.org/test/case/id/6285490f857735ed38a39bd7
failing since 6 days (last pass: v5.10.112-cip6-88-gf3397cadb2dd6, first fail: v5.10.112-cip6-289-g2969e096d186)



platform | arch | lab | compiler | defconfig | regressions
---------------------------+-------+---------------+----------+----------------------------+------------
qemu_arm64-virt-gicv3 | arm64 | lab-broonie | gcc-10 | defconfig | 1

Details: https://kernelci.org/test/plan/id/62854680a0dafc7defa39bce

Results: 0 PASS, 1 FAIL, 0 SKIP
Full config: defconfig
Compiler: gcc-10 (aarch64-linux-gnu-gcc (Debian 10.2.1-6) 10.2.1 20210110)
Plain log: https://storage.kernelci.org//cip-gitlab/ci-iwamatsu-linux-5.10.y-cip-rc/v5.10.115-cip7-81-gd05f72e501084/arm64/defconfig/gcc-10/lab-broonie/baseline-qemu_arm64-virt-gicv3.txt
HTML log: https://storage.kernelci.org//cip-gitlab/ci-iwamatsu-linux-5.10.y-cip-rc/v5.10.115-cip7-81-gd05f72e501084/arm64/defconfig/gcc-10/lab-broonie/baseline-qemu_arm64-virt-gicv3.html
Rootfs: http://storage.kernelci.org/images/rootfs/buildroot/buildroot-baseline/20220513.0/arm64/rootfs.cpio.gz


* baseline.login: https://kernelci.org/test/case/id/62854680a0dafc7defa39bcf
failing since 8 days (last pass: v5.10.112-cip6-88-gf3397cadb2dd6, first fail: v5.10.112-cip6-218-g8253434cd56a)



platform | arch | lab | compiler | defconfig | regressions
---------------------------+-------+---------------+----------+----------------------------+------------
qemu_arm64-virt-gicv3 | arm64 | lab-broonie | gcc-10 | defconfig+arm64-chromebook | 1

Details: https://kernelci.org/test/plan/id/62854b6d3717315273a39be7

Results: 0 PASS, 1 FAIL, 0 SKIP
Full config: defconfig+arm64-chromebook
Compiler: gcc-10 (aarch64-linux-gnu-gcc (Debian 10.2.1-6) 10.2.1 20210110)
Plain log: https://storage.kernelci.org//cip-gitlab/ci-iwamatsu-linux-5.10.y-cip-rc/v5.10.115-cip7-81-gd05f72e501084/arm64/defconfig+arm64-chromebook/gcc-10/lab-broonie/baseline-qemu_arm64-virt-gicv3.txt
HTML log: https://storage.kernelci.org//cip-gitlab/ci-iwamatsu-linux-5.10.y-cip-rc/v5.10.115-cip7-81-gd05f72e501084/arm64/defconfig+arm64-chromebook/gcc-10/lab-broonie/baseline-qemu_arm64-virt-gicv3.html
Rootfs: http://storage.kernelci.org/images/rootfs/buildroot/buildroot-baseline/20220513.0/arm64/rootfs.cpio.gz


* baseline.login: https://kernelci.org/test/case/id/62854b6d3717315273a39be8
failing since 6 days (last pass: v5.10.112-cip6-88-gf3397cadb2dd6, first fail: v5.10.112-cip6-289-g2969e096d186)



platform | arch | lab | compiler | defconfig | regressions
---------------------------+-------+---------------+----------+----------------------------+------------
qemu_arm64-virt-gicv3-uefi | arm64 | lab-baylibre | gcc-10 | defconfig | 1

Details: https://kernelci.org/test/plan/id/6285465de32d523f71a39be3

Results: 0 PASS, 1 FAIL, 0 SKIP
Full config: defconfig
Compiler: gcc-10 (aarch64-linux-gnu-gcc (Debian 10.2.1-6) 10.2.1 20210110)
Plain log: https://storage.kernelci.org//cip-gitlab/ci-iwamatsu-linux-5.10.y-cip-rc/v5.10.115-cip7-81-gd05f72e501084/arm64/defconfig/gcc-10/lab-baylibre/baseline-qemu_arm64-virt-gicv3-uefi.txt
HTML log: https://storage.kernelci.org//cip-gitlab/ci-iwamatsu-linux-5.10.y-cip-rc/v5.10.115-cip7-81-gd05f72e501084/arm64/defconfig/gcc-10/lab-baylibre/baseline-qemu_arm64-virt-gicv3-uefi.html
Rootfs: http://storage.kernelci.org/images/rootfs/buildroot/buildroot-baseline/20220513.0/arm64/rootfs.cpio.gz


* baseline.login: https://kernelci.org/test/case/id/6285465de32d523f71a39be4
failing since 8 days (last pass: v5.10.112-cip6-88-gf3397cadb2dd6, first fail: v5.10.112-cip6-218-g8253434cd56a)



platform | arch | lab | compiler | defconfig | regressions
---------------------------+-------+---------------+----------+----------------------------+------------
qemu_arm64-virt-gicv3-uefi | arm64 | lab-baylibre | gcc-10 | defconfig+arm64-chromebook | 1

Details: https://kernelci.org/test/plan/id/628549099fcd2a2fa0a39be1

Results: 0 PASS, 1 FAIL, 0 SKIP
Full config: defconfig+arm64-chromebook
Compiler: gcc-10 (aarch64-linux-gnu-gcc (Debian 10.2.1-6) 10.2.1 20210110)
Plain log: https://storage.kernelci.org//cip-gitlab/ci-iwamatsu-linux-5.10.y-cip-rc/v5.10.115-cip7-81-gd05f72e501084/arm64/defconfig+arm64-chromebook/gcc-10/lab-baylibre/baseline-qemu_arm64-virt-gicv3-uefi.txt
HTML log: https://storage.kernelci.org//cip-gitlab/ci-iwamatsu-linux-5.10.y-cip-rc/v5.10.115-cip7-81-gd05f72e501084/arm64/defconfig+arm64-chromebook/gcc-10/lab-baylibre/baseline-qemu_arm64-virt-gicv3-uefi.html
Rootfs: http://storage.kernelci.org/images/rootfs/buildroot/buildroot-baseline/20220513.0/arm64/rootfs.cpio.gz


* baseline.login: https://kernelci.org/test/case/id/628549099fcd2a2fa0a39be2
failing since 6 days (last pass: v5.10.112-cip6-88-gf3397cadb2dd6, first fail: v5.10.112-cip6-289-g2969e096d186)



platform | arch | lab | compiler | defconfig | regressions
---------------------------+-------+---------------+----------+----------------------------+------------
qemu_arm64-virt-gicv3-uefi | arm64 | lab-broonie | gcc-10 | defconfig | 1

Details: https://kernelci.org/test/plan/id/628546a8bc80806f5ea39c09

Results: 0 PASS, 1 FAIL, 0 SKIP
Full config: defconfig
Compiler: gcc-10 (aarch64-linux-gnu-gcc (Debian 10.2.1-6) 10.2.1 20210110)
Plain log: https://storage.kernelci.org//cip-gitlab/ci-iwamatsu-linux-5.10.y-cip-rc/v5.10.115-cip7-81-gd05f72e501084/arm64/defconfig/gcc-10/lab-broonie/baseline-qemu_arm64-virt-gicv3-uefi.txt
HTML log: https://storage.kernelci.org//cip-gitlab/ci-iwamatsu-linux-5.10.y-cip-rc/v5.10.115-cip7-81-gd05f72e501084/arm64/defconfig/gcc-10/lab-broonie/baseline-qemu_arm64-virt-gicv3-uefi.html
Rootfs: http://storage.kernelci.org/images/rootfs/buildroot/buildroot-baseline/20220513.0/arm64/rootfs.cpio.gz


* baseline.login: https://kernelci.org/test/case/id/628546a8bc80806f5ea39c0a
failing since 8 days (last pass: v5.10.112-cip6-88-gf3397cadb2dd6, first fail: v5.10.112-cip6-218-g8253434cd56a)



platform | arch | lab | compiler | defconfig | regressions
---------------------------+-------+---------------+----------+----------------------------+------------
qemu_arm64-virt-gicv3-uefi | arm64 | lab-broonie | gcc-10 | defconfig+arm64-chromebook | 1

Details: https://kernelci.org/test/plan/id/62854ab91d98bfbc15a39bde

Results: 0 PASS, 1 FAIL, 0 SKIP
Full config: defconfig+arm64-chromebook
Compiler: gcc-10 (aarch64-linux-gnu-gcc (Debian 10.2.1-6) 10.2.1 20210110)
Plain log: https://storage.kernelci.org//cip-gitlab/ci-iwamatsu-linux-5.10.y-cip-rc/v5.10.115-cip7-81-gd05f72e501084/arm64/defconfig+arm64-chromebook/gcc-10/lab-broonie/baseline-qemu_arm64-virt-gicv3-uefi.txt
HTML log: https://storage.kernelci.org//cip-gitlab/ci-iwamatsu-linux-5.10.y-cip-rc/v5.10.115-cip7-81-gd05f72e501084/arm64/defconfig+arm64-chromebook/gcc-10/lab-broonie/baseline-qemu_arm64-virt-gicv3-uefi.html
Rootfs: http://storage.kernelci.org/images/rootfs/buildroot/buildroot-baseline/20220513.0/arm64/rootfs.cpio.gz


* baseline.login: https://kernelci.org/test/case/id/62854ab91d98bfbc15a39bdf
failing since 6 days (last pass: v5.10.112-cip6-88-gf3397cadb2dd6, first fail: v5.10.112-cip6-289-g2969e096d186)



platform | arch | lab | compiler | defconfig | regressions
---------------------------+-------+---------------+----------+----------------------------+------------
rk3399-gru-kevin | arm64 | lab-collabora | gcc-10 | defconfig+arm64-chromebook | 1

Details: https://kernelci.org/test/plan/id/6285500ec1204c5187a39be2

Results: 90 PASS, 2 FAIL, 0 SKIP
Full config: defconfig+arm64-chromebook
Compiler: gcc-10 (aarch64-linux-gnu-gcc (Debian 10.2.1-6) 10.2.1 20210110)
Plain log: https://storage.kernelci.org//cip-gitlab/ci-iwamatsu-linux-5.10.y-cip-rc/v5.10.115-cip7-81-gd05f72e501084/arm64/defconfig+arm64-chromebook/gcc-10/lab-collabora/baseline-rk3399-gru-kevin.txt
HTML log: https://storage.kernelci.org//cip-gitlab/ci-iwamatsu-linux-5.10.y-cip-rc/v5.10.115-cip7-81-gd05f72e501084/arm64/defconfig+arm64-chromebook/gcc-10/lab-collabora/baseline-rk3399-gru-kevin.html
Rootfs: http://storage.kernelci.org/images/rootfs/buildroot/buildroot-baseline/20220513.0/arm64/rootfs.cpio.gz


* baseline.bootrr.rockchip-i2s1-probed: https://kernelci.org/test/case/id/6285500ec1204c5187a39c08
failing since 70 days (last pass: v5.10.100-cip2-319-gcbff87047566, first fail: v5.10.100-cip2-425-g0a0d92194f39)

2022-05-18T19:58:55.880488 /lava-6417474/1/../bin/lava-test-case
2022-05-18T19:58:55.891204 <8>[ 33.803568] <LAVA_SIGNAL_TESTCASE TEST_CASE_ID=rockchip-i2s1-probed RESULT=fail>


cip-gitlab/ci/iwamatsu/linux-5.10.y-cip-rc baseline-nfs: 29 runs, 1 regressions (v5.10.115-cip7-81-gd05f72e501084) #kernelci

kernelci.org bot <bot@...>
 

cip-gitlab/ci/iwamatsu/linux-5.10.y-cip-rc baseline-nfs: 29 runs, 1 regressions (v5.10.115-cip7-81-gd05f72e501084)

Regressions Summary
-------------------

platform | arch | lab | compiler | defconfig | regressions
-----------------+-------+---------------+----------+----------------------------+------------
rk3399-gru-kevin | arm64 | lab-collabora | gcc-10 | defconfig+arm64-chromebook | 1

Details: https://kernelci.org/test/job/cip-gitlab/branch/ci%2Fiwamatsu%2Flinux-5.10.y-cip-rc/kernel/v5.10.115-cip7-81-gd05f72e501084/plan/baseline-nfs/

Test: baseline-nfs
Tree: cip-gitlab
Branch: ci/iwamatsu/linux-5.10.y-cip-rc
Describe: v5.10.115-cip7-81-gd05f72e501084
URL: https://gitlab.com/cip-project/cip-kernel/linux-cip.git
SHA: d05f72e501084803c8658a71668fc1aadb075165


Test Regressions
----------------


platform | arch | lab | compiler | defconfig | regressions
-----------------+-------+---------------+----------+----------------------------+------------
rk3399-gru-kevin | arm64 | lab-collabora | gcc-10 | defconfig+arm64-chromebook | 1

Details: https://kernelci.org/test/plan/id/628550d287317cdcf2a39bdd

Results: 84 PASS, 4 FAIL, 0 SKIP
Full config: defconfig+arm64-chromebook
Compiler: gcc-10 (aarch64-linux-gnu-gcc (Debian 10.2.1-6) 10.2.1 20210110)
Plain log: https://storage.kernelci.org//cip-gitlab/ci-iwamatsu-linux-5.10.y-cip-rc/v5.10.115-cip7-81-gd05f72e501084/arm64/defconfig+arm64-chromebook/gcc-10/lab-collabora/baseline-nfs-rk3399-gru-kevin.txt
HTML log: https://storage.kernelci.org//cip-gitlab/ci-iwamatsu-linux-5.10.y-cip-rc/v5.10.115-cip7-81-gd05f72e501084/arm64/defconfig+arm64-chromebook/gcc-10/lab-collabora/baseline-nfs-rk3399-gru-kevin.html
Rootfs: http://storage.kernelci.org/images/rootfs/debian/bullseye/20220513.0/arm64/initrd.cpio.gz


* baseline-nfs.bootrr.rockchip-i2s1-probed: https://kernelci.org/test/case/id/628550d287317cdcf2a39c00
failing since 70 days (last pass: v5.10.100-cip2-319-gcbff87047566, first fail: v5.10.100-cip2-425-g0a0d92194f39)

2022-05-18T20:02:13.005065 <8>[ 36.531013] <LAVA_SIGNAL_TESTCASE TEST_CASE_ID=rockchip-i2s0-probed RESULT=pass>
2022-05-18T20:02:13.699469 <4>[ 37.224958] cdn-dp fec00000.dp: Direct firmware load for rockchip/dptx.bin failed with error -2
2022-05-18T20:02:13.708741 <4>[ 37.235458] cdn-dp fec00000.dp: Falling back to sysfs fallback for: rockchip/dptx.bin
2022-05-18T20:02:14.055084 /lava-6417484/1/../bin/lava-test-case
2022-05-18T20:02:14.085559 <8>[ 37.613314] <LAVA_SIGNAL_TESTCASE TEST_CASE_ID=rockchip-i2s1-probed RESULT=fail>


cip-gitlab/ci/iwamatsu/linux-5.10.y-cip-rc baseline-cip-nfs: 13 runs, 1 regressions (v5.10.115-cip7-81-gd05f72e501084) #kernelci

kernelci.org bot <bot@...>
 

cip-gitlab/ci/iwamatsu/linux-5.10.y-cip-rc baseline-cip-nfs: 13 runs, 1 regressions (v5.10.115-cip7-81-gd05f72e501084)

Regressions Summary
-------------------

platform | arch | lab | compiler | defconfig | regressions
-----------------+------+-------------+----------+---------------------+------------
beaglebone-black | arm | lab-broonie | gcc-10 | omap2plus_defconfig | 1

Details: https://kernelci.org/test/job/cip-gitlab/branch/ci%2Fiwamatsu%2Flinux-5.10.y-cip-rc/kernel/v5.10.115-cip7-81-gd05f72e501084/plan/baseline-cip-nfs/

Test: baseline-cip-nfs
Tree: cip-gitlab
Branch: ci/iwamatsu/linux-5.10.y-cip-rc
Describe: v5.10.115-cip7-81-gd05f72e501084
URL: https://gitlab.com/cip-project/cip-kernel/linux-cip.git
SHA: d05f72e501084803c8658a71668fc1aadb075165


Test Regressions
----------------


platform | arch | lab | compiler | defconfig | regressions
-----------------+------+-------------+----------+---------------------+------------
beaglebone-black | arm | lab-broonie | gcc-10 | omap2plus_defconfig | 1

Details: https://kernelci.org/test/plan/id/628550fcd29f825c65a39c08

Results: 0 PASS, 1 FAIL, 0 SKIP
Full config: omap2plus_defconfig
Compiler: gcc-10 (arm-linux-gnueabihf-gcc (Debian 10.2.1-6) 10.2.1 20210110)
Plain log: https://storage.kernelci.org//cip-gitlab/ci-iwamatsu-linux-5.10.y-cip-rc/v5.10.115-cip7-81-gd05f72e501084/arm/omap2plus_defconfig/gcc-10/lab-broonie/baseline-cip-nfs-beaglebone-black.txt
HTML log: https://storage.kernelci.org//cip-gitlab/ci-iwamatsu-linux-5.10.y-cip-rc/v5.10.115-cip7-81-gd05f72e501084/arm/omap2plus_defconfig/gcc-10/lab-broonie/baseline-cip-nfs-beaglebone-black.html
Rootfs: https://storage.kernelci.org/images/rootfs/cip/20211105/qemu-arm/cip-core-image-kernelci-cip-core-buster-qemu-arm-initrd.img.gz


* baseline-cip-nfs.login: https://kernelci.org/test/case/id/628550fcd29f825c65a39c09
failing since 6 days (last pass: v5.10.112-cip6-218-g8253434cd56a, first fail: v5.10.112-cip6-289-g2969e096d186)


cip-gitlab/ci/iwamatsu/linux-5.10.y-cip-rc build: 165 builds: 2 failed, 163 passed, 4 errors, 8 warnings (v5.10.115-cip7-81-gd05f72e501084) #kernelci

kernelci.org bot <bot@...>
 

cip-gitlab/ci/iwamatsu/linux-5.10.y-cip-rc build: 165 builds: 2 failed, 163 passed, 4 errors, 8 warnings (v5.10.115-cip7-81-gd05f72e501084)

Full Build Summary: https://kernelci.org/build/cip-gitlab/branch/ci%2Fiwamatsu%2Flinux-5.10.y-cip-rc/kernel/v5.10.115-cip7-81-gd05f72e501084/

Tree: cip-gitlab
Branch: ci/iwamatsu/linux-5.10.y-cip-rc
Git Describe: v5.10.115-cip7-81-gd05f72e501084
Git Commit: d05f72e501084803c8658a71668fc1aadb075165
Git URL: https://gitlab.com/cip-project/cip-kernel/linux-cip.git
Built: 7 unique architectures

Build Failures Detected:

arm:
rpc_defconfig: (gcc-10) FAIL

mips:
ip28_defconfig: (gcc-10) FAIL

Errors and Warnings Detected:

arc:

arm64:

arm:
rpc_defconfig (gcc-10): 4 errors

i386:

mips:
decstation_defconfig (gcc-10): 1 warning
decstation_r4k_defconfig (gcc-10): 1 warning
lemote2f_defconfig (gcc-10): 1 warning
rm200_defconfig (gcc-10): 1 warning

riscv:
rv32_defconfig (gcc-10): 4 warnings

x86_64:

Errors summary:

2 arm-linux-gnueabihf-gcc: error: unrecognized -march target: armv3m
2 arm-linux-gnueabihf-gcc: error: missing argument to ‘-march=’

Warnings summary:

2 kernel/rcu/tasks.h:707:13: warning: ‘show_rcu_tasks_rude_gp_kthread’ defined but not used [-Wunused-function]
2 <stdin>:830:2: warning: #warning syscall fstat64 not implemented [-Wcpp]
2 <stdin>:1127:2: warning: #warning syscall fstatat64 not implemented [-Wcpp]
1 net/mac80211/mlme.c:4349:1: warning: the frame size of 1040 bytes is larger than 1024 bytes [-Wframe-larger-than=]
1 drivers/block/paride/bpck.c:32: warning: "PC" redefined

================================================================================

Detailed per-defconfig build reports:

--------------------------------------------------------------------------------
allnoconfig (arc, gcc-10) — PASS, 0 errors, 0 warnings, 0 section mismatches

--------------------------------------------------------------------------------
allnoconfig (i386, gcc-10) — PASS, 0 errors, 0 warnings, 0 section mismatches

--------------------------------------------------------------------------------
allnoconfig (x86_64, gcc-10) — PASS, 0 errors, 0 warnings, 0 section mismatches

--------------------------------------------------------------------------------
am200epdkit_defconfig (arm, gcc-10) — PASS, 0 errors, 0 warnings, 0 section mismatches

--------------------------------------------------------------------------------
ar7_defconfig (mips, gcc-10) — PASS, 0 errors, 0 warnings, 0 section mismatches

--------------------------------------------------------------------------------
aspeed_g4_defconfig (arm, gcc-10) — PASS, 0 errors, 0 warnings, 0 section mismatches

--------------------------------------------------------------------------------
aspeed_g5_defconfig (arm, gcc-10) — PASS, 0 errors, 0 warnings, 0 section mismatches

--------------------------------------------------------------------------------
assabet_defconfig (arm, gcc-10) — PASS, 0 errors, 0 warnings, 0 section mismatches

--------------------------------------------------------------------------------
at91_dt_defconfig (arm, gcc-10) — PASS, 0 errors, 0 warnings, 0 section mismatches

--------------------------------------------------------------------------------
ath25_defconfig (mips, gcc-10) — PASS, 0 errors, 0 warnings, 0 section mismatches

--------------------------------------------------------------------------------
ath79_defconfig (mips, gcc-10) — PASS, 0 errors, 0 warnings, 0 section mismatches

--------------------------------------------------------------------------------
axm55xx_defconfig (arm, gcc-10) — PASS, 0 errors, 0 warnings, 0 section mismatches

--------------------------------------------------------------------------------
axs103_smp_defconfig (arc, gcc-10) — PASS, 0 errors, 0 warnings, 0 section mismatches

--------------------------------------------------------------------------------
badge4_defconfig (arm, gcc-10) — PASS, 0 errors, 0 warnings, 0 section mismatches

--------------------------------------------------------------------------------
bcm2835_defconfig (arm, gcc-10) — PASS, 0 errors, 0 warnings, 0 section mismatches

--------------------------------------------------------------------------------
bcm47xx_defconfig (mips, gcc-10) — PASS, 0 errors, 0 warnings, 0 section mismatches

--------------------------------------------------------------------------------
bcm63xx_defconfig (mips, gcc-10) — PASS, 0 errors, 0 warnings, 0 section mismatches

--------------------------------------------------------------------------------
bigsur_defconfig (mips, gcc-10) — PASS, 0 errors, 0 warnings, 0 section mismatches

--------------------------------------------------------------------------------
bmips_be_defconfig (mips, gcc-10) — PASS, 0 errors, 0 warnings, 0 section mismatches

--------------------------------------------------------------------------------
bmips_stb_defconfig (mips, gcc-10) — PASS, 0 errors, 0 warnings, 0 section mismatches

--------------------------------------------------------------------------------
capcella_defconfig (mips, gcc-10) — PASS, 0 errors, 0 warnings, 0 section mismatches

--------------------------------------------------------------------------------
cavium_octeon_defconfig (mips, gcc-10) — PASS, 0 errors, 0 warnings, 0 section mismatches

--------------------------------------------------------------------------------
cerfcube_defconfig (arm, gcc-10) — PASS, 0 errors, 0 warnings, 0 section mismatches

--------------------------------------------------------------------------------
ci20_defconfig (mips, gcc-10) — PASS, 0 errors, 0 warnings, 0 section mismatches

--------------------------------------------------------------------------------
cobalt_defconfig (mips, gcc-10) — PASS, 0 errors, 0 warnings, 0 section mismatches

--------------------------------------------------------------------------------
colibri_pxa300_defconfig (arm, gcc-10) — PASS, 0 errors, 0 warnings, 0 section mismatches

--------------------------------------------------------------------------------
collie_defconfig (arm, gcc-10) — PASS, 0 errors, 0 warnings, 0 section mismatches

--------------------------------------------------------------------------------
corgi_defconfig (arm, gcc-10) — PASS, 0 errors, 0 warnings, 0 section mismatches

--------------------------------------------------------------------------------
cu1000-neo_defconfig (mips, gcc-10) — PASS, 0 errors, 0 warnings, 0 section mismatches

--------------------------------------------------------------------------------
cu1830-neo_defconfig (mips, gcc-10) — PASS, 0 errors, 0 warnings, 0 section mismatches

--------------------------------------------------------------------------------
davinci_all_defconfig (arm, gcc-10) — PASS, 0 errors, 0 warnings, 0 section mismatches

--------------------------------------------------------------------------------
db1xxx_defconfig (mips, gcc-10) — PASS, 0 errors, 0 warnings, 0 section mismatches

--------------------------------------------------------------------------------
decstation_defconfig (mips, gcc-10) — PASS, 0 errors, 1 warning, 0 section mismatches

Warnings:
kernel/rcu/tasks.h:707:13: warning: ‘show_rcu_tasks_rude_gp_kthread’ defined but not used [-Wunused-function]

--------------------------------------------------------------------------------
decstation_r4k_defconfig (mips, gcc-10) — PASS, 0 errors, 1 warning, 0 section mismatches

Warnings:
kernel/rcu/tasks.h:707:13: warning: ‘show_rcu_tasks_rude_gp_kthread’ defined but not used [-Wunused-function]

--------------------------------------------------------------------------------
defconfig (riscv, gcc-10) — PASS, 0 errors, 0 warnings, 0 section mismatches

--------------------------------------------------------------------------------
defconfig (arm64, gcc-10) — PASS, 0 errors, 0 warnings, 0 section mismatches

--------------------------------------------------------------------------------
defconfig+arm64-chromebook (arm64, gcc-10) — PASS, 0 errors, 0 warnings, 0 section mismatches

--------------------------------------------------------------------------------
defconfig+kselftest (arm64, gcc-10) — PASS, 0 errors, 0 warnings, 0 section mismatches

--------------------------------------------------------------------------------
dove_defconfig (arm, gcc-10) — PASS, 0 errors, 0 warnings, 0 section mismatches

--------------------------------------------------------------------------------
e55_defconfig (mips, gcc-10) — PASS, 0 errors, 0 warnings, 0 section mismatches

--------------------------------------------------------------------------------
ebsa110_defconfig (arm, gcc-10) — PASS, 0 errors, 0 warnings, 0 section mismatches

--------------------------------------------------------------------------------
ep93xx_defconfig (arm, gcc-10) — PASS, 0 errors, 0 warnings, 0 section mismatches

--------------------------------------------------------------------------------
eseries_pxa_defconfig (arm, gcc-10) — PASS, 0 errors, 0 warnings, 0 section mismatches

--------------------------------------------------------------------------------
exynos_defconfig (arm, gcc-10) — PASS, 0 errors, 0 warnings, 0 section mismatches

--------------------------------------------------------------------------------
ezx_defconfig (arm, gcc-10) — PASS, 0 errors, 0 warnings, 0 section mismatches

--------------------------------------------------------------------------------
fuloong2e_defconfig (mips, gcc-10) — PASS, 0 errors, 0 warnings, 0 section mismatches

--------------------------------------------------------------------------------
gemini_defconfig (arm, gcc-10) — PASS, 0 errors, 0 warnings, 0 section mismatches

--------------------------------------------------------------------------------
gpr_defconfig (mips, gcc-10) — PASS, 0 errors, 0 warnings, 0 section mismatches

--------------------------------------------------------------------------------
h3600_defconfig (arm, gcc-10) — PASS, 0 errors, 0 warnings, 0 section mismatches

--------------------------------------------------------------------------------
h5000_defconfig (arm, gcc-10) — PASS, 0 errors, 0 warnings, 0 section mismatches

--------------------------------------------------------------------------------
hackkit_defconfig (arm, gcc-10) — PASS, 0 errors, 0 warnings, 0 section mismatches

--------------------------------------------------------------------------------
haps_hs_defconfig (arc, gcc-10) — PASS, 0 errors, 0 warnings, 0 section mismatches

--------------------------------------------------------------------------------
haps_hs_smp_defconfig (arc, gcc-10) — PASS, 0 errors, 0 warnings, 0 section mismatches

--------------------------------------------------------------------------------
hisi_defconfig (arm, gcc-10) — PASS, 0 errors, 0 warnings, 0 section mismatches

--------------------------------------------------------------------------------
hsdk_defconfig (arc, gcc-10) — PASS, 0 errors, 0 warnings, 0 section mismatches

--------------------------------------------------------------------------------
imote2_defconfig (arm, gcc-10) — PASS, 0 errors, 0 warnings, 0 section mismatches

--------------------------------------------------------------------------------
imx_v4_v5_defconfig (arm, gcc-10) — PASS, 0 errors, 0 warnings, 0 section mismatches

--------------------------------------------------------------------------------
integrator_defconfig (arm, gcc-10) — PASS, 0 errors, 0 warnings, 0 section mismatches

--------------------------------------------------------------------------------
iop32x_defconfig (arm, gcc-10) — PASS, 0 errors, 0 warnings, 0 section mismatches

--------------------------------------------------------------------------------
ip28_defconfig (mips, gcc-10) — FAIL, 0 errors, 0 warnings, 0 section mismatches

--------------------------------------------------------------------------------
ixp4xx_defconfig (arm, gcc-10) — PASS, 0 errors, 0 warnings, 0 section mismatches

--------------------------------------------------------------------------------
jazz_defconfig (mips, gcc-10) — PASS, 0 errors, 0 warnings, 0 section mismatches

--------------------------------------------------------------------------------
jmr3927_defconfig (mips, gcc-10) — PASS, 0 errors, 0 warnings, 0 section mismatches

--------------------------------------------------------------------------------
jornada720_defconfig (arm, gcc-10) — PASS, 0 errors, 0 warnings, 0 section mismatches

--------------------------------------------------------------------------------
keystone_defconfig (arm, gcc-10) — PASS, 0 errors, 0 warnings, 0 section mismatches

--------------------------------------------------------------------------------
lart_defconfig (arm, gcc-10) — PASS, 0 errors, 0 warnings, 0 section mismatches

--------------------------------------------------------------------------------
lemote2f_defconfig (mips, gcc-10) — PASS, 0 errors, 1 warning, 0 section mismatches

Warnings:
net/mac80211/mlme.c:4349:1: warning: the frame size of 1040 bytes is larger than 1024 bytes [-Wframe-larger-than=]

--------------------------------------------------------------------------------
loongson1b_defconfig (mips, gcc-10) — PASS, 0 errors, 0 warnings, 0 section mismatches

--------------------------------------------------------------------------------
loongson1c_defconfig (mips, gcc-10) — PASS, 0 errors, 0 warnings, 0 section mismatches

--------------------------------------------------------------------------------
loongson3_defconfig (mips, gcc-10) — PASS, 0 errors, 0 warnings, 0 section mismatches

--------------------------------------------------------------------------------
lpc18xx_defconfig (arm, gcc-10) — PASS, 0 errors, 0 warnings, 0 section mismatches

--------------------------------------------------------------------------------
lpc32xx_defconfig (arm, gcc-10) — PASS, 0 errors, 0 warnings, 0 section mismatches

--------------------------------------------------------------------------------
lpd270_defconfig (arm, gcc-10) — PASS, 0 errors, 0 warnings, 0 section mismatches

--------------------------------------------------------------------------------
lubbock_defconfig (arm, gcc-10) — PASS, 0 errors, 0 warnings, 0 section mismatches

--------------------------------------------------------------------------------
magician_defconfig (arm, gcc-10) — PASS, 0 errors, 0 warnings, 0 section mismatches

--------------------------------------------------------------------------------
mainstone_defconfig (arm, gcc-10) — PASS, 0 errors, 0 warnings, 0 section mismatches

--------------------------------------------------------------------------------
malta_defconfig (mips, gcc-10) — PASS, 0 errors, 0 warnings, 0 section mismatches

--------------------------------------------------------------------------------
malta_kvm_defconfig (mips, gcc-10) — PASS, 0 errors, 0 warnings, 0 section mismatches

--------------------------------------------------------------------------------
malta_qemu_32r6_defconfig (mips, gcc-10) — PASS, 0 errors, 0 warnings, 0 section mismatches

--------------------------------------------------------------------------------
maltaaprp_defconfig (mips, gcc-10) — PASS, 0 errors, 0 warnings, 0 section mismatches

--------------------------------------------------------------------------------
maltasmvp_defconfig (mips, gcc-10) — PASS, 0 errors, 0 warnings, 0 section mismatches

--------------------------------------------------------------------------------
maltasmvp_eva_defconfig (mips, gcc-10) — PASS, 0 errors, 0 warnings, 0 section mismatches

--------------------------------------------------------------------------------
maltaup_defconfig (mips, gcc-10) — PASS, 0 errors, 0 warnings, 0 section mismatches

--------------------------------------------------------------------------------
maltaup_xpa_defconfig (mips, gcc-10) — PASS, 0 errors, 0 warnings, 0 section mismatches

--------------------------------------------------------------------------------
milbeaut_m10v_defconfig (arm, gcc-10) — PASS, 0 errors, 0 warnings, 0 section mismatches

--------------------------------------------------------------------------------
mini2440_defconfig (arm, gcc-10) — PASS, 0 errors, 0 warnings, 0 section mismatches

--------------------------------------------------------------------------------
moxart_defconfig (arm, gcc-10) — PASS, 0 errors, 0 warnings, 0 section mismatches

--------------------------------------------------------------------------------
mpc30x_defconfig (mips, gcc-10) — PASS, 0 errors, 0 warnings, 0 section mismatches

--------------------------------------------------------------------------------
mps2_defconfig (arm, gcc-10) — PASS, 0 errors, 0 warnings, 0 section mismatches

--------------------------------------------------------------------------------
mtx1_defconfig (mips, gcc-10) — PASS, 0 errors, 0 warnings, 0 section mismatches

--------------------------------------------------------------------------------
multi_v4t_defconfig (arm, gcc-10) — PASS, 0 errors, 0 warnings, 0 section mismatches

--------------------------------------------------------------------------------
multi_v5_defconfig (arm, gcc-10) — PASS, 0 errors, 0 warnings, 0 section mismatches

--------------------------------------------------------------------------------
multi_v7_defconfig (arm, gcc-10) — PASS, 0 errors, 0 warnings, 0 section mismatches

--------------------------------------------------------------------------------
multi_v7_defconfig+kselftest (arm, gcc-10) — PASS, 0 errors, 0 warnings, 0 section mismatches

--------------------------------------------------------------------------------
mvebu_v5_defconfig (arm, gcc-10) — PASS, 0 errors, 0 warnings, 0 section mismatches

--------------------------------------------------------------------------------
mxs_defconfig (arm, gcc-10) — PASS, 0 errors, 0 warnings, 0 section mismatches

--------------------------------------------------------------------------------
neponset_defconfig (arm, gcc-10) — PASS, 0 errors, 0 warnings, 0 section mismatches

--------------------------------------------------------------------------------
netwinder_defconfig (arm, gcc-10) — PASS, 0 errors, 0 warnings, 0 section mismatches

--------------------------------------------------------------------------------
nhk8815_defconfig (arm, gcc-10) — PASS, 0 errors, 0 warnings, 0 section mismatches

--------------------------------------------------------------------------------
nlm_xlp_defconfig (mips, gcc-10) — PASS, 0 errors, 0 warnings, 0 section mismatches

--------------------------------------------------------------------------------
nlm_xlr_defconfig (mips, gcc-10) — PASS, 0 errors, 0 warnings, 0 section mismatches

--------------------------------------------------------------------------------
nsimosci_hs_defconfig (arc, gcc-10) — PASS, 0 errors, 0 warnings, 0 section mismatches

--------------------------------------------------------------------------------
omap2plus_defconfig (arm, gcc-10) — PASS, 0 errors, 0 warnings, 0 section mismatches

--------------------------------------------------------------------------------
omega2p_defconfig (mips, gcc-10) — PASS, 0 errors, 0 warnings, 0 section mismatches

--------------------------------------------------------------------------------
orion5x_defconfig (arm, gcc-10) — PASS, 0 errors, 0 warnings, 0 section mismatches

--------------------------------------------------------------------------------
oxnas_v6_defconfig (arm, gcc-10) — PASS, 0 errors, 0 warnings, 0 section mismatches

--------------------------------------------------------------------------------
palmz72_defconfig (arm, gcc-10) — PASS, 0 errors, 0 warnings, 0 section mismatches

--------------------------------------------------------------------------------
pcm027_defconfig (arm, gcc-10) — PASS, 0 errors, 0 warnings, 0 section mismatches

--------------------------------------------------------------------------------
pleb_defconfig (arm, gcc-10) — PASS, 0 errors, 0 warnings, 0 section mismatches

--------------------------------------------------------------------------------
prima2_defconfig (arm, gcc-10) — PASS, 0 errors, 0 warnings, 0 section mismatches

--------------------------------------------------------------------------------
pxa168_defconfig (arm, gcc-10) — PASS, 0 errors, 0 warnings, 0 section mismatches

--------------------------------------------------------------------------------
pxa255-idp_defconfig (arm, gcc-10) — PASS, 0 errors, 0 warnings, 0 section mismatches

--------------------------------------------------------------------------------
pxa3xx_defconfig (arm, gcc-10) — PASS, 0 errors, 0 warnings, 0 section mismatches

--------------------------------------------------------------------------------
pxa910_defconfig (arm, gcc-10) — PASS, 0 errors, 0 warnings, 0 section mismatches

--------------------------------------------------------------------------------
pxa_defconfig (arm, gcc-10) — PASS, 0 errors, 0 warnings, 0 section mismatches

--------------------------------------------------------------------------------
qcom_defconfig (arm, gcc-10) — PASS, 0 errors, 0 warnings, 0 section mismatches

--------------------------------------------------------------------------------
qi_lb60_defconfig (mips, gcc-10) — PASS, 0 errors, 0 warnings, 0 section mismatches

--------------------------------------------------------------------------------
rb532_defconfig (mips, gcc-10) — PASS, 0 errors, 0 warnings, 0 section mismatches

--------------------------------------------------------------------------------
rbtx49xx_defconfig (mips, gcc-10) — PASS, 0 errors, 0 warnings, 0 section mismatches

--------------------------------------------------------------------------------
realview_defconfig (arm, gcc-10) — PASS, 0 errors, 0 warnings, 0 section mismatches

--------------------------------------------------------------------------------
rm200_defconfig (mips, gcc-10) — PASS, 0 errors, 1 warning, 0 section mismatches

Warnings:
drivers/block/paride/bpck.c:32: warning: "PC" redefined

--------------------------------------------------------------------------------
rpc_defconfig (arm, gcc-10) — FAIL, 4 errors, 0 warnings, 0 section mismatches

Errors:
arm-linux-gnueabihf-gcc: error: unrecognized -march target: armv3m
arm-linux-gnueabihf-gcc: error: missing argument to ‘-march=’
arm-linux-gnueabihf-gcc: error: unrecognized -march target: armv3m
arm-linux-gnueabihf-gcc: error: missing argument to ‘-march=’

--------------------------------------------------------------------------------
rs90_defconfig (mips, gcc-10) — PASS, 0 errors, 0 warnings, 0 section mismatches

--------------------------------------------------------------------------------
rt305x_defconfig (mips, gcc-10) — PASS, 0 errors, 0 warnings, 0 section mismatches

--------------------------------------------------------------------------------
rv32_defconfig (riscv, gcc-10) — PASS, 0 errors, 4 warnings, 0 section mismatches

Warnings:
<stdin>:830:2: warning: #warning syscall fstat64 not implemented [-Wcpp]
<stdin>:1127:2: warning: #warning syscall fstatat64 not implemented [-Wcpp]
<stdin>:830:2: warning: #warning syscall fstat64 not implemented [-Wcpp]
<stdin>:1127:2: warning: #warning syscall fstatat64 not implemented [-Wcpp]

--------------------------------------------------------------------------------
s3c2410_defconfig (arm, gcc-10) — PASS, 0 errors, 0 warnings, 0 section mismatches

--------------------------------------------------------------------------------
s3c6400_defconfig (arm, gcc-10) — PASS, 0 errors, 0 warnings, 0 section mismatches

--------------------------------------------------------------------------------
s5pv210_defconfig (arm, gcc-10) — PASS, 0 errors, 0 warnings, 0 section mismatches

--------------------------------------------------------------------------------
sama5_defconfig (arm, gcc-10) — PASS, 0 errors, 0 warnings, 0 section mismatches

--------------------------------------------------------------------------------
sb1250_swarm_defconfig (mips, gcc-10) — PASS, 0 errors, 0 warnings, 0 section mismatches

--------------------------------------------------------------------------------
shannon_defconfig (arm, gcc-10) — PASS, 0 errors, 0 warnings, 0 section mismatches

--------------------------------------------------------------------------------
shmobile_defconfig (arm, gcc-10) — PASS, 0 errors, 0 warnings, 0 section mismatches

--------------------------------------------------------------------------------
simpad_defconfig (arm, gcc-10) — PASS, 0 errors, 0 warnings, 0 section mismatches

--------------------------------------------------------------------------------
socfpga_defconfig (arm, gcc-10) — PASS, 0 errors, 0 warnings, 0 section mismatches

--------------------------------------------------------------------------------
spear13xx_defconfig (arm, gcc-10) — PASS, 0 errors, 0 warnings, 0 section mismatches

--------------------------------------------------------------------------------
spear3xx_defconfig (arm, gcc-10) — PASS, 0 errors, 0 warnings, 0 section mismatches

--------------------------------------------------------------------------------
spear6xx_defconfig (arm, gcc-10) — PASS, 0 errors, 0 warnings, 0 section mismatches

--------------------------------------------------------------------------------
stm32_defconfig (arm, gcc-10) — PASS, 0 errors, 0 warnings, 0 section mismatches

--------------------------------------------------------------------------------
tango4_defconfig (arm, gcc-10) — PASS, 0 errors, 0 warnings, 0 section mismatches

--------------------------------------------------------------------------------
tb0219_defconfig (mips, gcc-10) — PASS, 0 errors, 0 warnings, 0 section mismatches

--------------------------------------------------------------------------------
tb0226_defconfig (mips, gcc-10) — PASS, 0 errors, 0 warnings, 0 section mismatches

--------------------------------------------------------------------------------
tb0287_defconfig (mips, gcc-10) — PASS, 0 errors, 0 warnings, 0 section mismatches

--------------------------------------------------------------------------------
tct_hammer_defconfig (arm, gcc-10) — PASS, 0 errors, 0 warnings, 0 section mismatches

--------------------------------------------------------------------------------
tegra_defconfig (arm, gcc-10) — PASS, 0 errors, 0 warnings, 0 section mismatches

--------------------------------------------------------------------------------
tinyconfig (i386, gcc-10) — PASS, 0 errors, 0 warnings, 0 section mismatches

--------------------------------------------------------------------------------
tinyconfig (x86_64, gcc-10) — PASS, 0 errors, 0 warnings, 0 section mismatches

--------------------------------------------------------------------------------
tinyconfig (arc, gcc-10) — PASS, 0 errors, 0 warnings, 0 section mismatches

--------------------------------------------------------------------------------
trizeps4_defconfig (arm, gcc-10) — PASS, 0 errors, 0 warnings, 0 section mismatches

--------------------------------------------------------------------------------
u300_defconfig (arm, gcc-10) — PASS, 0 errors, 0 warnings, 0 section mismatches

--------------------------------------------------------------------------------
u8500_defconfig (arm, gcc-10) — PASS, 0 errors, 0 warnings, 0 section mismatches

--------------------------------------------------------------------------------
vdk_hs38_smp_defconfig (arc, gcc-10) — PASS, 0 errors, 0 warnings, 0 section mismatches

--------------------------------------------------------------------------------
versatile_defconfig (arm, gcc-10) — PASS, 0 errors, 0 warnings, 0 section mismatches

--------------------------------------------------------------------------------
vexpress_defconfig (arm, gcc-10) — PASS, 0 errors, 0 warnings, 0 section mismatches

--------------------------------------------------------------------------------
vf610m4_defconfig (arm, gcc-10) — PASS, 0 errors, 0 warnings, 0 section mismatches

--------------------------------------------------------------------------------
viper_defconfig (arm, gcc-10) — PASS, 0 errors, 0 warnings, 0 section mismatches

--------------------------------------------------------------------------------
vocore2_defconfig (mips, gcc-10) — PASS, 0 errors, 0 warnings, 0 section mismatches

--------------------------------------------------------------------------------
vt8500_v6_v7_defconfig (arm, gcc-10) — PASS, 0 errors, 0 warnings, 0 section mismatches

--------------------------------------------------------------------------------
workpad_defconfig (mips, gcc-10) — PASS, 0 errors, 0 warnings, 0 section mismatches

--------------------------------------------------------------------------------
x86_64_defconfig (x86_64, gcc-10) — PASS, 0 errors, 0 warnings, 0 section mismatches

--------------------------------------------------------------------------------
x86_64_defconfig+kselftest (x86_64, gcc-10) — PASS, 0 errors, 0 warnings, 0 section mismatches

--------------------------------------------------------------------------------
x86_64_defconfig+x86-chromebook (x86_64, gcc-10) — PASS, 0 errors, 0 warnings, 0 section mismatches

--------------------------------------------------------------------------------
x86_64_defconfig+x86-chromebook+kselftest (x86_64, gcc-10) — PASS, 0 errors, 0 warnings, 0 section mismatches

--------------------------------------------------------------------------------
xcep_defconfig (arm, gcc-10) — PASS, 0 errors, 0 warnings, 0 section mismatches

--------------------------------------------------------------------------------
zeus_defconfig (arm, gcc-10) — PASS, 0 errors, 0 warnings, 0 section mismatches

--------------------------------------------------------------------------------
zx_defconfig (arm, gcc-10) — PASS, 0 errors, 0 warnings, 0 section mismatches

---
For more info write to <info@...>


cip/linux-4.4.y-cip baseline: 75 runs, 8 regressions (v4.4.302-cip69-296-g52de9431d314) #kernelci

kernelci.org bot <bot@...>
 

cip/linux-4.4.y-cip baseline: 75 runs, 8 regressions (v4.4.302-cip69-296-g52de9431d314)

Regressions Summary
-------------------

platform | arch | lab | compiler | defconfig | regressions
----------------------+-------+--------------+----------+----------------------------+------------
qemu_arm64-virt-gicv2 | arm64 | lab-baylibre | gcc-10 | defconfig+arm64-chromebook | 1
qemu_arm64-virt-gicv2 | arm64 | lab-baylibre | gcc-10 | defconfig | 1
qemu_arm64-virt-gicv2 | arm64 | lab-broonie | gcc-10 | defconfig+arm64-chromebook | 1
qemu_arm64-virt-gicv2 | arm64 | lab-broonie | gcc-10 | defconfig | 1
qemu_arm64-virt-gicv3 | arm64 | lab-baylibre | gcc-10 | defconfig+arm64-chromebook | 1
qemu_arm64-virt-gicv3 | arm64 | lab-baylibre | gcc-10 | defconfig | 1
qemu_arm64-virt-gicv3 | arm64 | lab-broonie | gcc-10 | defconfig+arm64-chromebook | 1
qemu_arm64-virt-gicv3 | arm64 | lab-broonie | gcc-10 | defconfig | 1

Details: https://kernelci.org/test/job/cip/branch/linux-4.4.y-cip/kernel/v4.4.302-cip69-296-g52de9431d314/plan/baseline/

Test: baseline
Tree: cip
Branch: linux-4.4.y-cip
Describe: v4.4.302-cip69-296-g52de9431d314
URL: https://git.kernel.org/pub/scm/linux/kernel/git/cip/linux-cip.git
SHA: 52de9431d314a28c4aa66d8f81144c9958c11168


Test Regressions
----------------


platform | arch | lab | compiler | defconfig | regressions
----------------------+-------+--------------+----------+----------------------------+------------
qemu_arm64-virt-gicv2 | arm64 | lab-baylibre | gcc-10 | defconfig+arm64-chromebook | 1

Details: https://kernelci.org/test/plan/id/62853c3d805cf1fe3da39c04

Results: 0 PASS, 1 FAIL, 0 SKIP
Full config: defconfig+arm64-chromebook
Compiler: gcc-10 (aarch64-linux-gnu-gcc (Debian 10.2.1-6) 10.2.1 20210110)
Plain log: https://storage.kernelci.org//cip/linux-4.4.y-cip/v4.4.302-cip69-296-g52de9431d314/arm64/defconfig+arm64-chromebook/gcc-10/lab-baylibre/baseline-qemu_arm64-virt-gicv2.txt
HTML log: https://storage.kernelci.org//cip/linux-4.4.y-cip/v4.4.302-cip69-296-g52de9431d314/arm64/defconfig+arm64-chromebook/gcc-10/lab-baylibre/baseline-qemu_arm64-virt-gicv2.html
Rootfs: http://storage.kernelci.org/images/rootfs/buildroot/buildroot-baseline/20220513.0/arm64/rootfs.cpio.gz


* baseline.login: https://kernelci.org/test/case/id/62853c3d805cf1fe3da39c05
new failure (last pass: v4.4.302-cip69)



platform | arch | lab | compiler | defconfig | regressions
----------------------+-------+--------------+----------+----------------------------+------------
qemu_arm64-virt-gicv2 | arm64 | lab-baylibre | gcc-10 | defconfig | 1

Details: https://kernelci.org/test/plan/id/62853eb66497df3deca39be0

Results: 0 PASS, 1 FAIL, 0 SKIP
Full config: defconfig
Compiler: gcc-10 (aarch64-linux-gnu-gcc (Debian 10.2.1-6) 10.2.1 20210110)
Plain log: https://storage.kernelci.org//cip/linux-4.4.y-cip/v4.4.302-cip69-296-g52de9431d314/arm64/defconfig/gcc-10/lab-baylibre/baseline-qemu_arm64-virt-gicv2.txt
HTML log: https://storage.kernelci.org//cip/linux-4.4.y-cip/v4.4.302-cip69-296-g52de9431d314/arm64/defconfig/gcc-10/lab-baylibre/baseline-qemu_arm64-virt-gicv2.html
Rootfs: http://storage.kernelci.org/images/rootfs/buildroot/buildroot-baseline/20220513.0/arm64/rootfs.cpio.gz


* baseline.login: https://kernelci.org/test/case/id/62853eb66497df3deca39be1
new failure (last pass: v4.4.302-cip69)



platform | arch | lab | compiler | defconfig | regressions
----------------------+-------+--------------+----------+----------------------------+------------
qemu_arm64-virt-gicv2 | arm64 | lab-broonie | gcc-10 | defconfig+arm64-chromebook | 1

Details: https://kernelci.org/test/plan/id/62853ccf842964f72da39bd4

Results: 0 PASS, 1 FAIL, 0 SKIP
Full config: defconfig+arm64-chromebook
Compiler: gcc-10 (aarch64-linux-gnu-gcc (Debian 10.2.1-6) 10.2.1 20210110)
Plain log: https://storage.kernelci.org//cip/linux-4.4.y-cip/v4.4.302-cip69-296-g52de9431d314/arm64/defconfig+arm64-chromebook/gcc-10/lab-broonie/baseline-qemu_arm64-virt-gicv2.txt
HTML log: https://storage.kernelci.org//cip/linux-4.4.y-cip/v4.4.302-cip69-296-g52de9431d314/arm64/defconfig+arm64-chromebook/gcc-10/lab-broonie/baseline-qemu_arm64-virt-gicv2.html
Rootfs: http://storage.kernelci.org/images/rootfs/buildroot/buildroot-baseline/20220513.0/arm64/rootfs.cpio.gz


* baseline.login: https://kernelci.org/test/case/id/62853ccf842964f72da39bd5
new failure (last pass: v4.4.302-cip69)



platform | arch | lab | compiler | defconfig | regressions
----------------------+-------+--------------+----------+----------------------------+------------
qemu_arm64-virt-gicv2 | arm64 | lab-broonie | gcc-10 | defconfig | 1

Details: https://kernelci.org/test/plan/id/62853eeb908a673a02a39bf0

Results: 0 PASS, 1 FAIL, 0 SKIP
Full config: defconfig
Compiler: gcc-10 (aarch64-linux-gnu-gcc (Debian 10.2.1-6) 10.2.1 20210110)
Plain log: https://storage.kernelci.org//cip/linux-4.4.y-cip/v4.4.302-cip69-296-g52de9431d314/arm64/defconfig/gcc-10/lab-broonie/baseline-qemu_arm64-virt-gicv2.txt
HTML log: https://storage.kernelci.org//cip/linux-4.4.y-cip/v4.4.302-cip69-296-g52de9431d314/arm64/defconfig/gcc-10/lab-broonie/baseline-qemu_arm64-virt-gicv2.html
Rootfs: http://storage.kernelci.org/images/rootfs/buildroot/buildroot-baseline/20220513.0/arm64/rootfs.cpio.gz


* baseline.login: https://kernelci.org/test/case/id/62853eeb908a673a02a39bf1
new failure (last pass: v4.4.302-cip69)



platform | arch | lab | compiler | defconfig | regressions
----------------------+-------+--------------+----------+----------------------------+------------
qemu_arm64-virt-gicv3 | arm64 | lab-baylibre | gcc-10 | defconfig+arm64-chromebook | 1

Details: https://kernelci.org/test/plan/id/62853c38876f3d499ca39bfb

Results: 0 PASS, 1 FAIL, 0 SKIP
Full config: defconfig+arm64-chromebook
Compiler: gcc-10 (aarch64-linux-gnu-gcc (Debian 10.2.1-6) 10.2.1 20210110)
Plain log: https://storage.kernelci.org//cip/linux-4.4.y-cip/v4.4.302-cip69-296-g52de9431d314/arm64/defconfig+arm64-chromebook/gcc-10/lab-baylibre/baseline-qemu_arm64-virt-gicv3.txt
HTML log: https://storage.kernelci.org//cip/linux-4.4.y-cip/v4.4.302-cip69-296-g52de9431d314/arm64/defconfig+arm64-chromebook/gcc-10/lab-baylibre/baseline-qemu_arm64-virt-gicv3.html
Rootfs: http://storage.kernelci.org/images/rootfs/buildroot/buildroot-baseline/20220513.0/arm64/rootfs.cpio.gz


* baseline.login: https://kernelci.org/test/case/id/62853c38876f3d499ca39bfc
new failure (last pass: v4.4.302-cip69)



platform | arch | lab | compiler | defconfig | regressions
----------------------+-------+--------------+----------+----------------------------+------------
qemu_arm64-virt-gicv3 | arm64 | lab-baylibre | gcc-10 | defconfig | 1

Details: https://kernelci.org/test/plan/id/62853eba6497df3deca39be6

Results: 0 PASS, 1 FAIL, 0 SKIP
Full config: defconfig
Compiler: gcc-10 (aarch64-linux-gnu-gcc (Debian 10.2.1-6) 10.2.1 20210110)
Plain log: https://storage.kernelci.org//cip/linux-4.4.y-cip/v4.4.302-cip69-296-g52de9431d314/arm64/defconfig/gcc-10/lab-baylibre/baseline-qemu_arm64-virt-gicv3.txt
HTML log: https://storage.kernelci.org//cip/linux-4.4.y-cip/v4.4.302-cip69-296-g52de9431d314/arm64/defconfig/gcc-10/lab-baylibre/baseline-qemu_arm64-virt-gicv3.html
Rootfs: http://storage.kernelci.org/images/rootfs/buildroot/buildroot-baseline/20220513.0/arm64/rootfs.cpio.gz


* baseline.login: https://kernelci.org/test/case/id/62853eba6497df3deca39be7
new failure (last pass: v4.4.302-cip69)



platform | arch | lab | compiler | defconfig | regressions
----------------------+-------+--------------+----------+----------------------------+------------
qemu_arm64-virt-gicv3 | arm64 | lab-broonie | gcc-10 | defconfig+arm64-chromebook | 1

Details: https://kernelci.org/test/plan/id/62853c42d71282b190a39bd2

Results: 0 PASS, 1 FAIL, 0 SKIP
Full config: defconfig+arm64-chromebook
Compiler: gcc-10 (aarch64-linux-gnu-gcc (Debian 10.2.1-6) 10.2.1 20210110)
Plain log: https://storage.kernelci.org//cip/linux-4.4.y-cip/v4.4.302-cip69-296-g52de9431d314/arm64/defconfig+arm64-chromebook/gcc-10/lab-broonie/baseline-qemu_arm64-virt-gicv3.txt
HTML log: https://storage.kernelci.org//cip/linux-4.4.y-cip/v4.4.302-cip69-296-g52de9431d314/arm64/defconfig+arm64-chromebook/gcc-10/lab-broonie/baseline-qemu_arm64-virt-gicv3.html
Rootfs: http://storage.kernelci.org/images/rootfs/buildroot/buildroot-baseline/20220513.0/arm64/rootfs.cpio.gz


* baseline.login: https://kernelci.org/test/case/id/62853c42d71282b190a39bd3
new failure (last pass: v4.4.302-cip69)



platform | arch | lab | compiler | defconfig | regressions
----------------------+-------+--------------+----------+----------------------------+------------
qemu_arm64-virt-gicv3 | arm64 | lab-broonie | gcc-10 | defconfig | 1

Details: https://kernelci.org/test/plan/id/62853f3be73f0b8d95a39bec

Results: 0 PASS, 1 FAIL, 0 SKIP
Full config: defconfig
Compiler: gcc-10 (aarch64-linux-gnu-gcc (Debian 10.2.1-6) 10.2.1 20210110)
Plain log: https://storage.kernelci.org//cip/linux-4.4.y-cip/v4.4.302-cip69-296-g52de9431d314/arm64/defconfig/gcc-10/lab-broonie/baseline-qemu_arm64-virt-gicv3.txt
HTML log: https://storage.kernelci.org//cip/linux-4.4.y-cip/v4.4.302-cip69-296-g52de9431d314/arm64/defconfig/gcc-10/lab-broonie/baseline-qemu_arm64-virt-gicv3.html
Rootfs: http://storage.kernelci.org/images/rootfs/buildroot/buildroot-baseline/20220513.0/arm64/rootfs.cpio.gz


* baseline.login: https://kernelci.org/test/case/id/62853f3be73f0b8d95a39bed
new failure (last pass: v4.4.302-cip69)


cip-gitlab/ci/iwamatsu/linux-4.19.y-cip-rc ltp-timers: 7 runs, 1 regressions (v4.19.242-cip73-50-gd57bc44cb340) #kernelci

kernelci.org bot <bot@...>
 

cip-gitlab/ci/iwamatsu/linux-4.19.y-cip-rc ltp-timers: 7 runs, 1 regressions (v4.19.242-cip73-50-gd57bc44cb340)

Regressions Summary
-------------------

platform | arch | lab | compiler | defconfig | regressions
-----------------+-------+---------------+----------+----------------------------+------------
rk3399-gru-kevin | arm64 | lab-collabora | gcc-10 | defconfig+arm64-chromebook | 1

Details: https://kernelci.org/test/job/cip-gitlab/branch/ci%2Fiwamatsu%2Flinux-4.19.y-cip-rc/kernel/v4.19.242-cip73-50-gd57bc44cb340/plan/ltp-timers/

Test: ltp-timers
Tree: cip-gitlab
Branch: ci/iwamatsu/linux-4.19.y-cip-rc
Describe: v4.19.242-cip73-50-gd57bc44cb340
URL: https://gitlab.com/cip-project/cip-kernel/linux-cip.git
SHA: d57bc44cb3404e87a6fb3a587e605ae5d62017d9

Test suite revisions:
ltp-tests
URL: https://github.com/linux-test-project/ltp.git
SHA: 17e9ae697a340242c49188ace12a60cd3bc95a53


Test Regressions
----------------


platform | arch | lab | compiler | defconfig | regressions
-----------------+-------+---------------+----------+----------------------------+------------
rk3399-gru-kevin | arm64 | lab-collabora | gcc-10 | defconfig+arm64-chromebook | 1

Details: https://kernelci.org/test/plan/id/62853a0d98fe1ad890a39bf9

Results: 0 PASS, 1 FAIL, 0 SKIP
Full config: defconfig+arm64-chromebook
Compiler: gcc-10 (aarch64-linux-gnu-gcc (Debian 10.2.1-6) 10.2.1 20210110)
Plain log: https://storage.kernelci.org//cip-gitlab/ci-iwamatsu-linux-4.19.y-cip-rc/v4.19.242-cip73-50-gd57bc44cb340/arm64/defconfig+arm64-chromebook/gcc-10/lab-collabora/ltp-timers-rk3399-gru-kevin.txt
HTML log: https://storage.kernelci.org//cip-gitlab/ci-iwamatsu-linux-4.19.y-cip-rc/v4.19.242-cip73-50-gd57bc44cb340/arm64/defconfig+arm64-chromebook/gcc-10/lab-collabora/ltp-timers-rk3399-gru-kevin.html
Rootfs: http://storage.kernelci.org/images/rootfs/debian/bullseye-ltp/20220513.0/arm64/initrd.cpio.gz


* ltp-timers.login: https://kernelci.org/test/case/id/62853a0d98fe1ad890a39bfa
new failure (last pass: v4.19.239-cip72-68-g407458469172)

1741 - 1760 of 10158