Date   

Re: Doing 4.4-cip release

Pavel Machek
 

Hi!

linux-4.4.y-cip tree should be up-to-date with changes from 4.9.305 and older.

I believe it may be good time to do 4.4.x release; last release of 4.4.y-cip was at
Feb 14, and 4.9.306 contains speculation fixes that are rather intrusive... so it
may be good time to test that we did a good job on the easy changes.
I see.
BTW, linux-4.4.y-st tree, do you have any idea to have a git tag? When merging into cip tree,
I think the tags make it easier to manage. For example, create a tag the string contained in
localversion-st file.
Good idea. I pushed the tag, v4.4-st5 . (I plan to keep the tag in
sync with 4.9: 4.9.30X should correspond to v4.4-stX).

Best regards,
Pavel
--
DENX Software Engineering GmbH, Managing Director: Wolfgang Denk
HRB 165235 Munich, Office: Kirchenstr.5, D-82194 Groebenzell, Germany


Re: Doing 4.4-cip release

Nobuhiro Iwamatsu
 

Hi Pavel,

Thank for your work.

-----Original Message-----
From: Pavel Machek <pavel@...>
Sent: Monday, March 21, 2022 5:35 PM
To: iwamatsu nobuhiro(岩松 信洋 □SWC◯ACT)
<nobuhiro1.iwamatsu@...>; cip-dev@...
Subject: Doing 4.4-cip release

Hi!

linux-4.4.y-cip tree should be up-to-date with changes from 4.9.305 and older.

I believe it may be good time to do 4.4.x release; last release of 4.4.y-cip was at
Feb 14, and 4.9.306 contains speculation fixes that are rather intrusive... so it
may be good time to test that we did a good job on the easy changes.
I see.
BTW, linux-4.4.y-st tree, do you have any idea to have a git tag? When merging into cip tree,
I think the tags make it easier to manage. For example, create a tag the string contained in
localversion-st file.


We do not have 4.9-rt release to work with, so doing 4.4-rt is not easy at the
moment, and it may be good to do non-rt release, first, anyway.
OK, I will prepare for the release.

Best regards,
Nobuhiro


CIP IRC weekly meeting today on libera.chat

Jan Kiszka
 

Hi all,

Kindly be reminded to attend the weekly meeting through IRC to discuss
technical topics with CIP kernel today. Our channel is the following:

irc:irc.libera.chat:6667/cip

The IRC meeting is scheduled to UTC (GMT) 13:00:

https://www.timeanddate.com/worldclock/meetingdetails.html?year=2022&month=3&day=24&hour=13&min=0&sec=0&p1=224&p2=179&p3=136&p4=37&p5=241&p6=248

USWest USEast UK DE TW JP
06:00 09:00 13:00 14:00 21:00 22:00

Last meeting minutes:
https://ircbot.wl.linuxfoundation.org/meetings/cip/2022/03/cip.2022-03-17-13.00.log.html

* Action items
1. Resolve/filter irrelevant failures of KernelCI for 4.4-cip - patersonc & alicefm
* Kernel maintenance updates
* Kernel testing
* AOB

Jan


New CVE entries this week

Masami Ichikawa
 

Hi !

It's this week's CVE report.

This week reported 8 new CVEs and 2 updated CVEs.

* New CVEs

CVE-2022-0995: ouf of bounds writes in watch_queue event notification subsystem

CVSS v3 score is not provided

A OOB bug was found in watch_queue event notification subsystem. This
bug may cause a local user to gain privileges access or cause DoS.
This issue was introduced by c73be61 ("pipe: Add general notification
queue support") that was merged in 5.8-rc1.

Fixed status

mainline: [c993ee0f9f81caf5767a50d1faeba39a0dc82af2,
db8facfc9fafacefe8a835416a6b77c838088f8b,
c1853fbadcba1497f4907971e7107888e0714c81,
96a4d8912b28451cd62825fd7caa0e66e091d938,
a66bd7575b5f449ee0ba20cfd21c3bc5b04ef361,
3b4c0371928c17af03e8397ac842346624017ce6,
7ea1a0124b6da246b5bc8c66cddaafd36acf3ecb,
2ed147f015af2b48f41c6f0b6746aa9ea85c19f3,
4edc0760412b0c4ecefc7e02cb855b310b122825]
stable/5.10: [d729d4e99fb85f734805ff37dd79f38e7db21c0f,
2039900aadba14f438b04d262721ffebc4d33547,
e2b52ca4988e12ad75aeece53c4f0af849f0d9dc,
880acbb718e15e46d37fcde75fa52d5cb4336dca,
06ab8444392acdbffb57869d6220fb6654a8c95e,
ec03510e0a7784c4fb5c4b3297878a72cca834d5,
24d268130e3cbbef0f9ebb1f350e4c6fcdfffb65,
648895da69ced90ca770fd941c3d9479a9d72c16]

CVE-2022-0998: vdpa: clean up get_config_size ret value handling

CVSS v3 score is not provided

An integer overflow bug was found in Vhost driver for vDPA-based backend.
It introduced by 3ed21c1 ("vdpa: check that offsets are within
bounds") that merged in 5.16-rc6.
The commit was backported to 5.10 so 5.10 is affected by this bug.
This driver was introduced in 5.7-rc1.

It looks no CIP member enabled CONFIG_VHOST_VDPA.

Fixed status

mainline: [3ed21c1451a14d139e1ceb18f2fa70865ce3195a]
stable/5.10: [51f6302f81d243772047a74ffeceddfb11c964d5]
stable/5.15: [b08b3bfcc720686cd73888ab20111acd9cbfcb19]

CVE-2022-1011: fuse: fix pipe buffer lifetime for direct_io

CVSS v3 score is not provided

An UAF bug was found in FUSE filesystem. An local attacker can read
any data from filesystem.

It was introduced by commit c302162 ("fuse: support splice() reading
from fuse device") that was merged in 2.6.35-rc1.
The commit 0c4bcfd was failed to apply to 4.9, 4.14, and 4.19 as of 2022/03/18.

Fixed status

mainline: [0c4bcfdecb1ac0967619ee7ff44871d93c08c909]
stable/5.10: [ab5595b45f732212b3b1974041b43a257153edb7]
stable/5.15: [ca62747b38f59d4e75967ebf63c992de8852ca1b]
stable/5.16: [58a9bdff32fde29137731e574b17c42592875fd0]
stable/5.4: [a9174077febfb1608ec3361622bf5f91e2668d7f]

CVE-2021-45868: UAF bug in fs/quota/quota_tree.c

CVSS v3 score is not provided

UAF bug was found in remove_tree() and find_tree_dqentry() in
fs/quota/quota_tree.c.
The mainline and all stable kernels, includes 4.4, were fixed.

Fixed status

mainline: [9bf3d20331295b1ecb81f4ed9ef358c51699a050]
stable/4.14: [1d0606dc3e27e6c281a2684cb8bdf47134051114]
stable/4.19: [e5222c87dc441dcc8a66e93cb3fd34dfff03d3ec]
stable/4.4: [7a40f3e53f5de1d6876df8a9e8025b50616b8818]
stable/4.9: [f7dd331a896700728492e02c20a69e53221cd7a4]
stable/5.10: [ceeb0a8a8716a1c72af3fa4d4f98c3aced32b037]
stable/5.15: [332db0909293f3f4d853ee2ea695272c75082d87]
stable/5.4: [10b808307d37d09b132fc086002bc1aa9910d315]


CVE-2022-0854: swiotlb information leak with DMA_FROM_DEVICE

CVSS v3 score is not provided

A memory leak bug was found in DMA subsystem that cause local user may
be able to read kernel memory.

Commit aa6f8dc fixes ddbd89d. commit ddbd89d was marged in 5.17-rc6.
Commit ddbd89d describes commit a45b599 ("scsi: sg: allocate with
__GFP_ZERO in sg_build_indirect()") in the bug flaw steps. The commit
a45b599 was backported to stable kernels(includes 4.4.y). So it seems
as if stable kernels are affected by this issue.
Patches were failed to apply to 4.9, 4.19, 5.4, and 5.10. Also,
kernel/dma/swiotlb.c and related files were moved from lib/ since
4.18-rc2 by commit cf65a0f ("dma-mapping: move all DMA mapping code to
kernel/dma")

Fixed status

mainline: [ddbd89deb7d32b1fbb879f48d68fda1a8ac58e8e,
aa6f8dcbab473f3a3c7454b74caa46d36cdc5d13]
stable/5.15: [7403f4118ab94be837ab9d770507537a8057bc63,
2c1f97af38be151527380796d31d3c9adb054bf9]
stable/5.16: [270475d6d2410ec66e971bf181afe1958dad565e,
62b27d925655999350d0ea775a025919fd88d27f]

CVE-2022-0494: block-map: add __GFP_ZERO flag for alloc_page in
function bio_copy_kern

CVSS v3 score is not provided

A kernel information leak bug was found in bio_copy_kern(). An local
attacker send SCSI_IOCTL_SEND_COMMAND command via scsi_ioctl(), there
is a path to return uninitialized buffer to user which cause kernel
information leak.

The commit ce288e0 ("block: remove BLK_BOUNCE_ISA support") that was
marged in 5.13-rc1, changed page allocation strategy in
bio_copy_kern().

- page = alloc_page(q->bounce_gfp | gfp_mask);
+ page = alloc_page(GFP_NOIO | gfp_mask);

Also, bio_copy_kern() was moved from block/bio.c to /block/blk-map.c
by commit 130879f ("block: move bio_map_* to blk-map.c") which was
merged in 5.7-rc1. so, applying patch to before 5.13 kernels will be
fail.

Its looks like earlier than 5.13 kernels may be affected by this issue.

Fixed status

mainline: [cc8f7fe1f5eab010191aa4570f27641876fa1267]
stable/5.15: [a1ba98731518b811ff90009505c1aebf6e400bc2]
stable/5.16: [f8c61361a4f52c2a186269982587facc852dba62]

CVE-2022-0886, CVE-2022-27666: esp: Fix possible buffer overflow in
ESP transformation

CVSS v3 score is not provided

According to the
https://cve.mitre.org/cgi-bin/cvename.cgi?name=CVE-2022-0886,
CVE-2022-0886 is duplicated of CVE-2022-27666.

A buffer overflow bug was found in net/ipv4/esp4.c and
net/ipv6/esp6.c. A local attacker may be able to gain privileges by
this bug.

This issue was introduced by commit cac2661 ("esp4: Avoid skb_cow_data
whenever possible") and 03e2a30 ("esp6: Avoid skb_cow_data whenever
possible") these commits were merged in 4.11-rc1.

Applying patch to 4.14, 4.19, and 5.4 were failed.
4.14: https://lore.kernel.org/stable/16472498745560@kroah.com/
4.19: https://lore.kernel.org/stable/164724987424249@kroah.com/
5.4: https://lore.kernel.org/stable/16472498744220@kroah.com/

Fixed status

mainline: [ebe48d368e97d007bfeb76fcb065d6cfc4c96645]
stable/5.10: [9248694dac20eda06e22d8503364dc9d03df4e2f]
stable/5.15: [4aaabbffc3b0658ce80eebdde9bafa20a3f932e0]
stable/5.16: [9afe83f62aac348db1facb28bfc106109a06e44d]

CVE-2022-1043: io_uring: fix xa_alloc_cycle() error return value check

CVSS v3 score is not provided

A flaw was found in the Linux kernels io_uring implementation where an
attacker with a local account can corrupt system memory, crash the
system or escalate privileges.

This issue is affected to 5.6 to 5.14-rc6.

Fixed status

mainline: [a30f895ad3239f45012e860d4f94c1a388b36d14]
stable/5.10: [695ab28a7fa107d0350ab19eba8ec89fac45a95d]

* Updated CVEs

CVE-2021-3772: Invalid chunks may be used to remotely remove existing
associations

There was two updates this week.

- stable/4.14 was fixed.
- Added commit 6056abc to stable/5.10.

Fixed status

mainline: [4f7019c7eb33967eb87766e0e4602b5576873680,
eae5783908042a762c24e1bd11876edb91d314b1,
438b95a7c98f77d51cbf4db021f41b602d750a3f,
a64b341b8695e1c744dd972b39868371b4f68f83,
aa0f697e45286a6b5f0ceca9418acf54b9099d99,
ef16b1734f0a176277b7bb9c71a6d977a6ef3998,
9d02831e517aa36ee6bdb453a0eb47bd49923fe3]
stable/4.14: [82ad781d98040b4a5eea4eeb9a5acdd200a420c6,
878cc8e47413d6c35995187992039b1a664ea4f6,
8a7952ec41de8f855f0cddb552cf3f5340a80482,
9f22d1fed3bb7b8d4e79b24b76962f1e39cce660,
202d5cd14f2e707259d45a3db05a9097725ed9fb,
32ceffec2a9a23346d33c0b48f4a7269ede2480d,
a9ded117c98b0aa20e20cb82943ba5f0c34c8881]
stable/4.19: [1f52dfacca7bb315d89f5ece5660b0337809798e,
86044244fc6f9eaec0070cb668e0d500de22dbba,
aa0f697e45286a6b5f0ceca9418acf54b9099d99,
ef16b1734f0a176277b7bb9c71a6d977a6ef3998,
9d02831e517aa36ee6bdb453a0eb47bd49923fe3]
stable/4.4: [629d2823abf957bcbcba32154f1f6fd49bdb850c,
c0b5302e3a74997b57985b561e776269d1951ac7]
stable/4.9: [42ce7a69f8140783bab908dc29a93c0bcda315d5,
16d0bfb045abf587c72d46dfea56c20c4aeda927]
stable/5.10: [a7112b8eeb14b3db21bc96abc79ca7525d77e129,
c2442f721972ea7c317fbfd55c902616b3151ad5,
14c1e02b11c2233343573aff90766ef8472f27e7,
dad2486414b5c81697aa5a24383fbb65fad13cae,
8c50693d25e4ab6873b32bc3cea23b382a94d05f,
ad111d4435d85fd3eeb2c09692030d89f8862401,
6056abc99b58fe55033577f3ad6e28d001a27641]
stable/5.14: [332933f9ae0a17f6e362ec0f35ed51e7bc8e76d6,
6277d424ead2702798e8b981fb6f51b8ec2304ec,
7975f42f10380ff9743a7ee94ef3cb81f1a8275d,
44ef3ecbc24a532fde6a8c7b87b3e55d4ad1c1d1,
dd82b3a345abf6fc325e748469d9d7f477a0b718,
1c255b5f68f4dac3f1f0f24741575aac2325470a,
0717c71deae69aa3511492c302dd44a2f3722184]
stable/5.4: [5953ee99bab134d74c805a00eaa20fed33f54255,
5fe74d5e4d58262e4adde277ef773032c57e873d,
d6470c2200253da67a439aa18c9ce32a127c5a61,
0aa322b5fe70204d3d7f9d1d4cd265fdff2e5a1f,
df527764072c5fb7ede93a41cc8f3acbf41dde8c,
0f5b4c57dc8573bdb9926b17748065ac2104b1d1]

CVE-2022-23960: Arm cpus BHI problem

Following patches were backported to stable/4.19 this week.

e8bfe29, 87eccd5, 51acb81, 266b1ef, ebcdd80, af484e6, f689fa5,
9e05662, 22fdfcf, 901c0a2, 91429ed, e18876b, 5b5ca26, 7b012f6,
a68912a, c20d551, 5f051d3, a44e7dd, ed5dec3

Fixed status

mainline: [9dd78194a3722fa6712192cdd4f7032d45112a9a,
04e91b7324760a377a725e218b5ee783826d30f5,
8d9d651ff2270a632e9dc497b142db31e8911315,
b9baf5c8c5c356757f4f9d8180b5e9d234065bc3,
25875aa71dfefd1959f07e626c4d285b88b27ac2,
4330e2c5c04c27bebf89d34e0bc14e6943413067,
1b33d4860deaecf1d8eec3061b7e7ed7ab0bae8d,
5bdf3437603d4af87f9c7f424b0c8aeed2420745,
d739da1694a0eaef0358a42b76904b611539b77b,
03aff3a77a58b5b52a77e00537a42090ad57b80b,
c091fb6ae059cda563b2a4d93fdbc548ef34e1d6,
6c5bf79b69f911560fbf82214c0971af6e58e682,
ed50da7764535f1e24432ded289974f2bf2b0c5a,
13d7a08352a83ef2252aeb464a5e08dfc06b5dfd,
c47e4d04ba0f1ea17353d85d45f611277507e07a,
a9c406e6462ff14956d690de7bbe5131a5677dc9,
aff65393fa1401e034656e349abd655cfe272de0,
ba2689234be92024e5635d30fe744f4853ad97db,
b28a8eebe81c186fdb1a0078263b30576c8e1f42,
bd09128d16fac3c34b80bd6a29088ac632e8ce09,
dee435be76f4117410bbd90573a881fd33488f37,
558c303c9734af5a813739cd284879227f7297d2,
a5905d6af492ee6a4a2205f0d550b3f931b03d03,
228a26b912287934789023b4132ba76065d9491c,
58c9a5060cb7cd529d49c93954cdafe81c1d642a]
stable/4.19: [dc64af755099d1e51fd64e99fe3a59b75595814a,
45c25917ceb7a5377883ef4c3a675276fba8a268,
67e1f18a972be16363c6e88d7b29cde880774164,
99e14db3b711c27f93079ba9d7f2fff169916d5f,
29db7e4b67fccf5e1fe28ec89f2add90ce74d77b,
e8bfe29afc09ac77b347540a0f4c789e6530a436,
87eccd56c52fcdd6c55b048d789da5c9c2e51ed3,
51acb81130d1feee7fd043760b75f5377ab8d4f0,
266b1ef1368e06ac4c5a89eb9774ef2bbaa54e19,
ebcdd80d0016c7445e8395cec99b9ce266a26001,
af484e69b5e83095609d8b5c8abaf13a5460229e,
f689fa53bb944873f75fe1584f446cae1aabd2c1,
9e056623dfc538909ed2a914f70a66d68ec71ec3,
22fdfcf1c2cea8e6dc383d46cbbe59d476d24a96,
901c0a20aa94d09a9328899e2dd69a8d43a3a920,
91429ed04ebe9dbec88f97c6fd136b722bc3f3c5,
e18876b523d5f5fd8b8f34721f60a470caf20aa1,
5b5ca2608fbd6f250281b6a1d0d73613f250e6f1,
7b012f6597e55a2ea4c7efe94b5d9a792b6e5757,
a68912a3ae3413be5febcaa40e7e0ec1fd62adee,
c20d551744797000c4af993f7d59ef8c69732949,
5f051d32b03f08a0507ac1afd7b9c0a30c8e5d59,
a44e7ddb5822b943cd50c5ad6a2541fb445d58bd,
ed5dec3fae86f20db52930e1d9a7cc38403994cc]
stable/4.9: [b24d4041cfb6dab83f9edf40573375bd1365e619,
dfea9912129157ba3c5a9d060e58df17fb688e72,
964aafb29a07cb7cdea71ef41a75394e879f529c,
da3dfb69bbc3fdfeb3e5930fe28bcd689751a594,
48b1aa98e19d189703d518166ddb2520164b3164]
stable/5.10: [b7f1e73c4ddf2044530091e69114a5fc1a1229d0,
46deb224680bb33c8e87440a7b909d16e5a7d7c5,
29d9b56df1e18a8ff2e669b79e511163972a8b65,
3f9c958e3572b19b1cfb9d28eeb15be0a5d80193,
302754d023a06171113e8fb20c7b2a18ebf9088f,
dc5b630c0d532140e194997d350f587dbcc78bfb,
7048a21086fb16ec67287a25b62e88b0cd17c8c3,
192023e6baf7cce7fb76ff3a5c24c55968c774ff,
5242d6971e106be115d9dace9c1441f4a2e1cb25,
d93b25a6654812e0511b71a6d4a207f6b1ce5dfe,
bda89602814c69e6f027878209b0b9453133ada2,
5275fb5ea5f573ce1ecd2bf0bcd928abb916b43d,
e55025063276fcf7b07e9340c38d70b04aa8a7b9,
8c691e5308c531deede16bef4f2d933d5f859ce7,
73ee716a1f6356ca86d16d4ffc97fcfc7961d3ef,
26211252c1c104732a0fea6c37645f1b670587f5,
49379552969acee3237387cc258848437e127d98,
3f21b7e355237aa2f8196ad44c2b7456a739518d,
56cf5326bdf9c20de9a45e4a7a4c0ae16833e561,
1f63326a5211208e2c5868650e47f13a9072afde,
13a807a0a080383ceab6c40e53c0228108423e51,
e192c8baa69ac8a5585d61ac535aa1e5eb795e80,
38c26bdb3cc53f219d6ab75ac1a95436f393c60f,
551717cf3b58f11311d10f70eb027d4b275135de,
b65b87e718c33caa46d5246d8fbeda895aa9cf5b,
f3c12fc53e0a1fffbe102a9501c7bb6efdabbe99,
fc8070a9c5ad3e0ac343532df7d4d2d709b173a8,
86171569312b5870aaedc74b4b28d444c0f72105,
b19eaa004f2eeae94a4fcf5f0cadac35cc579a72,
7ae8127e412361025e7b4a0e6347ca9e8f3ed109,
dbcfa98539531bff0d7e4d6087741702dfa50f06,
162aa002ec1a78e91cf2f0b8e7450e2770b2941f,
97d8bdf33182494b7cb327ed555313d17d80c639]
stable/5.15: [f02cab2bed1a3493a230e54d83ff117bc59f480e,
878ad97f745ebc6b135d87b6901dbe93d07745d3,
2dca61693e6cb6d163e5ba2cf18f2c3270d7ec30,
576548846f1ee53a4d04fa5f91e6a088adbfe3f8,
842f2d498ee1e75fc9bf78555ee5b59c894c071b,
b7beeab84f02091124b176ba34c71a601762d1de,
44adac5908ff712e0fee34e3472f884c17af8025,
368a1fd8c4a600ed8ae605afa27904f359a57161,
479c9bb741bf6e1ac300d2f3c2797c7fbce117c0,
4a691bbf56a186f9df432b0bfd666dc2e82e4334,
e25a9dced2bdbace585d613444f2cf317b84cda5,
2e09754a03a7e54eae6017d94fb9c265217288f1,
be9c5526aad63ab0b13d72978206aec12ede9d76,
a40472d463f9ab6f971850989aa5a21f704b5cfd,
6895584a92eeaa0702afc47c9758b7fca6345fec,
517f988ee0500688ac23e011bc3bbbf502e76a23,
ffb8a34c0fd81fdcf677bc8e9af251ea526e8c49,
50e700a117669e072fb9e47ff3ea49e4a8cacf04,
cfd0c38125aa27a15617473d053897eb7967ab1c,
d7066114dcd6a295122c5942791025e16a33f89f,
8e55b9b0e76575e3755919820848b9ca53d82381,
4bbfd0c280254b273c564767021bb9b0f945148e,
fb2bb2ec137c3a8afbd91c949d9384d9e8a913c9,
8979720ac64c70af1395ce78e5c6ffb546b43e0d,
3317d21b84e91be72df14744040513a280b88946]
stable/5.16: [f5eb0f1dcde4b7c2b5ee920ae53bcecaaba03947,
0f0fd6ef76dee10aae861c69635c42b1c427e577,
21ceffd3628edfc775d33851cf56ea1d85c528fc,
9fd1d31810ccf6b4e4df8ccf2e68bbdcf528d186,
680e356c1be19a7663d8077be12e0ab048430ebd,
d1e3d6d26d9eab22548c3b7373ec12bbfecc765f,
346793c01582f62f4a5536c325a3dfc627ca543a,
46af6fc4f7a22ada597982ff01db34fb4bdba6a3,
7b63df956358d183c25178e970f6ed304cd0f659,
57e9a5fbd1f8b8ac5b7f849715fcdf5a32dda040,
62cfcf8d06ca7786e781e1b60f57b67f43448868,
5da0c4bbae492434b534ffd39aac5d5610190491,
dfb25997bdefca7a3cd69c1dea872ba52133d31f,
e0077b0a66f14998c0d18508bf945a40a0d3ebab,
984e7e3ebac334d7af0069a4d3636cf2338525df,
483fa5319f16b627e7873c1079e35ebbfb04cf45,
448a95af1b7ae205eb762c2c1fb35b290cc3032e,
d535ca624f6d439424aeeb0a3cc4a426cfd9a993,
b9c29587c533faaa0aefeaaf7a4a4ff834975ba4,
d4293ed32d390ce363d964a9216ce9ab0ff9d74c,
f0567fc3fb835499eda68f20e30ce16f9b83d774,
0b2bf1b37b5ebd90e69e30d8c2d6e1cd0c1f37b4,
e1e87704621efcf0310bd1543a8e6352156a43bd,
2df4d0aba0e673d37be14901e853d1d540b19bbd,
80d1978b8062cbad01cbea2aec2a5aac8f61c366]

Currently tracking CVEs

CVE-2021-31615: Unencrypted Bluetooth Low Energy baseband links in
Bluetooth Core Specifications 4.0 through 5.2

There is no fix information.

CVE-2020-26556: kernel: malleable commitment Bluetooth Mesh Provisioning

No fix information.

CVE-2020-26557: kernel: predictable Authvalue in Bluetooth Mesh
Provisioning Leads to MITM

No fix information.

CVE-2020-26559: kernel: Authvalue leak in Bluetooth Mesh Provisioning

No fix information.

CVE-2020-26560: kernel: impersonation attack in Bluetooth Mesh Provisioning

No fix information.

Regards,


--
Masami Ichikawa
Cybertrust Japan Co., Ltd.

Email :masami.ichikawa@...
:masami.ichikawa@...


cip-gitlab/ci/iwamatsu/linux-5.10.y-cip-rc ltp-timers: 4 runs, 4 regressions (v5.10.104-cip3-186-g758e0f22e236) #kernelci

kernelci.org bot <bot@...>
 

cip-gitlab/ci/iwamatsu/linux-5.10.y-cip-rc ltp-timers: 4 runs, 4 regressions (v5.10.104-cip3-186-g758e0f22e236)

Regressions Summary
-------------------

platform | arch | lab | compiler | defconfig | regressions
-------------------------+--------+---------------+----------+------------------------------+------------
hp-11A-G6-EE-grunt | x86_64 | lab-collabora | gcc-10 | x86_64_defcon...6-chromebook | 2
r8a774a1-hihope-rzg2m-ex | arm64 | lab-cip | gcc-10 | defconfig | 2

Details: https://kernelci.org/test/job/cip-gitlab/branch/ci%2Fiwamatsu%2Flinux-5.10.y-cip-rc/kernel/v5.10.104-cip3-186-g758e0f22e236/plan/ltp-timers/

Test: ltp-timers
Tree: cip-gitlab
Branch: ci/iwamatsu/linux-5.10.y-cip-rc
Describe: v5.10.104-cip3-186-g758e0f22e236
URL: https://gitlab.com/cip-project/cip-kernel/linux-cip.git
SHA: 758e0f22e2369c3d29d49c89c4ab585390c74a82

Test suite revisions:
ltp-tests
URL: https://github.com/linux-test-project/ltp.git
SHA: dc836ec4cd4e02e1346001f828c1f1988a8d7d54


Test Regressions
----------------


platform | arch | lab | compiler | defconfig | regressions
-------------------------+--------+---------------+----------+------------------------------+------------
hp-11A-G6-EE-grunt | x86_64 | lab-collabora | gcc-10 | x86_64_defcon...6-chromebook | 2

Details: https://kernelci.org/test/plan/id/623b2cd40856de6f02bd9193

Results: 32 PASS, 4 FAIL, 0 SKIP
Full config: x86_64_defconfig+x86-chromebook
Compiler: gcc-10 (gcc (Debian 10.2.1-6) 10.2.1 20210110)
Plain log: https://storage.kernelci.org//cip-gitlab/ci-iwamatsu-linux-5.10.y-cip-rc/v5.10.104-cip3-186-g758e0f22e236/x86_64/x86_64_defconfig+x86-chromebook/gcc-10/lab-collabora/ltp-timers-hp-11A-G6-EE-grunt.txt
HTML log: https://storage.kernelci.org//cip-gitlab/ci-iwamatsu-linux-5.10.y-cip-rc/v5.10.104-cip3-186-g758e0f22e236/x86_64/x86_64_defconfig+x86-chromebook/gcc-10/lab-collabora/ltp-timers-hp-11A-G6-EE-grunt.html
Rootfs: http://storage.kernelci.org/images/rootfs/debian/bullseye-ltp/20220311.1/amd64/initrd.cpio.gz


* ltp-timers.clock_settime: https://kernelci.org/test/case/id/623b2cd40856de6f02bd9198
failing since 14 days (last pass: v5.10.100-cip2-319-gcbff87047566, first fail: v5.10.100-cip2-425-g0a0d92194f39)

* ltp-timers.clock_settime: https://kernelci.org/test/case/id/623b2cd40856de6f02bd9198
failing since 14 days (last pass: v5.10.100-cip2-319-gcbff87047566, first fail: v5.10.100-cip2-425-g0a0d92194f39)



platform | arch | lab | compiler | defconfig | regressions
-------------------------+--------+---------------+----------+------------------------------+------------
r8a774a1-hihope-rzg2m-ex | arm64 | lab-cip | gcc-10 | defconfig | 2

Details: https://kernelci.org/test/plan/id/623b270bf7b1ca05b1bd9197

Results: 32 PASS, 4 FAIL, 0 SKIP
Full config: defconfig
Compiler: gcc-10 (aarch64-linux-gnu-gcc (Debian 10.2.1-6) 10.2.1 20210110)
Plain log: https://storage.kernelci.org//cip-gitlab/ci-iwamatsu-linux-5.10.y-cip-rc/v5.10.104-cip3-186-g758e0f22e236/arm64/defconfig/gcc-10/lab-cip/ltp-timers-r8a774a1-hihope-rzg2m-ex.txt
HTML log: https://storage.kernelci.org//cip-gitlab/ci-iwamatsu-linux-5.10.y-cip-rc/v5.10.104-cip3-186-g758e0f22e236/arm64/defconfig/gcc-10/lab-cip/ltp-timers-r8a774a1-hihope-rzg2m-ex.html
Rootfs: http://storage.kernelci.org/images/rootfs/debian/bullseye-ltp/20220311.1/arm64/initrd.cpio.gz


* ltp-timers.clock_settime: https://kernelci.org/test/case/id/623b270cf7b1ca05b1bd91a2
failing since 9 days (last pass: v5.10.100-cip2-425-g0a0d92194f39, first fail: v5.10.100-cip2-484-gede5006fb276)

* ltp-timers.clock_settime: https://kernelci.org/test/case/id/623b270cf7b1ca05b1bd91a2
failing since 9 days (last pass: v5.10.100-cip2-425-g0a0d92194f39, first fail: v5.10.100-cip2-484-gede5006fb276)


cip-gitlab/ci/iwamatsu/linux-5.10.y-cip-rc ltp-pty: 3 runs, 3 regressions (v5.10.104-cip3-186-g758e0f22e236) #kernelci

kernelci.org bot <bot@...>
 

cip-gitlab/ci/iwamatsu/linux-5.10.y-cip-rc ltp-pty: 3 runs, 3 regressions (v5.10.104-cip3-186-g758e0f22e236)

Regressions Summary
-------------------

platform | arch | lab | compiler | defconfig | regressions
--------------------------+--------+---------------+----------+------------------------------+------------
asus-C433TA-AJ0005-rammus | x86_64 | lab-collabora | gcc-10 | x86_64_defcon...6-chromebook | 1
hp-11A-G6-EE-grunt | x86_64 | lab-collabora | gcc-10 | x86_64_defcon...6-chromebook | 1
r8a774a1-hihope-rzg2m-ex | arm64 | lab-cip | gcc-10 | defconfig | 1

Details: https://kernelci.org/test/job/cip-gitlab/branch/ci%2Fiwamatsu%2Flinux-5.10.y-cip-rc/kernel/v5.10.104-cip3-186-g758e0f22e236/plan/ltp-pty/

Test: ltp-pty
Tree: cip-gitlab
Branch: ci/iwamatsu/linux-5.10.y-cip-rc
Describe: v5.10.104-cip3-186-g758e0f22e236
URL: https://gitlab.com/cip-project/cip-kernel/linux-cip.git
SHA: 758e0f22e2369c3d29d49c89c4ab585390c74a82

Test suite revisions:
ltp-tests
URL: https://github.com/linux-test-project/ltp.git
SHA: dc836ec4cd4e02e1346001f828c1f1988a8d7d54


Test Regressions
----------------


platform | arch | lab | compiler | defconfig | regressions
--------------------------+--------+---------------+----------+------------------------------+------------
asus-C433TA-AJ0005-rammus | x86_64 | lab-collabora | gcc-10 | x86_64_defcon...6-chromebook | 1

Details: https://kernelci.org/test/plan/id/623b2155b579aec065bd9191

Results: 0 PASS, 1 FAIL, 0 SKIP
Full config: x86_64_defconfig+x86-chromebook
Compiler: gcc-10 (gcc (Debian 10.2.1-6) 10.2.1 20210110)
Plain log: https://storage.kernelci.org//cip-gitlab/ci-iwamatsu-linux-5.10.y-cip-rc/v5.10.104-cip3-186-g758e0f22e236/x86_64/x86_64_defconfig+x86-chromebook/gcc-10/lab-collabora/ltp-pty-asus-C433TA-AJ0005-rammus.txt
HTML log: https://storage.kernelci.org//cip-gitlab/ci-iwamatsu-linux-5.10.y-cip-rc/v5.10.104-cip3-186-g758e0f22e236/x86_64/x86_64_defconfig+x86-chromebook/gcc-10/lab-collabora/ltp-pty-asus-C433TA-AJ0005-rammus.html
Rootfs: http://storage.kernelci.org/images/rootfs/debian/bullseye-ltp/20220311.1/amd64/initrd.cpio.gz


* ltp-pty.login: https://kernelci.org/test/case/id/623b2155b579aec065bd9192
new failure (last pass: v5.10.104-cip3-132-g46c091c34fabb)



platform | arch | lab | compiler | defconfig | regressions
--------------------------+--------+---------------+----------+------------------------------+------------
hp-11A-G6-EE-grunt | x86_64 | lab-collabora | gcc-10 | x86_64_defcon...6-chromebook | 1

Details: https://kernelci.org/test/plan/id/623b2e14c4c6c4fe4dbd919f

Results: 0 PASS, 1 FAIL, 0 SKIP
Full config: x86_64_defconfig+x86-chromebook
Compiler: gcc-10 (gcc (Debian 10.2.1-6) 10.2.1 20210110)
Plain log: https://storage.kernelci.org//cip-gitlab/ci-iwamatsu-linux-5.10.y-cip-rc/v5.10.104-cip3-186-g758e0f22e236/x86_64/x86_64_defconfig+x86-chromebook/gcc-10/lab-collabora/ltp-pty-hp-11A-G6-EE-grunt.txt
HTML log: https://storage.kernelci.org//cip-gitlab/ci-iwamatsu-linux-5.10.y-cip-rc/v5.10.104-cip3-186-g758e0f22e236/x86_64/x86_64_defconfig+x86-chromebook/gcc-10/lab-collabora/ltp-pty-hp-11A-G6-EE-grunt.html
Rootfs: http://storage.kernelci.org/images/rootfs/debian/bullseye-ltp/20220311.1/amd64/initrd.cpio.gz


* ltp-pty.login: https://kernelci.org/test/case/id/623b2e14c4c6c4fe4dbd91a0
new failure (last pass: v5.10.104-cip3-132-g46c091c34fabb)



platform | arch | lab | compiler | defconfig | regressions
--------------------------+--------+---------------+----------+------------------------------+------------
r8a774a1-hihope-rzg2m-ex | arm64 | lab-cip | gcc-10 | defconfig | 1

Details: https://kernelci.org/test/plan/id/623b28bbf85ca07c09bd919d

Results: 0 PASS, 1 FAIL, 0 SKIP
Full config: defconfig
Compiler: gcc-10 (aarch64-linux-gnu-gcc (Debian 10.2.1-6) 10.2.1 20210110)
Plain log: https://storage.kernelci.org//cip-gitlab/ci-iwamatsu-linux-5.10.y-cip-rc/v5.10.104-cip3-186-g758e0f22e236/arm64/defconfig/gcc-10/lab-cip/ltp-pty-r8a774a1-hihope-rzg2m-ex.txt
HTML log: https://storage.kernelci.org//cip-gitlab/ci-iwamatsu-linux-5.10.y-cip-rc/v5.10.104-cip3-186-g758e0f22e236/arm64/defconfig/gcc-10/lab-cip/ltp-pty-r8a774a1-hihope-rzg2m-ex.html
Rootfs: http://storage.kernelci.org/images/rootfs/debian/bullseye-ltp/20220311.1/arm64/initrd.cpio.gz


* ltp-pty.login: https://kernelci.org/test/case/id/623b28bbf85ca07c09bd919e
failing since 1 day (last pass: v5.10.104-cip3-132-g46c091c34fabb, first fail: v5.10.104-cip3-155-g4f07dbd2df49e)


cip-gitlab/ci/iwamatsu/linux-5.10.y-cip-rc ltp-mm: 4 runs, 1 regressions (v5.10.104-cip3-186-g758e0f22e236) #kernelci

kernelci.org bot <bot@...>
 

cip-gitlab/ci/iwamatsu/linux-5.10.y-cip-rc ltp-mm: 4 runs, 1 regressions (v5.10.104-cip3-186-g758e0f22e236)

Regressions Summary
-------------------

platform | arch | lab | compiler | defconfig | regressions
--------------------------+--------+---------------+----------+------------------------------+------------
hp-x360-12b-n4000-octopus | x86_64 | lab-collabora | gcc-10 | x86_64_defcon...6-chromebook | 1

Details: https://kernelci.org/test/job/cip-gitlab/branch/ci%2Fiwamatsu%2Flinux-5.10.y-cip-rc/kernel/v5.10.104-cip3-186-g758e0f22e236/plan/ltp-mm/

Test: ltp-mm
Tree: cip-gitlab
Branch: ci/iwamatsu/linux-5.10.y-cip-rc
Describe: v5.10.104-cip3-186-g758e0f22e236
URL: https://gitlab.com/cip-project/cip-kernel/linux-cip.git
SHA: 758e0f22e2369c3d29d49c89c4ab585390c74a82

Test suite revisions:
ltp-tests
URL: https://github.com/linux-test-project/ltp.git
SHA: dc836ec4cd4e02e1346001f828c1f1988a8d7d54


Test Regressions
----------------


platform | arch | lab | compiler | defconfig | regressions
--------------------------+--------+---------------+----------+------------------------------+------------
hp-x360-12b-n4000-octopus | x86_64 | lab-collabora | gcc-10 | x86_64_defcon...6-chromebook | 1

Details: https://kernelci.org/test/plan/id/623b2e4d92f1a799e0bd91b2

Results: 0 PASS, 1 FAIL, 0 SKIP
Full config: x86_64_defconfig+x86-chromebook
Compiler: gcc-10 (gcc (Debian 10.2.1-6) 10.2.1 20210110)
Plain log: https://storage.kernelci.org//cip-gitlab/ci-iwamatsu-linux-5.10.y-cip-rc/v5.10.104-cip3-186-g758e0f22e236/x86_64/x86_64_defconfig+x86-chromebook/gcc-10/lab-collabora/ltp-mm-hp-x360-12b-n4000-octopus.txt
HTML log: https://storage.kernelci.org//cip-gitlab/ci-iwamatsu-linux-5.10.y-cip-rc/v5.10.104-cip3-186-g758e0f22e236/x86_64/x86_64_defconfig+x86-chromebook/gcc-10/lab-collabora/ltp-mm-hp-x360-12b-n4000-octopus.html
Rootfs: http://storage.kernelci.org/images/rootfs/debian/bullseye-ltp/20220311.1/amd64/initrd.cpio.gz


* ltp-mm.login: https://kernelci.org/test/case/id/623b2e4d92f1a799e0bd91b3
new failure (last pass: v5.10.104-cip3-132-g46c091c34fabb)


cip-gitlab/ci/iwamatsu/linux-5.10.y-cip-rc kselftest-seccomp: 5 runs, 2 regressions (v5.10.104-cip3-186-g758e0f22e236) #kernelci

kernelci.org bot <bot@...>
 

cip-gitlab/ci/iwamatsu/linux-5.10.y-cip-rc kselftest-seccomp: 5 runs, 2 regressions (v5.10.104-cip3-186-g758e0f22e236)

Regressions Summary
-------------------

platform | arch | lab | compiler | defconfig | regressions
--------------------------+--------+---------------+----------+------------------------------+------------
asus-C433TA-AJ0005-rammus | x86_64 | lab-collabora | gcc-10 | x86_64_defcon...ok+kselftest | 1
hp-11A-G6-EE-grunt | x86_64 | lab-collabora | gcc-10 | x86_64_defcon...ok+kselftest | 1

Details: https://kernelci.org/test/job/cip-gitlab/branch/ci%2Fiwamatsu%2Flinux-5.10.y-cip-rc/kernel/v5.10.104-cip3-186-g758e0f22e236/plan/kselftest-seccomp/

Test: kselftest-seccomp
Tree: cip-gitlab
Branch: ci/iwamatsu/linux-5.10.y-cip-rc
Describe: v5.10.104-cip3-186-g758e0f22e236
URL: https://gitlab.com/cip-project/cip-kernel/linux-cip.git
SHA: 758e0f22e2369c3d29d49c89c4ab585390c74a82


Test Regressions
----------------


platform | arch | lab | compiler | defconfig | regressions
--------------------------+--------+---------------+----------+------------------------------+------------
asus-C433TA-AJ0005-rammus | x86_64 | lab-collabora | gcc-10 | x86_64_defcon...ok+kselftest | 1

Details: https://kernelci.org/test/plan/id/623b1cafc04a3e7490bd91a6

Results: 83 PASS, 4 FAIL, 7 SKIP
Full config: x86_64_defconfig+x86-chromebook+kselftest
Compiler: gcc-10 (gcc (Debian 10.2.1-6) 10.2.1 20210110)
Plain log: https://storage.kernelci.org//cip-gitlab/ci-iwamatsu-linux-5.10.y-cip-rc/v5.10.104-cip3-186-g758e0f22e236/x86_64/x86_64_defconfig+x86-chromebook+kselftest/gcc-10/lab-collabora/kselftest-seccomp-asus-C433TA-AJ0005-rammus.txt
HTML log: https://storage.kernelci.org//cip-gitlab/ci-iwamatsu-linux-5.10.y-cip-rc/v5.10.104-cip3-186-g758e0f22e236/x86_64/x86_64_defconfig+x86-chromebook+kselftest/gcc-10/lab-collabora/kselftest-seccomp-asus-C433TA-AJ0005-rammus.html
Rootfs: http://storage.kernelci.org/images/rootfs/debian/bullseye-kselftest/20220311.1/amd64/initrd.cpio.gz


* kselftest-seccomp.seccomp_seccomp_bpf_TSYNC_siblings_fail_prctl: https://kernelci.org/test/case/id/623b1cafc04a3e7490bd91ad
failing since 19 days (last pass: v5.10.83-cip1-1540-g9fb82e7fedf9, first fail: v5.10.100-cip2-319-gcbff87047566)



platform | arch | lab | compiler | defconfig | regressions
--------------------------+--------+---------------+----------+------------------------------+------------
hp-11A-G6-EE-grunt | x86_64 | lab-collabora | gcc-10 | x86_64_defcon...ok+kselftest | 1

Details: https://kernelci.org/test/plan/id/623b296f3c59f14be0bd9184

Results: 83 PASS, 4 FAIL, 7 SKIP
Full config: x86_64_defconfig+x86-chromebook+kselftest
Compiler: gcc-10 (gcc (Debian 10.2.1-6) 10.2.1 20210110)
Plain log: https://storage.kernelci.org//cip-gitlab/ci-iwamatsu-linux-5.10.y-cip-rc/v5.10.104-cip3-186-g758e0f22e236/x86_64/x86_64_defconfig+x86-chromebook+kselftest/gcc-10/lab-collabora/kselftest-seccomp-hp-11A-G6-EE-grunt.txt
HTML log: https://storage.kernelci.org//cip-gitlab/ci-iwamatsu-linux-5.10.y-cip-rc/v5.10.104-cip3-186-g758e0f22e236/x86_64/x86_64_defconfig+x86-chromebook+kselftest/gcc-10/lab-collabora/kselftest-seccomp-hp-11A-G6-EE-grunt.html
Rootfs: http://storage.kernelci.org/images/rootfs/debian/bullseye-kselftest/20220311.1/amd64/initrd.cpio.gz


* kselftest-seccomp.seccomp_seccomp_bpf_TSYNC_siblings_fail_prctl: https://kernelci.org/test/case/id/623b296f3c59f14be0bd919e
failing since 19 days (last pass: v5.10.83-cip1-1540-g9fb82e7fedf9, first fail: v5.10.100-cip2-319-gcbff87047566)


cip-gitlab/ci/iwamatsu/linux-5.10.y-cip-rc kselftest-lkdtm: 5 runs, 2 regressions (v5.10.104-cip3-186-g758e0f22e236) #kernelci

kernelci.org bot <bot@...>
 

cip-gitlab/ci/iwamatsu/linux-5.10.y-cip-rc kselftest-lkdtm: 5 runs, 2 regressions (v5.10.104-cip3-186-g758e0f22e236)

Regressions Summary
-------------------

platform | arch | lab | compiler | defconfig | regressions
-------------------------+-------+---------+----------+------------------------------+------------
r8a774a1-hihope-rzg2m-ex | arm64 | lab-cip | gcc-10 | defconfig+kselftest | 1
r8a774a1-hihope-rzg2m-ex | arm64 | lab-cip | gcc-10 | defconfig+arm...ok+kselftest | 1

Details: https://kernelci.org/test/job/cip-gitlab/branch/ci%2Fiwamatsu%2Flinux-5.10.y-cip-rc/kernel/v5.10.104-cip3-186-g758e0f22e236/plan/kselftest-lkdtm/

Test: kselftest-lkdtm
Tree: cip-gitlab
Branch: ci/iwamatsu/linux-5.10.y-cip-rc
Describe: v5.10.104-cip3-186-g758e0f22e236
URL: https://gitlab.com/cip-project/cip-kernel/linux-cip.git
SHA: 758e0f22e2369c3d29d49c89c4ab585390c74a82


Test Regressions
----------------


platform | arch | lab | compiler | defconfig | regressions
-------------------------+-------+---------+----------+------------------------------+------------
r8a774a1-hihope-rzg2m-ex | arm64 | lab-cip | gcc-10 | defconfig+kselftest | 1

Details: https://kernelci.org/test/plan/id/623b235f6bdedadae6bd9192

Results: 0 PASS, 1 FAIL, 0 SKIP
Full config: defconfig+kselftest
Compiler: gcc-10 (aarch64-linux-gnu-gcc (Debian 10.2.1-6) 10.2.1 20210110)
Plain log: https://storage.kernelci.org//cip-gitlab/ci-iwamatsu-linux-5.10.y-cip-rc/v5.10.104-cip3-186-g758e0f22e236/arm64/defconfig+kselftest/gcc-10/lab-cip/kselftest-lkdtm-r8a774a1-hihope-rzg2m-ex.txt
HTML log: https://storage.kernelci.org//cip-gitlab/ci-iwamatsu-linux-5.10.y-cip-rc/v5.10.104-cip3-186-g758e0f22e236/arm64/defconfig+kselftest/gcc-10/lab-cip/kselftest-lkdtm-r8a774a1-hihope-rzg2m-ex.html
Rootfs: http://storage.kernelci.org/images/rootfs/debian/bullseye-kselftest/20220311.1/arm64/initrd.cpio.gz


* kselftest-lkdtm.login: https://kernelci.org/test/case/id/623b235f6bdedadae6bd9193
new failure (last pass: v5.10.104-cip3-155-g4f07dbd2df49e)



platform | arch | lab | compiler | defconfig | regressions
-------------------------+-------+---------+----------+------------------------------+------------
r8a774a1-hihope-rzg2m-ex | arm64 | lab-cip | gcc-10 | defconfig+arm...ok+kselftest | 1

Details: https://kernelci.org/test/plan/id/623b298d243c950906bd91e3

Results: 0 PASS, 1 FAIL, 0 SKIP
Full config: defconfig+arm64-chromebook+kselftest
Compiler: gcc-10 (aarch64-linux-gnu-gcc (Debian 10.2.1-6) 10.2.1 20210110)
Plain log: https://storage.kernelci.org//cip-gitlab/ci-iwamatsu-linux-5.10.y-cip-rc/v5.10.104-cip3-186-g758e0f22e236/arm64/defconfig+arm64-chromebook+kselftest/gcc-10/lab-cip/kselftest-lkdtm-r8a774a1-hihope-rzg2m-ex.txt
HTML log: https://storage.kernelci.org//cip-gitlab/ci-iwamatsu-linux-5.10.y-cip-rc/v5.10.104-cip3-186-g758e0f22e236/arm64/defconfig+arm64-chromebook+kselftest/gcc-10/lab-cip/kselftest-lkdtm-r8a774a1-hihope-rzg2m-ex.html
Rootfs: http://storage.kernelci.org/images/rootfs/debian/bullseye-kselftest/20220311.1/arm64/initrd.cpio.gz


* kselftest-lkdtm.login: https://kernelci.org/test/case/id/623b298d243c950906bd91e4
new failure (last pass: v5.10.104-cip3-155-g4f07dbd2df49e)


cip-gitlab/ci/iwamatsu/linux-5.10.y-cip-rc kselftest-lib: 7 runs, 1 regressions (v5.10.104-cip3-186-g758e0f22e236) #kernelci

kernelci.org bot <bot@...>
 

cip-gitlab/ci/iwamatsu/linux-5.10.y-cip-rc kselftest-lib: 7 runs, 1 regressions (v5.10.104-cip3-186-g758e0f22e236)

Regressions Summary
-------------------

platform | arch | lab | compiler | defconfig | regressions
-------------------------+-------+---------+----------+------------------------------+------------
r8a774a1-hihope-rzg2m-ex | arm64 | lab-cip | gcc-10 | defconfig+arm...ok+kselftest | 1

Details: https://kernelci.org/test/job/cip-gitlab/branch/ci%2Fiwamatsu%2Flinux-5.10.y-cip-rc/kernel/v5.10.104-cip3-186-g758e0f22e236/plan/kselftest-lib/

Test: kselftest-lib
Tree: cip-gitlab
Branch: ci/iwamatsu/linux-5.10.y-cip-rc
Describe: v5.10.104-cip3-186-g758e0f22e236
URL: https://gitlab.com/cip-project/cip-kernel/linux-cip.git
SHA: 758e0f22e2369c3d29d49c89c4ab585390c74a82


Test Regressions
----------------


platform | arch | lab | compiler | defconfig | regressions
-------------------------+-------+---------+----------+------------------------------+------------
r8a774a1-hihope-rzg2m-ex | arm64 | lab-cip | gcc-10 | defconfig+arm...ok+kselftest | 1

Details: https://kernelci.org/test/plan/id/623b2a53d5ec79adf4bd918c

Results: 0 PASS, 1 FAIL, 0 SKIP
Full config: defconfig+arm64-chromebook+kselftest
Compiler: gcc-10 (aarch64-linux-gnu-gcc (Debian 10.2.1-6) 10.2.1 20210110)
Plain log: https://storage.kernelci.org//cip-gitlab/ci-iwamatsu-linux-5.10.y-cip-rc/v5.10.104-cip3-186-g758e0f22e236/arm64/defconfig+arm64-chromebook+kselftest/gcc-10/lab-cip/kselftest-lib-r8a774a1-hihope-rzg2m-ex.txt
HTML log: https://storage.kernelci.org//cip-gitlab/ci-iwamatsu-linux-5.10.y-cip-rc/v5.10.104-cip3-186-g758e0f22e236/arm64/defconfig+arm64-chromebook+kselftest/gcc-10/lab-cip/kselftest-lib-r8a774a1-hihope-rzg2m-ex.html
Rootfs: http://storage.kernelci.org/images/rootfs/debian/bullseye-kselftest/20220311.1/arm64/initrd.cpio.gz


* kselftest-lib.login: https://kernelci.org/test/case/id/623b2a53d5ec79adf4bd918d
new failure (last pass: v5.10.104-cip3-155-g4f07dbd2df49e)


cip-gitlab/ci/iwamatsu/linux-5.10.y-cip-rc kselftest-filesystems: 5 runs, 1 regressions (v5.10.104-cip3-186-g758e0f22e236) #kernelci

kernelci.org bot <bot@...>
 

cip-gitlab/ci/iwamatsu/linux-5.10.y-cip-rc kselftest-filesystems: 5 runs, 1 regressions (v5.10.104-cip3-186-g758e0f22e236)

Regressions Summary
-------------------

platform | arch | lab | compiler | defconfig | regressions
-------------------------+-------+---------+----------+---------------------+------------
r8a774a1-hihope-rzg2m-ex | arm64 | lab-cip | gcc-10 | defconfig+kselftest | 1

Details: https://kernelci.org/test/job/cip-gitlab/branch/ci%2Fiwamatsu%2Flinux-5.10.y-cip-rc/kernel/v5.10.104-cip3-186-g758e0f22e236/plan/kselftest-filesystems/

Test: kselftest-filesystems
Tree: cip-gitlab
Branch: ci/iwamatsu/linux-5.10.y-cip-rc
Describe: v5.10.104-cip3-186-g758e0f22e236
URL: https://gitlab.com/cip-project/cip-kernel/linux-cip.git
SHA: 758e0f22e2369c3d29d49c89c4ab585390c74a82


Test Regressions
----------------


platform | arch | lab | compiler | defconfig | regressions
-------------------------+-------+---------+----------+---------------------+------------
r8a774a1-hihope-rzg2m-ex | arm64 | lab-cip | gcc-10 | defconfig+kselftest | 1

Details: https://kernelci.org/test/plan/id/623b239b23abf4fda9bd919c

Results: 0 PASS, 1 FAIL, 0 SKIP
Full config: defconfig+kselftest
Compiler: gcc-10 (aarch64-linux-gnu-gcc (Debian 10.2.1-6) 10.2.1 20210110)
Plain log: https://storage.kernelci.org//cip-gitlab/ci-iwamatsu-linux-5.10.y-cip-rc/v5.10.104-cip3-186-g758e0f22e236/arm64/defconfig+kselftest/gcc-10/lab-cip/kselftest-filesystems-r8a774a1-hihope-rzg2m-ex.txt
HTML log: https://storage.kernelci.org//cip-gitlab/ci-iwamatsu-linux-5.10.y-cip-rc/v5.10.104-cip3-186-g758e0f22e236/arm64/defconfig+kselftest/gcc-10/lab-cip/kselftest-filesystems-r8a774a1-hihope-rzg2m-ex.html
Rootfs: http://storage.kernelci.org/images/rootfs/debian/bullseye-kselftest/20220311.1/arm64/initrd.cpio.gz


* kselftest-filesystems.login: https://kernelci.org/test/case/id/623b239b23abf4fda9bd919d
new failure (last pass: v5.10.104-cip3-155-g4f07dbd2df49e)


cip-gitlab/ci/iwamatsu/linux-5.10.y-cip-rc baseline-nfs: 19 runs, 1 regressions (v5.10.104-cip3-186-g758e0f22e236) #kernelci

kernelci.org bot <bot@...>
 

cip-gitlab/ci/iwamatsu/linux-5.10.y-cip-rc baseline-nfs: 19 runs, 1 regressions (v5.10.104-cip3-186-g758e0f22e236)

Regressions Summary
-------------------

platform | arch | lab | compiler | defconfig | regressions
--------------------+-------+--------------+----------+-----------+------------
r8a77950-salvator-x | arm64 | lab-baylibre | gcc-10 | defconfig | 1

Details: https://kernelci.org/test/job/cip-gitlab/branch/ci%2Fiwamatsu%2Flinux-5.10.y-cip-rc/kernel/v5.10.104-cip3-186-g758e0f22e236/plan/baseline-nfs/

Test: baseline-nfs
Tree: cip-gitlab
Branch: ci/iwamatsu/linux-5.10.y-cip-rc
Describe: v5.10.104-cip3-186-g758e0f22e236
URL: https://gitlab.com/cip-project/cip-kernel/linux-cip.git
SHA: 758e0f22e2369c3d29d49c89c4ab585390c74a82


Test Regressions
----------------


platform | arch | lab | compiler | defconfig | regressions
--------------------+-------+--------------+----------+-----------+------------
r8a77950-salvator-x | arm64 | lab-baylibre | gcc-10 | defconfig | 1

Details: https://kernelci.org/test/plan/id/623b20ce65c3e036f2bd9189

Results: 0 PASS, 1 FAIL, 0 SKIP
Full config: defconfig
Compiler: gcc-10 (aarch64-linux-gnu-gcc (Debian 10.2.1-6) 10.2.1 20210110)
Plain log: https://storage.kernelci.org//cip-gitlab/ci-iwamatsu-linux-5.10.y-cip-rc/v5.10.104-cip3-186-g758e0f22e236/arm64/defconfig/gcc-10/lab-baylibre/baseline-nfs-r8a77950-salvator-x.txt
HTML log: https://storage.kernelci.org//cip-gitlab/ci-iwamatsu-linux-5.10.y-cip-rc/v5.10.104-cip3-186-g758e0f22e236/arm64/defconfig/gcc-10/lab-baylibre/baseline-nfs-r8a77950-salvator-x.html
Rootfs: http://storage.kernelci.org/images/rootfs/debian/bullseye/20220311.1/arm64/initrd.cpio.gz


* baseline-nfs.login: https://kernelci.org/test/case/id/623b20ce65c3e036f2bd918a
failing since 1 day (last pass: v5.10.104-cip3-132-g46c091c34fabb, first fail: v5.10.104-cip3-155-g4f07dbd2df49e)


cip-gitlab/ci/iwamatsu/linux-4.19.y-cip-rc ltp-timers: 4 runs, 6 regressions (v4.19.233-cip69-120-ga36ab9aceb93) #kernelci

kernelci.org bot <bot@...>
 

cip-gitlab/ci/iwamatsu/linux-4.19.y-cip-rc ltp-timers: 4 runs, 6 regressions (v4.19.233-cip69-120-ga36ab9aceb93)

Regressions Summary
-------------------

platform | arch | lab | compiler | defconfig | regressions
--------------------------+--------+---------------+----------+------------------------------+------------
asus-C433TA-AJ0005-rammus | x86_64 | lab-collabora | gcc-10 | x86_64_defcon...6-chromebook | 2
hp-11A-G6-EE-grunt | x86_64 | lab-collabora | gcc-10 | x86_64_defcon...6-chromebook | 2
r8a774a1-hihope-rzg2m-ex | arm64 | lab-cip | gcc-10 | defconfig | 2

Details: https://kernelci.org/test/job/cip-gitlab/branch/ci%2Fiwamatsu%2Flinux-4.19.y-cip-rc/kernel/v4.19.233-cip69-120-ga36ab9aceb93/plan/ltp-timers/

Test: ltp-timers
Tree: cip-gitlab
Branch: ci/iwamatsu/linux-4.19.y-cip-rc
Describe: v4.19.233-cip69-120-ga36ab9aceb93
URL: https://gitlab.com/cip-project/cip-kernel/linux-cip.git
SHA: a36ab9aceb937b317b1eb65a1405f5290fbdc6f8

Test suite revisions:
ltp-tests
URL: https://github.com/linux-test-project/ltp.git
SHA: dc836ec4cd4e02e1346001f828c1f1988a8d7d54


Test Regressions
----------------


platform | arch | lab | compiler | defconfig | regressions
--------------------------+--------+---------------+----------+------------------------------+------------
asus-C433TA-AJ0005-rammus | x86_64 | lab-collabora | gcc-10 | x86_64_defcon...6-chromebook | 2

Details: https://kernelci.org/test/plan/id/623b1ace4d274d4377bd91ab

Results: 32 PASS, 4 FAIL, 0 SKIP
Full config: x86_64_defconfig+x86-chromebook
Compiler: gcc-10 (gcc (Debian 10.2.1-6) 10.2.1 20210110)
Plain log: https://storage.kernelci.org//cip-gitlab/ci-iwamatsu-linux-4.19.y-cip-rc/v4.19.233-cip69-120-ga36ab9aceb93/x86_64/x86_64_defconfig+x86-chromebook/gcc-10/lab-collabora/ltp-timers-asus-C433TA-AJ0005-rammus.txt
HTML log: https://storage.kernelci.org//cip-gitlab/ci-iwamatsu-linux-4.19.y-cip-rc/v4.19.233-cip69-120-ga36ab9aceb93/x86_64/x86_64_defconfig+x86-chromebook/gcc-10/lab-collabora/ltp-timers-asus-C433TA-AJ0005-rammus.html
Rootfs: http://storage.kernelci.org/images/rootfs/debian/bullseye-ltp/20220311.1/amd64/initrd.cpio.gz


* ltp-timers.clock_settime: https://kernelci.org/test/case/id/623b1ace4d274d4377bd91b0
failing since 14 days (last pass: v4.19.231-cip68-36-g01a8d14a9290, first fail: v4.19.231-cip68-89-gd39fc5cc85ff)

* ltp-timers.clock_settime: https://kernelci.org/test/case/id/623b1ace4d274d4377bd91b0
failing since 14 days (last pass: v4.19.231-cip68-36-g01a8d14a9290, first fail: v4.19.231-cip68-89-gd39fc5cc85ff)



platform | arch | lab | compiler | defconfig | regressions
--------------------------+--------+---------------+----------+------------------------------+------------
hp-11A-G6-EE-grunt | x86_64 | lab-collabora | gcc-10 | x86_64_defcon...6-chromebook | 2

Details: https://kernelci.org/test/plan/id/623b1a74d223b7b06abd9198

Results: 32 PASS, 4 FAIL, 0 SKIP
Full config: x86_64_defconfig+x86-chromebook
Compiler: gcc-10 (gcc (Debian 10.2.1-6) 10.2.1 20210110)
Plain log: https://storage.kernelci.org//cip-gitlab/ci-iwamatsu-linux-4.19.y-cip-rc/v4.19.233-cip69-120-ga36ab9aceb93/x86_64/x86_64_defconfig+x86-chromebook/gcc-10/lab-collabora/ltp-timers-hp-11A-G6-EE-grunt.txt
HTML log: https://storage.kernelci.org//cip-gitlab/ci-iwamatsu-linux-4.19.y-cip-rc/v4.19.233-cip69-120-ga36ab9aceb93/x86_64/x86_64_defconfig+x86-chromebook/gcc-10/lab-collabora/ltp-timers-hp-11A-G6-EE-grunt.html
Rootfs: http://storage.kernelci.org/images/rootfs/debian/bullseye-ltp/20220311.1/amd64/initrd.cpio.gz


* ltp-timers.clock_settime: https://kernelci.org/test/case/id/623b1a74d223b7b06abd919d
failing since 6 days (last pass: v4.19.231-cip68-89-gd39fc5cc85ff, first fail: v4.19.233-cip69-62-g10346bfb0fd8)

* ltp-timers.clock_settime: https://kernelci.org/test/case/id/623b1a74d223b7b06abd919d
failing since 6 days (last pass: v4.19.231-cip68-89-gd39fc5cc85ff, first fail: v4.19.233-cip69-62-g10346bfb0fd8)



platform | arch | lab | compiler | defconfig | regressions
--------------------------+--------+---------------+----------+------------------------------+------------
r8a774a1-hihope-rzg2m-ex | arm64 | lab-cip | gcc-10 | defconfig | 2

Details: https://kernelci.org/test/plan/id/623b20dfb091167819bd919f

Results: 32 PASS, 4 FAIL, 0 SKIP
Full config: defconfig
Compiler: gcc-10 (aarch64-linux-gnu-gcc (Debian 10.2.1-6) 10.2.1 20210110)
Plain log: https://storage.kernelci.org//cip-gitlab/ci-iwamatsu-linux-4.19.y-cip-rc/v4.19.233-cip69-120-ga36ab9aceb93/arm64/defconfig/gcc-10/lab-cip/ltp-timers-r8a774a1-hihope-rzg2m-ex.txt
HTML log: https://storage.kernelci.org//cip-gitlab/ci-iwamatsu-linux-4.19.y-cip-rc/v4.19.233-cip69-120-ga36ab9aceb93/arm64/defconfig/gcc-10/lab-cip/ltp-timers-r8a774a1-hihope-rzg2m-ex.html
Rootfs: http://storage.kernelci.org/images/rootfs/debian/bullseye-ltp/20220311.1/arm64/initrd.cpio.gz


* ltp-timers.clock_settime: https://kernelci.org/test/case/id/623b20dfb091167819bd91aa
new failure (last pass: v4.19.233-cip69-62-g10346bfb0fd8)

* ltp-timers.clock_settime: https://kernelci.org/test/case/id/623b20dfb091167819bd91aa
new failure (last pass: v4.19.233-cip69-62-g10346bfb0fd8)


cip-gitlab/ci/iwamatsu/linux-4.19.y-cip-rc ltp-pty: 3 runs, 3 regressions (v4.19.233-cip69-120-ga36ab9aceb93) #kernelci

kernelci.org bot <bot@...>
 

cip-gitlab/ci/iwamatsu/linux-4.19.y-cip-rc ltp-pty: 3 runs, 3 regressions (v4.19.233-cip69-120-ga36ab9aceb93)

Regressions Summary
-------------------

platform | arch | lab | compiler | defconfig | regressions
--------------------------+--------+---------------+----------+------------------------------+------------
asus-C433TA-AJ0005-rammus | x86_64 | lab-collabora | gcc-10 | x86_64_defcon...6-chromebook | 1
hp-11A-G6-EE-grunt | x86_64 | lab-collabora | gcc-10 | x86_64_defcon...6-chromebook | 1
r8a774a1-hihope-rzg2m-ex | arm64 | lab-cip | gcc-10 | defconfig | 1

Details: https://kernelci.org/test/job/cip-gitlab/branch/ci%2Fiwamatsu%2Flinux-4.19.y-cip-rc/kernel/v4.19.233-cip69-120-ga36ab9aceb93/plan/ltp-pty/

Test: ltp-pty
Tree: cip-gitlab
Branch: ci/iwamatsu/linux-4.19.y-cip-rc
Describe: v4.19.233-cip69-120-ga36ab9aceb93
URL: https://gitlab.com/cip-project/cip-kernel/linux-cip.git
SHA: a36ab9aceb937b317b1eb65a1405f5290fbdc6f8

Test suite revisions:
ltp-tests
URL: https://github.com/linux-test-project/ltp.git
SHA: dc836ec4cd4e02e1346001f828c1f1988a8d7d54


Test Regressions
----------------


platform | arch | lab | compiler | defconfig | regressions
--------------------------+--------+---------------+----------+------------------------------+------------
asus-C433TA-AJ0005-rammus | x86_64 | lab-collabora | gcc-10 | x86_64_defcon...6-chromebook | 1

Details: https://kernelci.org/test/plan/id/623b1bd1fa6e4a4818bd9189

Results: 0 PASS, 1 FAIL, 0 SKIP
Full config: x86_64_defconfig+x86-chromebook
Compiler: gcc-10 (gcc (Debian 10.2.1-6) 10.2.1 20210110)
Plain log: https://storage.kernelci.org//cip-gitlab/ci-iwamatsu-linux-4.19.y-cip-rc/v4.19.233-cip69-120-ga36ab9aceb93/x86_64/x86_64_defconfig+x86-chromebook/gcc-10/lab-collabora/ltp-pty-asus-C433TA-AJ0005-rammus.txt
HTML log: https://storage.kernelci.org//cip-gitlab/ci-iwamatsu-linux-4.19.y-cip-rc/v4.19.233-cip69-120-ga36ab9aceb93/x86_64/x86_64_defconfig+x86-chromebook/gcc-10/lab-collabora/ltp-pty-asus-C433TA-AJ0005-rammus.html
Rootfs: http://storage.kernelci.org/images/rootfs/debian/bullseye-ltp/20220311.1/amd64/initrd.cpio.gz


* ltp-pty.login: https://kernelci.org/test/case/id/623b1bd1fa6e4a4818bd918a
new failure (last pass: v4.19.233-cip69-62-g10346bfb0fd8)



platform | arch | lab | compiler | defconfig | regressions
--------------------------+--------+---------------+----------+------------------------------+------------
hp-11A-G6-EE-grunt | x86_64 | lab-collabora | gcc-10 | x86_64_defcon...6-chromebook | 1

Details: https://kernelci.org/test/plan/id/623b1c5cde34ec6f94bd91ae

Results: 0 PASS, 1 FAIL, 0 SKIP
Full config: x86_64_defconfig+x86-chromebook
Compiler: gcc-10 (gcc (Debian 10.2.1-6) 10.2.1 20210110)
Plain log: https://storage.kernelci.org//cip-gitlab/ci-iwamatsu-linux-4.19.y-cip-rc/v4.19.233-cip69-120-ga36ab9aceb93/x86_64/x86_64_defconfig+x86-chromebook/gcc-10/lab-collabora/ltp-pty-hp-11A-G6-EE-grunt.txt
HTML log: https://storage.kernelci.org//cip-gitlab/ci-iwamatsu-linux-4.19.y-cip-rc/v4.19.233-cip69-120-ga36ab9aceb93/x86_64/x86_64_defconfig+x86-chromebook/gcc-10/lab-collabora/ltp-pty-hp-11A-G6-EE-grunt.html
Rootfs: http://storage.kernelci.org/images/rootfs/debian/bullseye-ltp/20220311.1/amd64/initrd.cpio.gz


* ltp-pty.login: https://kernelci.org/test/case/id/623b1c5cde34ec6f94bd91af
new failure (last pass: v4.19.233-cip69-62-g10346bfb0fd8)



platform | arch | lab | compiler | defconfig | regressions
--------------------------+--------+---------------+----------+------------------------------+------------
r8a774a1-hihope-rzg2m-ex | arm64 | lab-cip | gcc-10 | defconfig | 1

Details: https://kernelci.org/test/plan/id/623b2177293ff5cbcebd9183

Results: 0 PASS, 1 FAIL, 0 SKIP
Full config: defconfig
Compiler: gcc-10 (aarch64-linux-gnu-gcc (Debian 10.2.1-6) 10.2.1 20210110)
Plain log: https://storage.kernelci.org//cip-gitlab/ci-iwamatsu-linux-4.19.y-cip-rc/v4.19.233-cip69-120-ga36ab9aceb93/arm64/defconfig/gcc-10/lab-cip/ltp-pty-r8a774a1-hihope-rzg2m-ex.txt
HTML log: https://storage.kernelci.org//cip-gitlab/ci-iwamatsu-linux-4.19.y-cip-rc/v4.19.233-cip69-120-ga36ab9aceb93/arm64/defconfig/gcc-10/lab-cip/ltp-pty-r8a774a1-hihope-rzg2m-ex.html
Rootfs: http://storage.kernelci.org/images/rootfs/debian/bullseye-ltp/20220311.1/arm64/initrd.cpio.gz


* ltp-pty.login: https://kernelci.org/test/case/id/623b2177293ff5cbcebd9184
new failure (last pass: v4.19.233-cip69-62-g10346bfb0fd8)


cip-gitlab/ci/iwamatsu/linux-5.10.y-cip-rc build: 144 builds: 1 failed, 143 passed, 6 warnings (v5.10.104-cip3-186-g758e0f22e236) #kernelci

kernelci.org bot <bot@...>
 

cip-gitlab/ci/iwamatsu/linux-5.10.y-cip-rc build: 144 builds: 1 failed, 143 passed, 6 warnings (v5.10.104-cip3-186-g758e0f22e236)

Full Build Summary: https://kernelci.org/build/cip-gitlab/branch/ci%2Fiwamatsu%2Flinux-5.10.y-cip-rc/kernel/v5.10.104-cip3-186-g758e0f22e236/

Tree: cip-gitlab
Branch: ci/iwamatsu/linux-5.10.y-cip-rc
Git Describe: v5.10.104-cip3-186-g758e0f22e236
Git Commit: 758e0f22e2369c3d29d49c89c4ab585390c74a82
Git URL: https://gitlab.com/cip-project/cip-kernel/linux-cip.git
Built: 7 unique architectures

Build Failure Detected:

mips:
ip28_defconfig: (gcc-10) FAIL

Warnings Detected:

arc:

arm64:

arm:

i386:

mips:
32r2el_defconfig (gcc-10): 1 warning
decstation_64_defconfig (gcc-10): 1 warning
decstation_defconfig (gcc-10): 1 warning
decstation_r4k_defconfig (gcc-10): 1 warning
lemote2f_defconfig (gcc-10): 1 warning
rm200_defconfig (gcc-10): 1 warning

riscv:

x86_64:


Warnings summary:

3 kernel/rcu/tasks.h:707:13: warning: ‘show_rcu_tasks_rude_gp_kthread’ defined but not used [-Wunused-function]
1 net/mac80211/mlme.c:4343:1: warning: the frame size of 1040 bytes is larger than 1024 bytes [-Wframe-larger-than=]
1 drivers/block/paride/bpck.c:32: warning: "PC" redefined
1 WARNING: modpost: Symbol info of vmlinux is missing. Unresolved symbol check will be entirely skipped.

Section mismatches summary:

1 WARNING: modpost: vmlinux.o(.text+0xd040): Section mismatch in reference from the function __arm_ioremap_pfn_caller() to the function .meminit.text:memblock_is_map_memory()
1 WARNING: modpost: vmlinux.o(.text+0xce9c): Section mismatch in reference from the function __arm_ioremap_pfn_caller() to the function .meminit.text:memblock_is_map_memory()
1 WARNING: modpost: vmlinux.o(.text+0xcda4): Section mismatch in reference from the function __arm_ioremap_pfn_caller() to the function .meminit.text:memblock_is_map_memory()
1 WARNING: modpost: vmlinux.o(.text+0xcd38): Section mismatch in reference from the function __arm_ioremap_pfn_caller() to the function .meminit.text:memblock_is_map_memory()
1 WARNING: modpost: vmlinux.o(.text+0xcb84): Section mismatch in reference from the function __arm_ioremap_pfn_caller() to the function .meminit.text:memblock_is_map_memory()
1 WARNING: modpost: vmlinux.o(.text+0xcb74): Section mismatch in reference from the function __arm_ioremap_pfn_caller() to the function .meminit.text:memblock_is_map_memory()
1 WARNING: modpost: vmlinux.o(.text+0xcaa8): Section mismatch in reference from the function __arm_ioremap_pfn_caller() to the function .meminit.text:memblock_is_map_memory()
1 WARNING: modpost: vmlinux.o(.text+0x8054): Section mismatch in reference from the function __arm_ioremap_pfn_caller() to the function .meminit.text:memblock_is_map_memory()
1 WARNING: modpost: vmlinux.o(.text+0x7670): Section mismatch in reference from the function __arm_ioremap_pfn_caller() to the function .meminit.text:memblock_is_map_memory()

================================================================================

Detailed per-defconfig build reports:

--------------------------------------------------------------------------------
32r2el_defconfig (mips, gcc-10) — PASS, 0 errors, 1 warning, 0 section mismatches

Warnings:
WARNING: modpost: Symbol info of vmlinux is missing. Unresolved symbol check will be entirely skipped.

--------------------------------------------------------------------------------
allnoconfig (arc, gcc-10) — PASS, 0 errors, 0 warnings, 0 section mismatches

--------------------------------------------------------------------------------
allnoconfig (x86_64, gcc-10) — PASS, 0 errors, 0 warnings, 0 section mismatches

--------------------------------------------------------------------------------
ar7_defconfig (mips, gcc-10) — PASS, 0 errors, 0 warnings, 0 section mismatches

--------------------------------------------------------------------------------
aspeed_g4_defconfig (arm, gcc-10) — PASS, 0 errors, 0 warnings, 0 section mismatches

--------------------------------------------------------------------------------
aspeed_g5_defconfig (arm, gcc-10) — PASS, 0 errors, 0 warnings, 0 section mismatches

--------------------------------------------------------------------------------
at91_dt_defconfig (arm, gcc-10) — PASS, 0 errors, 0 warnings, 0 section mismatches

--------------------------------------------------------------------------------
ath25_defconfig (mips, gcc-10) — PASS, 0 errors, 0 warnings, 0 section mismatches

--------------------------------------------------------------------------------
ath79_defconfig (mips, gcc-10) — PASS, 0 errors, 0 warnings, 0 section mismatches

--------------------------------------------------------------------------------
axm55xx_defconfig (arm, gcc-10) — PASS, 0 errors, 0 warnings, 0 section mismatches

--------------------------------------------------------------------------------
axs103_defconfig (arc, gcc-10) — PASS, 0 errors, 0 warnings, 0 section mismatches

--------------------------------------------------------------------------------
badge4_defconfig (arm, gcc-10) — PASS, 0 errors, 0 warnings, 0 section mismatches

Section mismatches:
WARNING: modpost: vmlinux.o(.text+0xcd38): Section mismatch in reference from the function __arm_ioremap_pfn_caller() to the function .meminit.text:memblock_is_map_memory()

--------------------------------------------------------------------------------
bcm2835_defconfig (arm, gcc-10) — PASS, 0 errors, 0 warnings, 0 section mismatches

--------------------------------------------------------------------------------
bcm47xx_defconfig (mips, gcc-10) — PASS, 0 errors, 0 warnings, 0 section mismatches

--------------------------------------------------------------------------------
bcm63xx_defconfig (mips, gcc-10) — PASS, 0 errors, 0 warnings, 0 section mismatches

--------------------------------------------------------------------------------
bigsur_defconfig (mips, gcc-10) — PASS, 0 errors, 0 warnings, 0 section mismatches

--------------------------------------------------------------------------------
bmips_be_defconfig (mips, gcc-10) — PASS, 0 errors, 0 warnings, 0 section mismatches

--------------------------------------------------------------------------------
cerfcube_defconfig (arm, gcc-10) — PASS, 0 errors, 0 warnings, 0 section mismatches

Section mismatches:
WARNING: modpost: vmlinux.o(.text+0x7670): Section mismatch in reference from the function __arm_ioremap_pfn_caller() to the function .meminit.text:memblock_is_map_memory()

--------------------------------------------------------------------------------
ci20_defconfig (mips, gcc-10) — PASS, 0 errors, 0 warnings, 0 section mismatches

--------------------------------------------------------------------------------
cm_x300_defconfig (arm, gcc-10) — PASS, 0 errors, 0 warnings, 0 section mismatches

--------------------------------------------------------------------------------
cobalt_defconfig (mips, gcc-10) — PASS, 0 errors, 0 warnings, 0 section mismatches

--------------------------------------------------------------------------------
colibri_pxa270_defconfig (arm, gcc-10) — PASS, 0 errors, 0 warnings, 0 section mismatches

--------------------------------------------------------------------------------
colibri_pxa300_defconfig (arm, gcc-10) — PASS, 0 errors, 0 warnings, 0 section mismatches

--------------------------------------------------------------------------------
corgi_defconfig (arm, gcc-10) — PASS, 0 errors, 0 warnings, 0 section mismatches

--------------------------------------------------------------------------------
cu1000-neo_defconfig (mips, gcc-10) — PASS, 0 errors, 0 warnings, 0 section mismatches

--------------------------------------------------------------------------------
davinci_all_defconfig (arm, gcc-10) — PASS, 0 errors, 0 warnings, 0 section mismatches

--------------------------------------------------------------------------------
db1xxx_defconfig (mips, gcc-10) — PASS, 0 errors, 0 warnings, 0 section mismatches

--------------------------------------------------------------------------------
decstation_64_defconfig (mips, gcc-10) — PASS, 0 errors, 1 warning, 0 section mismatches

Warnings:
kernel/rcu/tasks.h:707:13: warning: ‘show_rcu_tasks_rude_gp_kthread’ defined but not used [-Wunused-function]

--------------------------------------------------------------------------------
decstation_defconfig (mips, gcc-10) — PASS, 0 errors, 1 warning, 0 section mismatches

Warnings:
kernel/rcu/tasks.h:707:13: warning: ‘show_rcu_tasks_rude_gp_kthread’ defined but not used [-Wunused-function]

--------------------------------------------------------------------------------
decstation_r4k_defconfig (mips, gcc-10) — PASS, 0 errors, 1 warning, 0 section mismatches

Warnings:
kernel/rcu/tasks.h:707:13: warning: ‘show_rcu_tasks_rude_gp_kthread’ defined but not used [-Wunused-function]

--------------------------------------------------------------------------------
defconfig (riscv, gcc-10) — PASS, 0 errors, 0 warnings, 0 section mismatches

--------------------------------------------------------------------------------
defconfig (arm64, gcc-10) — PASS, 0 errors, 0 warnings, 0 section mismatches

--------------------------------------------------------------------------------
defconfig+arm64-chromebook+kselftest (arm64, gcc-10) — PASS, 0 errors, 0 warnings, 0 section mismatches

--------------------------------------------------------------------------------
defconfig+kselftest (arm64, gcc-10) — PASS, 0 errors, 0 warnings, 0 section mismatches

--------------------------------------------------------------------------------
dove_defconfig (arm, gcc-10) — PASS, 0 errors, 0 warnings, 0 section mismatches

--------------------------------------------------------------------------------
e55_defconfig (mips, gcc-10) — PASS, 0 errors, 0 warnings, 0 section mismatches

--------------------------------------------------------------------------------
ebsa110_defconfig (arm, gcc-10) — PASS, 0 errors, 0 warnings, 0 section mismatches

--------------------------------------------------------------------------------
ep93xx_defconfig (arm, gcc-10) — PASS, 0 errors, 0 warnings, 0 section mismatches

Section mismatches:
WARNING: modpost: vmlinux.o(.text+0x8054): Section mismatch in reference from the function __arm_ioremap_pfn_caller() to the function .meminit.text:memblock_is_map_memory()

--------------------------------------------------------------------------------
eseries_pxa_defconfig (arm, gcc-10) — PASS, 0 errors, 0 warnings, 0 section mismatches

--------------------------------------------------------------------------------
footbridge_defconfig (arm, gcc-10) — PASS, 0 errors, 0 warnings, 0 section mismatches

--------------------------------------------------------------------------------
fuloong2e_defconfig (mips, gcc-10) — PASS, 0 errors, 0 warnings, 0 section mismatches

--------------------------------------------------------------------------------
gcw0_defconfig (mips, gcc-10) — PASS, 0 errors, 0 warnings, 0 section mismatches

--------------------------------------------------------------------------------
gpr_defconfig (mips, gcc-10) — PASS, 0 errors, 0 warnings, 0 section mismatches

--------------------------------------------------------------------------------
h3600_defconfig (arm, gcc-10) — PASS, 0 errors, 0 warnings, 0 section mismatches

Section mismatches:
WARNING: modpost: vmlinux.o(.text+0xcb84): Section mismatch in reference from the function __arm_ioremap_pfn_caller() to the function .meminit.text:memblock_is_map_memory()

--------------------------------------------------------------------------------
h5000_defconfig (arm, gcc-10) — PASS, 0 errors, 0 warnings, 0 section mismatches

--------------------------------------------------------------------------------
hackkit_defconfig (arm, gcc-10) — PASS, 0 errors, 0 warnings, 0 section mismatches

Section mismatches:
WARNING: modpost: vmlinux.o(.text+0xce9c): Section mismatch in reference from the function __arm_ioremap_pfn_caller() to the function .meminit.text:memblock_is_map_memory()

--------------------------------------------------------------------------------
haps_hs_defconfig (arc, gcc-10) — PASS, 0 errors, 0 warnings, 0 section mismatches

--------------------------------------------------------------------------------
haps_hs_smp_defconfig (arc, gcc-10) — PASS, 0 errors, 0 warnings, 0 section mismatches

--------------------------------------------------------------------------------
hisi_defconfig (arm, gcc-10) — PASS, 0 errors, 0 warnings, 0 section mismatches

--------------------------------------------------------------------------------
hsdk_defconfig (arc, gcc-10) — PASS, 0 errors, 0 warnings, 0 section mismatches

--------------------------------------------------------------------------------
i386_defconfig (i386, gcc-10) — PASS, 0 errors, 0 warnings, 0 section mismatches

--------------------------------------------------------------------------------
imote2_defconfig (arm, gcc-10) — PASS, 0 errors, 0 warnings, 0 section mismatches

--------------------------------------------------------------------------------
imx_v4_v5_defconfig (arm, gcc-10) — PASS, 0 errors, 0 warnings, 0 section mismatches

--------------------------------------------------------------------------------
imx_v6_v7_defconfig (arm, gcc-10) — PASS, 0 errors, 0 warnings, 0 section mismatches

--------------------------------------------------------------------------------
integrator_defconfig (arm, gcc-10) — PASS, 0 errors, 0 warnings, 0 section mismatches

--------------------------------------------------------------------------------
iop32x_defconfig (arm, gcc-10) — PASS, 0 errors, 0 warnings, 0 section mismatches

--------------------------------------------------------------------------------
ip22_defconfig (mips, gcc-10) — PASS, 0 errors, 0 warnings, 0 section mismatches

--------------------------------------------------------------------------------
ip28_defconfig (mips, gcc-10) — FAIL, 0 errors, 0 warnings, 0 section mismatches

--------------------------------------------------------------------------------
ip32_defconfig (mips, gcc-10) — PASS, 0 errors, 0 warnings, 0 section mismatches

--------------------------------------------------------------------------------
ixp4xx_defconfig (arm, gcc-10) — PASS, 0 errors, 0 warnings, 0 section mismatches

--------------------------------------------------------------------------------
jazz_defconfig (mips, gcc-10) — PASS, 0 errors, 0 warnings, 0 section mismatches

--------------------------------------------------------------------------------
jmr3927_defconfig (mips, gcc-10) — PASS, 0 errors, 0 warnings, 0 section mismatches

--------------------------------------------------------------------------------
jornada720_defconfig (arm, gcc-10) — PASS, 0 errors, 0 warnings, 0 section mismatches

Section mismatches:
WARNING: modpost: vmlinux.o(.text+0xcaa8): Section mismatch in reference from the function __arm_ioremap_pfn_caller() to the function .meminit.text:memblock_is_map_memory()

--------------------------------------------------------------------------------
keystone_defconfig (arm, gcc-10) — PASS, 0 errors, 0 warnings, 0 section mismatches

--------------------------------------------------------------------------------
lart_defconfig (arm, gcc-10) — PASS, 0 errors, 0 warnings, 0 section mismatches

Section mismatches:
WARNING: modpost: vmlinux.o(.text+0xcb74): Section mismatch in reference from the function __arm_ioremap_pfn_caller() to the function .meminit.text:memblock_is_map_memory()

--------------------------------------------------------------------------------
lemote2f_defconfig (mips, gcc-10) — PASS, 0 errors, 1 warning, 0 section mismatches

Warnings:
net/mac80211/mlme.c:4343:1: warning: the frame size of 1040 bytes is larger than 1024 bytes [-Wframe-larger-than=]

--------------------------------------------------------------------------------
lpd270_defconfig (arm, gcc-10) — PASS, 0 errors, 0 warnings, 0 section mismatches

--------------------------------------------------------------------------------
lubbock_defconfig (arm, gcc-10) — PASS, 0 errors, 0 warnings, 0 section mismatches

--------------------------------------------------------------------------------
magician_defconfig (arm, gcc-10) — PASS, 0 errors, 0 warnings, 0 section mismatches

--------------------------------------------------------------------------------
mainstone_defconfig (arm, gcc-10) — PASS, 0 errors, 0 warnings, 0 section mismatches

--------------------------------------------------------------------------------
malta_defconfig (mips, gcc-10) — PASS, 0 errors, 0 warnings, 0 section mismatches

--------------------------------------------------------------------------------
malta_kvm_defconfig (mips, gcc-10) — PASS, 0 errors, 0 warnings, 0 section mismatches

--------------------------------------------------------------------------------
malta_kvm_guest_defconfig (mips, gcc-10) — PASS, 0 errors, 0 warnings, 0 section mismatches

--------------------------------------------------------------------------------
maltaaprp_defconfig (mips, gcc-10) — PASS, 0 errors, 0 warnings, 0 section mismatches

--------------------------------------------------------------------------------
maltasmvp_eva_defconfig (mips, gcc-10) — PASS, 0 errors, 0 warnings, 0 section mismatches

--------------------------------------------------------------------------------
maltaup_defconfig (mips, gcc-10) — PASS, 0 errors, 0 warnings, 0 section mismatches

--------------------------------------------------------------------------------
maltaup_xpa_defconfig (mips, gcc-10) — PASS, 0 errors, 0 warnings, 0 section mismatches

--------------------------------------------------------------------------------
milbeaut_m10v_defconfig (arm, gcc-10) — PASS, 0 errors, 0 warnings, 0 section mismatches

--------------------------------------------------------------------------------
mini2440_defconfig (arm, gcc-10) — PASS, 0 errors, 0 warnings, 0 section mismatches

--------------------------------------------------------------------------------
mmp2_defconfig (arm, gcc-10) — PASS, 0 errors, 0 warnings, 0 section mismatches

--------------------------------------------------------------------------------
moxart_defconfig (arm, gcc-10) — PASS, 0 errors, 0 warnings, 0 section mismatches

--------------------------------------------------------------------------------
mpc30x_defconfig (mips, gcc-10) — PASS, 0 errors, 0 warnings, 0 section mismatches

--------------------------------------------------------------------------------
mtx1_defconfig (mips, gcc-10) — PASS, 0 errors, 0 warnings, 0 section mismatches

--------------------------------------------------------------------------------
multi_v4t_defconfig (arm, gcc-10) — PASS, 0 errors, 0 warnings, 0 section mismatches

--------------------------------------------------------------------------------
multi_v7_defconfig (arm, gcc-10) — PASS, 0 errors, 0 warnings, 0 section mismatches

--------------------------------------------------------------------------------
multi_v7_defconfig+kselftest (arm, gcc-10) — PASS, 0 errors, 0 warnings, 0 section mismatches

--------------------------------------------------------------------------------
mvebu_v5_defconfig (arm, gcc-10) — PASS, 0 errors, 0 warnings, 0 section mismatches

--------------------------------------------------------------------------------
mxs_defconfig (arm, gcc-10) — PASS, 0 errors, 0 warnings, 0 section mismatches

--------------------------------------------------------------------------------
neponset_defconfig (arm, gcc-10) — PASS, 0 errors, 0 warnings, 0 section mismatches

Section mismatches:
WARNING: modpost: vmlinux.o(.text+0xcda4): Section mismatch in reference from the function __arm_ioremap_pfn_caller() to the function .meminit.text:memblock_is_map_memory()

--------------------------------------------------------------------------------
netwinder_defconfig (arm, gcc-10) — PASS, 0 errors, 0 warnings, 0 section mismatches

--------------------------------------------------------------------------------
nlm_xlp_defconfig (mips, gcc-10) — PASS, 0 errors, 0 warnings, 0 section mismatches

--------------------------------------------------------------------------------
nlm_xlr_defconfig (mips, gcc-10) — PASS, 0 errors, 0 warnings, 0 section mismatches

--------------------------------------------------------------------------------
nommu_k210_defconfig (riscv, gcc-10) — PASS, 0 errors, 0 warnings, 0 section mismatches

--------------------------------------------------------------------------------
nsimosci_hs_smp_defconfig (arc, gcc-10) — PASS, 0 errors, 0 warnings, 0 section mismatches

--------------------------------------------------------------------------------
omap2plus_defconfig (arm, gcc-10) — PASS, 0 errors, 0 warnings, 0 section mismatches

--------------------------------------------------------------------------------
omega2p_defconfig (mips, gcc-10) — PASS, 0 errors, 0 warnings, 0 section mismatches

--------------------------------------------------------------------------------
orion5x_defconfig (arm, gcc-10) — PASS, 0 errors, 0 warnings, 0 section mismatches

--------------------------------------------------------------------------------
oxnas_v6_defconfig (arm, gcc-10) — PASS, 0 errors, 0 warnings, 0 section mismatches

--------------------------------------------------------------------------------
palmz72_defconfig (arm, gcc-10) — PASS, 0 errors, 0 warnings, 0 section mismatches

--------------------------------------------------------------------------------
pic32mzda_defconfig (mips, gcc-10) — PASS, 0 errors, 0 warnings, 0 section mismatches

--------------------------------------------------------------------------------
pistachio_defconfig (mips, gcc-10) — PASS, 0 errors, 0 warnings, 0 section mismatches

--------------------------------------------------------------------------------
prima2_defconfig (arm, gcc-10) — PASS, 0 errors, 0 warnings, 0 section mismatches

--------------------------------------------------------------------------------
pxa168_defconfig (arm, gcc-10) — PASS, 0 errors, 0 warnings, 0 section mismatches

--------------------------------------------------------------------------------
pxa255-idp_defconfig (arm, gcc-10) — PASS, 0 errors, 0 warnings, 0 section mismatches

--------------------------------------------------------------------------------
pxa910_defconfig (arm, gcc-10) — PASS, 0 errors, 0 warnings, 0 section mismatches

--------------------------------------------------------------------------------
pxa_defconfig (arm, gcc-10) — PASS, 0 errors, 0 warnings, 0 section mismatches

--------------------------------------------------------------------------------
qcom_defconfig (arm, gcc-10) — PASS, 0 errors, 0 warnings, 0 section mismatches

--------------------------------------------------------------------------------
qi_lb60_defconfig (mips, gcc-10) — PASS, 0 errors, 0 warnings, 0 section mismatches

--------------------------------------------------------------------------------
rb532_defconfig (mips, gcc-10) — PASS, 0 errors, 0 warnings, 0 section mismatches

--------------------------------------------------------------------------------
rbtx49xx_defconfig (mips, gcc-10) — PASS, 0 errors, 0 warnings, 0 section mismatches

--------------------------------------------------------------------------------
realview_defconfig (arm, gcc-10) — PASS, 0 errors, 0 warnings, 0 section mismatches

--------------------------------------------------------------------------------
rm200_defconfig (mips, gcc-10) — PASS, 0 errors, 1 warning, 0 section mismatches

Warnings:
drivers/block/paride/bpck.c:32: warning: "PC" redefined

--------------------------------------------------------------------------------
rs90_defconfig (mips, gcc-10) — PASS, 0 errors, 0 warnings, 0 section mismatches

--------------------------------------------------------------------------------
rt305x_defconfig (mips, gcc-10) — PASS, 0 errors, 0 warnings, 0 section mismatches

--------------------------------------------------------------------------------
s3c6400_defconfig (arm, gcc-10) — PASS, 0 errors, 0 warnings, 0 section mismatches

--------------------------------------------------------------------------------
s5pv210_defconfig (arm, gcc-10) — PASS, 0 errors, 0 warnings, 0 section mismatches

--------------------------------------------------------------------------------
sama5_defconfig (arm, gcc-10) — PASS, 0 errors, 0 warnings, 0 section mismatches

--------------------------------------------------------------------------------
shmobile_defconfig (arm, gcc-10) — PASS, 0 errors, 0 warnings, 0 section mismatches

--------------------------------------------------------------------------------
simpad_defconfig (arm, gcc-10) — PASS, 0 errors, 0 warnings, 0 section mismatches

Section mismatches:
WARNING: modpost: vmlinux.o(.text+0xd040): Section mismatch in reference from the function __arm_ioremap_pfn_caller() to the function .meminit.text:memblock_is_map_memory()

--------------------------------------------------------------------------------
socfpga_defconfig (arm, gcc-10) — PASS, 0 errors, 0 warnings, 0 section mismatches

--------------------------------------------------------------------------------
spear6xx_defconfig (arm, gcc-10) — PASS, 0 errors, 0 warnings, 0 section mismatches

--------------------------------------------------------------------------------
stm32_defconfig (arm, gcc-10) — PASS, 0 errors, 0 warnings, 0 section mismatches

--------------------------------------------------------------------------------
sunxi_defconfig (arm, gcc-10) — PASS, 0 errors, 0 warnings, 0 section mismatches

--------------------------------------------------------------------------------
tango4_defconfig (arm, gcc-10) — PASS, 0 errors, 0 warnings, 0 section mismatches

--------------------------------------------------------------------------------
tb0219_defconfig (mips, gcc-10) — PASS, 0 errors, 0 warnings, 0 section mismatches

--------------------------------------------------------------------------------
tb0226_defconfig (mips, gcc-10) — PASS, 0 errors, 0 warnings, 0 section mismatches

--------------------------------------------------------------------------------
tct_hammer_defconfig (arm, gcc-10) — PASS, 0 errors, 0 warnings, 0 section mismatches

--------------------------------------------------------------------------------
tegra_defconfig (arm, gcc-10) — PASS, 0 errors, 0 warnings, 0 section mismatches

--------------------------------------------------------------------------------
tinyconfig (x86_64, gcc-10) — PASS, 0 errors, 0 warnings, 0 section mismatches

--------------------------------------------------------------------------------
u300_defconfig (arm, gcc-10) — PASS, 0 errors, 0 warnings, 0 section mismatches

--------------------------------------------------------------------------------
u8500_defconfig (arm, gcc-10) — PASS, 0 errors, 0 warnings, 0 section mismatches

--------------------------------------------------------------------------------
versatile_defconfig (arm, gcc-10) — PASS, 0 errors, 0 warnings, 0 section mismatches

--------------------------------------------------------------------------------
vexpress_defconfig (arm, gcc-10) — PASS, 0 errors, 0 warnings, 0 section mismatches

--------------------------------------------------------------------------------
vf610m4_defconfig (arm, gcc-10) — PASS, 0 errors, 0 warnings, 0 section mismatches

--------------------------------------------------------------------------------
viper_defconfig (arm, gcc-10) — PASS, 0 errors, 0 warnings, 0 section mismatches

--------------------------------------------------------------------------------
vocore2_defconfig (mips, gcc-10) — PASS, 0 errors, 0 warnings, 0 section mismatches

--------------------------------------------------------------------------------
vt8500_v6_v7_defconfig (arm, gcc-10) — PASS, 0 errors, 0 warnings, 0 section mismatches

--------------------------------------------------------------------------------
workpad_defconfig (mips, gcc-10) — PASS, 0 errors, 0 warnings, 0 section mismatches

--------------------------------------------------------------------------------
x86_64_defconfig (x86_64, gcc-10) — PASS, 0 errors, 0 warnings, 0 section mismatches

--------------------------------------------------------------------------------
x86_64_defconfig+x86-chromebook (x86_64, gcc-10) — PASS, 0 errors, 0 warnings, 0 section mismatches

--------------------------------------------------------------------------------
x86_64_defconfig+x86-chromebook+kselftest (x86_64, gcc-10) — PASS, 0 errors, 0 warnings, 0 section mismatches

--------------------------------------------------------------------------------
xcep_defconfig (arm, gcc-10) — PASS, 0 errors, 0 warnings, 0 section mismatches

--------------------------------------------------------------------------------
zeus_defconfig (arm, gcc-10) — PASS, 0 errors, 0 warnings, 0 section mismatches

--------------------------------------------------------------------------------
zx_defconfig (arm, gcc-10) — PASS, 0 errors, 0 warnings, 0 section mismatches

---
For more info write to <info@...>


cip-gitlab/ci/iwamatsu/linux-4.19.y-cip-rc build: 147 builds: 6 failed, 141 passed, 2 errors, 26 warnings (v4.19.233-cip69-120-ga36ab9aceb93) #kernelci

kernelci.org bot <bot@...>
 

cip-gitlab/ci/iwamatsu/linux-4.19.y-cip-rc build: 147 builds: 6 failed, 141 passed, 2 errors, 26 warnings (v4.19.233-cip69-120-ga36ab9aceb93)

Full Build Summary: https://kernelci.org/build/cip-gitlab/branch/ci%2Fiwamatsu%2Flinux-4.19.y-cip-rc/kernel/v4.19.233-cip69-120-ga36ab9aceb93/

Tree: cip-gitlab
Branch: ci/iwamatsu/linux-4.19.y-cip-rc
Git Describe: v4.19.233-cip69-120-ga36ab9aceb93
Git Commit: a36ab9aceb937b317b1eb65a1405f5290fbdc6f8
Git URL: https://gitlab.com/cip-project/cip-kernel/linux-cip.git
Built: 7 unique architectures

Build Failures Detected:

arm:
rpc_defconfig: (gcc-10) FAIL

mips:
ip27_defconfig: (gcc-10) FAIL
ip28_defconfig: (gcc-10) FAIL

riscv:
allnoconfig: (gcc-10) FAIL
defconfig: (gcc-10) FAIL
tinyconfig: (gcc-10) FAIL

Errors and Warnings Detected:

arc:

arm64:
defconfig (gcc-10): 3 warnings

arm:
rpc_defconfig (gcc-10): 2 errors

i386:
allnoconfig (gcc-10): 2 warnings
tinyconfig (gcc-10): 2 warnings

mips:
lemote2f_defconfig (gcc-10): 1 warning
loongson3_defconfig (gcc-10): 1 warning
malta_qemu_32r6_defconfig (gcc-10): 1 warning
mtx1_defconfig (gcc-10): 3 warnings
nlm_xlp_defconfig (gcc-10): 1 warning

riscv:

x86_64:
allnoconfig (gcc-10): 3 warnings
tinyconfig (gcc-10): 3 warnings
x86_64_defconfig (gcc-10): 3 warnings
x86_64_defconfig+x86-chromebook (gcc-10): 3 warnings

Errors summary:

1 arm-linux-gnueabihf-gcc: error: unrecognized -march target: armv3
1 arm-linux-gnueabihf-gcc: error: missing argument to ‘-march=’

Warnings summary:

6 ld: warning: creating DT_TEXTREL in a PIE
4 ld: arch/x86/boot/compressed/head_64.o: warning: relocation in read-only section `.head.text'
4 arch/x86/entry/entry_64.S:1738: Warning: no instruction mnemonic suffix given and no register operands; using default for `sysret'
3 aarch64-linux-gnu-ld: warning: -z norelro ignored
2 sound/pci/echoaudio/echoaudio_dsp.c:647:9: warning: iteration 1073741824 invokes undefined behavior [-Waggressive-loop-optimizations]
2 net/core/rtnetlink.c:3199:1: warning: the frame size of 1328 bytes is larger than 1024 bytes [-Wframe-larger-than=]
2 ld: arch/x86/boot/compressed/head_32.o: warning: relocation in read-only section `.head.text'
1 {standard input}:132: Warning: macro instruction expanded into multiple instructions
1 sound/pci/echoaudio/echoaudio_dsp.c:658:9: warning: iteration 1073741824 invokes undefined behavior [-Waggressive-loop-optimizations]
1 net/core/rtnetlink.c:3199:1: warning: the frame size of 1344 bytes is larger than 1024 bytes [-Wframe-larger-than=]

================================================================================

Detailed per-defconfig build reports:

--------------------------------------------------------------------------------
acs5k_defconfig (arm, gcc-10) — PASS, 0 errors, 0 warnings, 0 section mismatches

--------------------------------------------------------------------------------
acs5k_tiny_defconfig (arm, gcc-10) — PASS, 0 errors, 0 warnings, 0 section mismatches

--------------------------------------------------------------------------------
allnoconfig (riscv, gcc-10) — FAIL, 0 errors, 0 warnings, 0 section mismatches

--------------------------------------------------------------------------------
allnoconfig (i386, gcc-10) — PASS, 0 errors, 2 warnings, 0 section mismatches

Warnings:
ld: arch/x86/boot/compressed/head_32.o: warning: relocation in read-only section `.head.text'
ld: warning: creating DT_TEXTREL in a PIE

--------------------------------------------------------------------------------
allnoconfig (x86_64, gcc-10) — PASS, 0 errors, 3 warnings, 0 section mismatches

Warnings:
arch/x86/entry/entry_64.S:1738: Warning: no instruction mnemonic suffix given and no register operands; using default for `sysret'
ld: arch/x86/boot/compressed/head_64.o: warning: relocation in read-only section `.head.text'
ld: warning: creating DT_TEXTREL in a PIE

--------------------------------------------------------------------------------
am200epdkit_defconfig (arm, gcc-10) — PASS, 0 errors, 0 warnings, 0 section mismatches

--------------------------------------------------------------------------------
ar7_defconfig (mips, gcc-10) — PASS, 0 errors, 0 warnings, 0 section mismatches

--------------------------------------------------------------------------------
aspeed_g5_defconfig (arm, gcc-10) — PASS, 0 errors, 0 warnings, 0 section mismatches

--------------------------------------------------------------------------------
assabet_defconfig (arm, gcc-10) — PASS, 0 errors, 0 warnings, 0 section mismatches

--------------------------------------------------------------------------------
at91_dt_defconfig (arm, gcc-10) — PASS, 0 errors, 0 warnings, 0 section mismatches

--------------------------------------------------------------------------------
ath25_defconfig (mips, gcc-10) — PASS, 0 errors, 0 warnings, 0 section mismatches

--------------------------------------------------------------------------------
axm55xx_defconfig (arm, gcc-10) — PASS, 0 errors, 0 warnings, 0 section mismatches

--------------------------------------------------------------------------------
axs103_defconfig (arc, gcc-10) — PASS, 0 errors, 0 warnings, 0 section mismatches

--------------------------------------------------------------------------------
axs103_smp_defconfig (arc, gcc-10) — PASS, 0 errors, 0 warnings, 0 section mismatches

--------------------------------------------------------------------------------
bcm47xx_defconfig (mips, gcc-10) — PASS, 0 errors, 0 warnings, 0 section mismatches

--------------------------------------------------------------------------------
bigsur_defconfig (mips, gcc-10) — PASS, 0 errors, 0 warnings, 0 section mismatches

--------------------------------------------------------------------------------
bmips_be_defconfig (mips, gcc-10) — PASS, 0 errors, 0 warnings, 0 section mismatches

--------------------------------------------------------------------------------
bmips_stb_defconfig (mips, gcc-10) — PASS, 0 errors, 0 warnings, 0 section mismatches

--------------------------------------------------------------------------------
capcella_defconfig (mips, gcc-10) — PASS, 0 errors, 0 warnings, 0 section mismatches

--------------------------------------------------------------------------------
cerfcube_defconfig (arm, gcc-10) — PASS, 0 errors, 0 warnings, 0 section mismatches

--------------------------------------------------------------------------------
ci20_defconfig (mips, gcc-10) — PASS, 0 errors, 0 warnings, 0 section mismatches

--------------------------------------------------------------------------------
cm_x300_defconfig (arm, gcc-10) — PASS, 0 errors, 0 warnings, 0 section mismatches

--------------------------------------------------------------------------------
cobalt_defconfig (mips, gcc-10) — PASS, 0 errors, 0 warnings, 0 section mismatches

--------------------------------------------------------------------------------
colibri_pxa270_defconfig (arm, gcc-10) — PASS, 0 errors, 0 warnings, 0 section mismatches

--------------------------------------------------------------------------------
colibri_pxa300_defconfig (arm, gcc-10) — PASS, 0 errors, 0 warnings, 0 section mismatches

--------------------------------------------------------------------------------
collie_defconfig (arm, gcc-10) — PASS, 0 errors, 0 warnings, 0 section mismatches

--------------------------------------------------------------------------------
corgi_defconfig (arm, gcc-10) — PASS, 0 errors, 0 warnings, 0 section mismatches

--------------------------------------------------------------------------------
db1xxx_defconfig (mips, gcc-10) — PASS, 0 errors, 0 warnings, 0 section mismatches

--------------------------------------------------------------------------------
defconfig (riscv, gcc-10) — FAIL, 0 errors, 0 warnings, 0 section mismatches

--------------------------------------------------------------------------------
defconfig (arm64, gcc-10) — PASS, 0 errors, 3 warnings, 0 section mismatches

Warnings:
aarch64-linux-gnu-ld: warning: -z norelro ignored
aarch64-linux-gnu-ld: warning: -z norelro ignored
aarch64-linux-gnu-ld: warning: -z norelro ignored

--------------------------------------------------------------------------------
dove_defconfig (arm, gcc-10) — PASS, 0 errors, 0 warnings, 0 section mismatches

--------------------------------------------------------------------------------
e55_defconfig (mips, gcc-10) — PASS, 0 errors, 0 warnings, 0 section mismatches

--------------------------------------------------------------------------------
ebsa110_defconfig (arm, gcc-10) — PASS, 0 errors, 0 warnings, 0 section mismatches

--------------------------------------------------------------------------------
efm32_defconfig (arm, gcc-10) — PASS, 0 errors, 0 warnings, 0 section mismatches

--------------------------------------------------------------------------------
ep93xx_defconfig (arm, gcc-10) — PASS, 0 errors, 0 warnings, 0 section mismatches

--------------------------------------------------------------------------------
eseries_pxa_defconfig (arm, gcc-10) — PASS, 0 errors, 0 warnings, 0 section mismatches

--------------------------------------------------------------------------------
ezx_defconfig (arm, gcc-10) — PASS, 0 errors, 0 warnings, 0 section mismatches

--------------------------------------------------------------------------------
footbridge_defconfig (arm, gcc-10) — PASS, 0 errors, 0 warnings, 0 section mismatches

--------------------------------------------------------------------------------
fuloong2e_defconfig (mips, gcc-10) — PASS, 0 errors, 0 warnings, 0 section mismatches

--------------------------------------------------------------------------------
gcw0_defconfig (mips, gcc-10) — PASS, 0 errors, 0 warnings, 0 section mismatches

--------------------------------------------------------------------------------
h3600_defconfig (arm, gcc-10) — PASS, 0 errors, 0 warnings, 0 section mismatches

--------------------------------------------------------------------------------
haps_hs_defconfig (arc, gcc-10) — PASS, 0 errors, 0 warnings, 0 section mismatches

--------------------------------------------------------------------------------
haps_hs_smp_defconfig (arc, gcc-10) — PASS, 0 errors, 0 warnings, 0 section mismatches

--------------------------------------------------------------------------------
hisi_defconfig (arm, gcc-10) — PASS, 0 errors, 0 warnings, 0 section mismatches

--------------------------------------------------------------------------------
hsdk_defconfig (arc, gcc-10) — PASS, 0 errors, 0 warnings, 0 section mismatches

--------------------------------------------------------------------------------
imote2_defconfig (arm, gcc-10) — PASS, 0 errors, 0 warnings, 0 section mismatches

--------------------------------------------------------------------------------
imx_v4_v5_defconfig (arm, gcc-10) — PASS, 0 errors, 0 warnings, 0 section mismatches

--------------------------------------------------------------------------------
imx_v6_v7_defconfig (arm, gcc-10) — PASS, 0 errors, 0 warnings, 0 section mismatches

--------------------------------------------------------------------------------
iop32x_defconfig (arm, gcc-10) — PASS, 0 errors, 0 warnings, 0 section mismatches

--------------------------------------------------------------------------------
iop33x_defconfig (arm, gcc-10) — PASS, 0 errors, 0 warnings, 0 section mismatches

--------------------------------------------------------------------------------
ip22_defconfig (mips, gcc-10) — PASS, 0 errors, 0 warnings, 0 section mismatches

--------------------------------------------------------------------------------
ip27_defconfig (mips, gcc-10) — FAIL, 0 errors, 0 warnings, 0 section mismatches

--------------------------------------------------------------------------------
ip28_defconfig (mips, gcc-10) — FAIL, 0 errors, 0 warnings, 0 section mismatches

--------------------------------------------------------------------------------
ixp4xx_defconfig (arm, gcc-10) — PASS, 0 errors, 0 warnings, 0 section mismatches

--------------------------------------------------------------------------------
jmr3927_defconfig (mips, gcc-10) — PASS, 0 errors, 0 warnings, 0 section mismatches

--------------------------------------------------------------------------------
jornada720_defconfig (arm, gcc-10) — PASS, 0 errors, 0 warnings, 0 section mismatches

--------------------------------------------------------------------------------
keystone_defconfig (arm, gcc-10) — PASS, 0 errors, 0 warnings, 0 section mismatches

--------------------------------------------------------------------------------
ks8695_defconfig (arm, gcc-10) — PASS, 0 errors, 0 warnings, 0 section mismatches

--------------------------------------------------------------------------------
lart_defconfig (arm, gcc-10) — PASS, 0 errors, 0 warnings, 0 section mismatches

--------------------------------------------------------------------------------
lasat_defconfig (mips, gcc-10) — PASS, 0 errors, 0 warnings, 0 section mismatches

--------------------------------------------------------------------------------
lemote2f_defconfig (mips, gcc-10) — PASS, 0 errors, 1 warning, 0 section mismatches

Warnings:
net/core/rtnetlink.c:3199:1: warning: the frame size of 1328 bytes is larger than 1024 bytes [-Wframe-larger-than=]

--------------------------------------------------------------------------------
loongson1b_defconfig (mips, gcc-10) — PASS, 0 errors, 0 warnings, 0 section mismatches

--------------------------------------------------------------------------------
loongson3_defconfig (mips, gcc-10) — PASS, 0 errors, 1 warning, 0 section mismatches

Warnings:
net/core/rtnetlink.c:3199:1: warning: the frame size of 1328 bytes is larger than 1024 bytes [-Wframe-larger-than=]

--------------------------------------------------------------------------------
lpc32xx_defconfig (arm, gcc-10) — PASS, 0 errors, 0 warnings, 0 section mismatches

--------------------------------------------------------------------------------
lpd270_defconfig (arm, gcc-10) — PASS, 0 errors, 0 warnings, 0 section mismatches

--------------------------------------------------------------------------------
lubbock_defconfig (arm, gcc-10) — PASS, 0 errors, 0 warnings, 0 section mismatches

--------------------------------------------------------------------------------
magician_defconfig (arm, gcc-10) — PASS, 0 errors, 0 warnings, 0 section mismatches

--------------------------------------------------------------------------------
malta_kvm_defconfig (mips, gcc-10) — PASS, 0 errors, 0 warnings, 0 section mismatches

--------------------------------------------------------------------------------
malta_kvm_guest_defconfig (mips, gcc-10) — PASS, 0 errors, 0 warnings, 0 section mismatches

--------------------------------------------------------------------------------
malta_qemu_32r6_defconfig (mips, gcc-10) — PASS, 0 errors, 1 warning, 0 section mismatches

Warnings:
{standard input}:132: Warning: macro instruction expanded into multiple instructions

--------------------------------------------------------------------------------
maltaaprp_defconfig (mips, gcc-10) — PASS, 0 errors, 0 warnings, 0 section mismatches

--------------------------------------------------------------------------------
maltasmvp_eva_defconfig (mips, gcc-10) — PASS, 0 errors, 0 warnings, 0 section mismatches

--------------------------------------------------------------------------------
maltaup_xpa_defconfig (mips, gcc-10) — PASS, 0 errors, 0 warnings, 0 section mismatches

--------------------------------------------------------------------------------
mini2440_defconfig (arm, gcc-10) — PASS, 0 errors, 0 warnings, 0 section mismatches

--------------------------------------------------------------------------------
mips_paravirt_defconfig (mips, gcc-10) — PASS, 0 errors, 0 warnings, 0 section mismatches

--------------------------------------------------------------------------------
mmp2_defconfig (arm, gcc-10) — PASS, 0 errors, 0 warnings, 0 section mismatches

--------------------------------------------------------------------------------
moxart_defconfig (arm, gcc-10) — PASS, 0 errors, 0 warnings, 0 section mismatches

--------------------------------------------------------------------------------
mpc30x_defconfig (mips, gcc-10) — PASS, 0 errors, 0 warnings, 0 section mismatches

--------------------------------------------------------------------------------
mps2_defconfig (arm, gcc-10) — PASS, 0 errors, 0 warnings, 0 section mismatches

--------------------------------------------------------------------------------
mtx1_defconfig (mips, gcc-10) — PASS, 0 errors, 3 warnings, 0 section mismatches

Warnings:
sound/pci/echoaudio/echoaudio_dsp.c:647:9: warning: iteration 1073741824 invokes undefined behavior [-Waggressive-loop-optimizations]
sound/pci/echoaudio/echoaudio_dsp.c:658:9: warning: iteration 1073741824 invokes undefined behavior [-Waggressive-loop-optimizations]
sound/pci/echoaudio/echoaudio_dsp.c:647:9: warning: iteration 1073741824 invokes undefined behavior [-Waggressive-loop-optimizations]

--------------------------------------------------------------------------------
multi_v4t_defconfig (arm, gcc-10) — PASS, 0 errors, 0 warnings, 0 section mismatches

--------------------------------------------------------------------------------
multi_v5_defconfig (arm, gcc-10) — PASS, 0 errors, 0 warnings, 0 section mismatches

--------------------------------------------------------------------------------
multi_v7_defconfig (arm, gcc-10) — PASS, 0 errors, 0 warnings, 0 section mismatches

--------------------------------------------------------------------------------
mvebu_v7_defconfig (arm, gcc-10) — PASS, 0 errors, 0 warnings, 0 section mismatches

--------------------------------------------------------------------------------
mxs_defconfig (arm, gcc-10) — PASS, 0 errors, 0 warnings, 0 section mismatches

--------------------------------------------------------------------------------
netwinder_defconfig (arm, gcc-10) — PASS, 0 errors, 0 warnings, 0 section mismatches

--------------------------------------------------------------------------------
netx_defconfig (arm, gcc-10) — PASS, 0 errors, 0 warnings, 0 section mismatches

--------------------------------------------------------------------------------
nlm_xlp_defconfig (mips, gcc-10) — PASS, 0 errors, 1 warning, 0 section mismatches

Warnings:
net/core/rtnetlink.c:3199:1: warning: the frame size of 1344 bytes is larger than 1024 bytes [-Wframe-larger-than=]

--------------------------------------------------------------------------------
nlm_xlr_defconfig (mips, gcc-10) — PASS, 0 errors, 0 warnings, 0 section mismatches

--------------------------------------------------------------------------------
nsim_hs_defconfig (arc, gcc-10) — PASS, 0 errors, 0 warnings, 0 section mismatches

--------------------------------------------------------------------------------
nsimosci_hs_defconfig (arc, gcc-10) — PASS, 0 errors, 0 warnings, 0 section mismatches

--------------------------------------------------------------------------------
nsimosci_hs_smp_defconfig (arc, gcc-10) — PASS, 0 errors, 0 warnings, 0 section mismatches

--------------------------------------------------------------------------------
nuc910_defconfig (arm, gcc-10) — PASS, 0 errors, 0 warnings, 0 section mismatches

--------------------------------------------------------------------------------
nuc950_defconfig (arm, gcc-10) — PASS, 0 errors, 0 warnings, 0 section mismatches

--------------------------------------------------------------------------------
nuc960_defconfig (arm, gcc-10) — PASS, 0 errors, 0 warnings, 0 section mismatches

--------------------------------------------------------------------------------
omega2p_defconfig (mips, gcc-10) — PASS, 0 errors, 0 warnings, 0 section mismatches

--------------------------------------------------------------------------------
orion5x_defconfig (arm, gcc-10) — PASS, 0 errors, 0 warnings, 0 section mismatches

--------------------------------------------------------------------------------
oxnas_v6_defconfig (arm, gcc-10) — PASS, 0 errors, 0 warnings, 0 section mismatches

--------------------------------------------------------------------------------
pistachio_defconfig (mips, gcc-10) — PASS, 0 errors, 0 warnings, 0 section mismatches

--------------------------------------------------------------------------------
pnx8335_stb225_defconfig (mips, gcc-10) — PASS, 0 errors, 0 warnings, 0 section mismatches

--------------------------------------------------------------------------------
prima2_defconfig (arm, gcc-10) — PASS, 0 errors, 0 warnings, 0 section mismatches

--------------------------------------------------------------------------------
pxa168_defconfig (arm, gcc-10) — PASS, 0 errors, 0 warnings, 0 section mismatches

--------------------------------------------------------------------------------
pxa255-idp_defconfig (arm, gcc-10) — PASS, 0 errors, 0 warnings, 0 section mismatches

--------------------------------------------------------------------------------
pxa3xx_defconfig (arm, gcc-10) — PASS, 0 errors, 0 warnings, 0 section mismatches

--------------------------------------------------------------------------------
pxa910_defconfig (arm, gcc-10) — PASS, 0 errors, 0 warnings, 0 section mismatches

--------------------------------------------------------------------------------
pxa_defconfig (arm, gcc-10) — PASS, 0 errors, 0 warnings, 0 section mismatches

--------------------------------------------------------------------------------
qcom_defconfig (arm, gcc-10) — PASS, 0 errors, 0 warnings, 0 section mismatches

--------------------------------------------------------------------------------
raumfeld_defconfig (arm, gcc-10) — PASS, 0 errors, 0 warnings, 0 section mismatches

--------------------------------------------------------------------------------
realview_defconfig (arm, gcc-10) — PASS, 0 errors, 0 warnings, 0 section mismatches

--------------------------------------------------------------------------------
rm200_defconfig (mips, gcc-10) — PASS, 0 errors, 0 warnings, 0 section mismatches

--------------------------------------------------------------------------------
rpc_defconfig (arm, gcc-10) — FAIL, 2 errors, 0 warnings, 0 section mismatches

Errors:
arm-linux-gnueabihf-gcc: error: unrecognized -march target: armv3
arm-linux-gnueabihf-gcc: error: missing argument to ‘-march=’

--------------------------------------------------------------------------------
rt305x_defconfig (mips, gcc-10) — PASS, 0 errors, 0 warnings, 0 section mismatches

--------------------------------------------------------------------------------
s3c2410_defconfig (arm, gcc-10) — PASS, 0 errors, 0 warnings, 0 section mismatches

--------------------------------------------------------------------------------
s3c6400_defconfig (arm, gcc-10) — PASS, 0 errors, 0 warnings, 0 section mismatches

--------------------------------------------------------------------------------
s5pv210_defconfig (arm, gcc-10) — PASS, 0 errors, 0 warnings, 0 section mismatches

--------------------------------------------------------------------------------
sama5_defconfig (arm, gcc-10) — PASS, 0 errors, 0 warnings, 0 section mismatches

--------------------------------------------------------------------------------
shannon_defconfig (arm, gcc-10) — PASS, 0 errors, 0 warnings, 0 section mismatches

--------------------------------------------------------------------------------
shmobile_defconfig (arm, gcc-10) — PASS, 0 errors, 0 warnings, 0 section mismatches

--------------------------------------------------------------------------------
socfpga_defconfig (arm, gcc-10) — PASS, 0 errors, 0 warnings, 0 section mismatches

--------------------------------------------------------------------------------
spear3xx_defconfig (arm, gcc-10) — PASS, 0 errors, 0 warnings, 0 section mismatches

--------------------------------------------------------------------------------
spear6xx_defconfig (arm, gcc-10) — PASS, 0 errors, 0 warnings, 0 section mismatches

--------------------------------------------------------------------------------
stm32_defconfig (arm, gcc-10) — PASS, 0 errors, 0 warnings, 0 section mismatches

--------------------------------------------------------------------------------
tango4_defconfig (arm, gcc-10) — PASS, 0 errors, 0 warnings, 0 section mismatches

--------------------------------------------------------------------------------
tb0219_defconfig (mips, gcc-10) — PASS, 0 errors, 0 warnings, 0 section mismatches

--------------------------------------------------------------------------------
tb0226_defconfig (mips, gcc-10) — PASS, 0 errors, 0 warnings, 0 section mismatches

--------------------------------------------------------------------------------
tb0287_defconfig (mips, gcc-10) — PASS, 0 errors, 0 warnings, 0 section mismatches

--------------------------------------------------------------------------------
tct_hammer_defconfig (arm, gcc-10) — PASS, 0 errors, 0 warnings, 0 section mismatches

--------------------------------------------------------------------------------
tegra_defconfig (arm, gcc-10) — PASS, 0 errors, 0 warnings, 0 section mismatches

--------------------------------------------------------------------------------
tinyconfig (riscv, gcc-10) — FAIL, 0 errors, 0 warnings, 0 section mismatches

--------------------------------------------------------------------------------
tinyconfig (i386, gcc-10) — PASS, 0 errors, 2 warnings, 0 section mismatches

Warnings:
ld: arch/x86/boot/compressed/head_32.o: warning: relocation in read-only section `.head.text'
ld: warning: creating DT_TEXTREL in a PIE

--------------------------------------------------------------------------------
tinyconfig (x86_64, gcc-10) — PASS, 0 errors, 3 warnings, 0 section mismatches

Warnings:
arch/x86/entry/entry_64.S:1738: Warning: no instruction mnemonic suffix given and no register operands; using default for `sysret'
ld: arch/x86/boot/compressed/head_64.o: warning: relocation in read-only section `.head.text'
ld: warning: creating DT_TEXTREL in a PIE

--------------------------------------------------------------------------------
tinyconfig (arc, gcc-10) — PASS, 0 errors, 0 warnings, 0 section mismatches

--------------------------------------------------------------------------------
u300_defconfig (arm, gcc-10) — PASS, 0 errors, 0 warnings, 0 section mismatches

--------------------------------------------------------------------------------
u8500_defconfig (arm, gcc-10) — PASS, 0 errors, 0 warnings, 0 section mismatches

--------------------------------------------------------------------------------
vdk_hs38_defconfig (arc, gcc-10) — PASS, 0 errors, 0 warnings, 0 section mismatches

--------------------------------------------------------------------------------
vdk_hs38_smp_defconfig (arc, gcc-10) — PASS, 0 errors, 0 warnings, 0 section mismatches

--------------------------------------------------------------------------------
versatile_defconfig (arm, gcc-10) — PASS, 0 errors, 0 warnings, 0 section mismatches

--------------------------------------------------------------------------------
vexpress_defconfig (arm, gcc-10) — PASS, 0 errors, 0 warnings, 0 section mismatches

--------------------------------------------------------------------------------
vf610m4_defconfig (arm, gcc-10) — PASS, 0 errors, 0 warnings, 0 section mismatches

--------------------------------------------------------------------------------
vocore2_defconfig (mips, gcc-10) — PASS, 0 errors, 0 warnings, 0 section mismatches

--------------------------------------------------------------------------------
vt8500_v6_v7_defconfig (arm, gcc-10) — PASS, 0 errors, 0 warnings, 0 section mismatches

--------------------------------------------------------------------------------
workpad_defconfig (mips, gcc-10) — PASS, 0 errors, 0 warnings, 0 section mismatches

--------------------------------------------------------------------------------
x86_64_defconfig (x86_64, gcc-10) — PASS, 0 errors, 3 warnings, 0 section mismatches

Warnings:
arch/x86/entry/entry_64.S:1738: Warning: no instruction mnemonic suffix given and no register operands; using default for `sysret'
ld: arch/x86/boot/compressed/head_64.o: warning: relocation in read-only section `.head.text'
ld: warning: creating DT_TEXTREL in a PIE

--------------------------------------------------------------------------------
x86_64_defconfig+x86-chromebook (x86_64, gcc-10) — PASS, 0 errors, 3 warnings, 0 section mismatches

Warnings:
arch/x86/entry/entry_64.S:1738: Warning: no instruction mnemonic suffix given and no register operands; using default for `sysret'
ld: arch/x86/boot/compressed/head_64.o: warning: relocation in read-only section `.head.text'
ld: warning: creating DT_TEXTREL in a PIE

--------------------------------------------------------------------------------
xcep_defconfig (arm, gcc-10) — PASS, 0 errors, 0 warnings, 0 section mismatches

--------------------------------------------------------------------------------
zeus_defconfig (arm, gcc-10) — PASS, 0 errors, 0 warnings, 0 section mismatches

--------------------------------------------------------------------------------
zx_defconfig (arm, gcc-10) — PASS, 0 errors, 0 warnings, 0 section mismatches

---
For more info write to <info@...>


cip-gitlab/ci/pavel/linux-test smc: 3 runs, 1 regressions (v4.4.302-cip68-128-g4031bdd82383) #kernelci

kernelci.org bot <bot@...>
 

cip-gitlab/ci/pavel/linux-test smc: 3 runs, 1 regressions (v4.4.302-cip68-128-g4031bdd82383)

Regressions Summary
-------------------

platform | arch | lab | compiler | defconfig | regressions
--------------------------+--------+---------------+----------+------------------------------+------------
hp-x360-12b-n4000-octopus | x86_64 | lab-collabora | gcc-10 | x86_64_defcon...6-chromebook | 1

Details: https://kernelci.org/test/job/cip-gitlab/branch/ci%2Fpavel%2Flinux-test/kernel/v4.4.302-cip68-128-g4031bdd82383/plan/smc/

Test: smc
Tree: cip-gitlab
Branch: ci/pavel/linux-test
Describe: v4.4.302-cip68-128-g4031bdd82383
URL: https://gitlab.com/cip-project/cip-kernel/linux-cip.git
SHA: 4031bdd8238386ea87c992b18bc65b684bddc2d7


Test Regressions
----------------


platform | arch | lab | compiler | defconfig | regressions
--------------------------+--------+---------------+----------+------------------------------+------------
hp-x360-12b-n4000-octopus | x86_64 | lab-collabora | gcc-10 | x86_64_defcon...6-chromebook | 1

Details: https://kernelci.org/test/plan/id/623958658aa6bf61952172be

Results: 0 PASS, 1 FAIL, 0 SKIP
Full config: x86_64_defconfig+x86-chromebook
Compiler: gcc-10 (gcc (Debian 10.2.1-6) 10.2.1 20210110)
Plain log: https://storage.kernelci.org//cip-gitlab/ci-pavel-linux-test/v4.4.302-cip68-128-g4031bdd82383/x86_64/x86_64_defconfig+x86-chromebook/gcc-10/lab-collabora/smc-hp-x360-12b-n4000-octopus.txt
HTML log: https://storage.kernelci.org//cip-gitlab/ci-pavel-linux-test/v4.4.302-cip68-128-g4031bdd82383/x86_64/x86_64_defconfig+x86-chromebook/gcc-10/lab-collabora/smc-hp-x360-12b-n4000-octopus.html
Rootfs: http://storage.kernelci.org/images/rootfs/buildroot/buildroot-baseline/20220228.1/x86/rootfs.cpio.gz


* smc.login: https://kernelci.org/test/case/id/623958658aa6bf61952172bf
failing since 5 days (last pass: v4.19.233-cip69-1019-g2e5815777e975, first fail: v4.4.302-18-ga78419826225)


cip-gitlab/ci/pavel/linux-test ltp-timers: 4 runs, 4 regressions (v4.4.302-cip68-128-g4031bdd82383) #kernelci

kernelci.org bot <bot@...>
 

cip-gitlab/ci/pavel/linux-test ltp-timers: 4 runs, 4 regressions (v4.4.302-cip68-128-g4031bdd82383)

Regressions Summary
-------------------

platform | arch | lab | compiler | defconfig | regressions
--------------------------+--------+---------------+----------+------------------------------+------------
asus-C433TA-AJ0005-rammus | x86_64 | lab-collabora | gcc-10 | x86_64_defcon...6-chromebook | 1
asus-C436FA-Flip-hatch | x86_64 | lab-collabora | gcc-10 | x86_64_defcon...6-chromebook | 1
asus-C523NA-A20057-coral | x86_64 | lab-collabora | gcc-10 | x86_64_defcon...6-chromebook | 1
hp-11A-G6-EE-grunt | x86_64 | lab-collabora | gcc-10 | x86_64_defcon...6-chromebook | 1

Details: https://kernelci.org/test/job/cip-gitlab/branch/ci%2Fpavel%2Flinux-test/kernel/v4.4.302-cip68-128-g4031bdd82383/plan/ltp-timers/

Test: ltp-timers
Tree: cip-gitlab
Branch: ci/pavel/linux-test
Describe: v4.4.302-cip68-128-g4031bdd82383
URL: https://gitlab.com/cip-project/cip-kernel/linux-cip.git
SHA: 4031bdd8238386ea87c992b18bc65b684bddc2d7

Test suite revisions:
ltp-tests
URL: https://github.com/linux-test-project/ltp.git
SHA: dc836ec4cd4e02e1346001f828c1f1988a8d7d54


Test Regressions
----------------


platform | arch | lab | compiler | defconfig | regressions
--------------------------+--------+---------------+----------+------------------------------+------------
asus-C433TA-AJ0005-rammus | x86_64 | lab-collabora | gcc-10 | x86_64_defcon...6-chromebook | 1

Details: https://kernelci.org/test/plan/id/623955ab645f634c43217323

Results: 0 PASS, 1 FAIL, 0 SKIP
Full config: x86_64_defconfig+x86-chromebook
Compiler: gcc-10 (gcc (Debian 10.2.1-6) 10.2.1 20210110)
Plain log: https://storage.kernelci.org//cip-gitlab/ci-pavel-linux-test/v4.4.302-cip68-128-g4031bdd82383/x86_64/x86_64_defconfig+x86-chromebook/gcc-10/lab-collabora/ltp-timers-asus-C433TA-AJ0005-rammus.txt
HTML log: https://storage.kernelci.org//cip-gitlab/ci-pavel-linux-test/v4.4.302-cip68-128-g4031bdd82383/x86_64/x86_64_defconfig+x86-chromebook/gcc-10/lab-collabora/ltp-timers-asus-C433TA-AJ0005-rammus.html
Rootfs: http://storage.kernelci.org/images/rootfs/debian/bullseye-ltp/20220311.1/amd64/initrd.cpio.gz


* ltp-timers.login: https://kernelci.org/test/case/id/623955ab645f634c43217324
failing since 5 days (last pass: v4.19.233-cip69-1019-g2e5815777e975, first fail: v4.4.302-18-ga78419826225)



platform | arch | lab | compiler | defconfig | regressions
--------------------------+--------+---------------+----------+------------------------------+------------
asus-C436FA-Flip-hatch | x86_64 | lab-collabora | gcc-10 | x86_64_defcon...6-chromebook | 1

Details: https://kernelci.org/test/plan/id/623956b7098088d2ad2172bf

Results: 0 PASS, 1 FAIL, 0 SKIP
Full config: x86_64_defconfig+x86-chromebook
Compiler: gcc-10 (gcc (Debian 10.2.1-6) 10.2.1 20210110)
Plain log: https://storage.kernelci.org//cip-gitlab/ci-pavel-linux-test/v4.4.302-cip68-128-g4031bdd82383/x86_64/x86_64_defconfig+x86-chromebook/gcc-10/lab-collabora/ltp-timers-asus-C436FA-Flip-hatch.txt
HTML log: https://storage.kernelci.org//cip-gitlab/ci-pavel-linux-test/v4.4.302-cip68-128-g4031bdd82383/x86_64/x86_64_defconfig+x86-chromebook/gcc-10/lab-collabora/ltp-timers-asus-C436FA-Flip-hatch.html
Rootfs: http://storage.kernelci.org/images/rootfs/debian/bullseye-ltp/20220311.1/amd64/initrd.cpio.gz


* ltp-timers.login: https://kernelci.org/test/case/id/623956b7098088d2ad2172c0
failing since 7 days (last pass: v5.10.100-cip2-319-g7182f5032311, first fail: v4.19.233-cip69-1019-g2e5815777e975)



platform | arch | lab | compiler | defconfig | regressions
--------------------------+--------+---------------+----------+------------------------------+------------
asus-C523NA-A20057-coral | x86_64 | lab-collabora | gcc-10 | x86_64_defcon...6-chromebook | 1

Details: https://kernelci.org/test/plan/id/6239562d027bc5158c2172c2

Results: 0 PASS, 1 FAIL, 0 SKIP
Full config: x86_64_defconfig+x86-chromebook
Compiler: gcc-10 (gcc (Debian 10.2.1-6) 10.2.1 20210110)
Plain log: https://storage.kernelci.org//cip-gitlab/ci-pavel-linux-test/v4.4.302-cip68-128-g4031bdd82383/x86_64/x86_64_defconfig+x86-chromebook/gcc-10/lab-collabora/ltp-timers-asus-C523NA-A20057-coral.txt
HTML log: https://storage.kernelci.org//cip-gitlab/ci-pavel-linux-test/v4.4.302-cip68-128-g4031bdd82383/x86_64/x86_64_defconfig+x86-chromebook/gcc-10/lab-collabora/ltp-timers-asus-C523NA-A20057-coral.html
Rootfs: http://storage.kernelci.org/images/rootfs/debian/bullseye-ltp/20220311.1/amd64/initrd.cpio.gz


* ltp-timers.login: https://kernelci.org/test/case/id/6239562d027bc5158c2172c3
failing since 5 days (last pass: v4.19.233-cip69-1019-g2e5815777e975, first fail: v4.4.302-18-ga78419826225)



platform | arch | lab | compiler | defconfig | regressions
--------------------------+--------+---------------+----------+------------------------------+------------
hp-11A-G6-EE-grunt | x86_64 | lab-collabora | gcc-10 | x86_64_defcon...6-chromebook | 1

Details: https://kernelci.org/test/plan/id/62395630b9feca5ca82172c5

Results: 0 PASS, 1 FAIL, 0 SKIP
Full config: x86_64_defconfig+x86-chromebook
Compiler: gcc-10 (gcc (Debian 10.2.1-6) 10.2.1 20210110)
Plain log: https://storage.kernelci.org//cip-gitlab/ci-pavel-linux-test/v4.4.302-cip68-128-g4031bdd82383/x86_64/x86_64_defconfig+x86-chromebook/gcc-10/lab-collabora/ltp-timers-hp-11A-G6-EE-grunt.txt
HTML log: https://storage.kernelci.org//cip-gitlab/ci-pavel-linux-test/v4.4.302-cip68-128-g4031bdd82383/x86_64/x86_64_defconfig+x86-chromebook/gcc-10/lab-collabora/ltp-timers-hp-11A-G6-EE-grunt.html
Rootfs: http://storage.kernelci.org/images/rootfs/debian/bullseye-ltp/20220311.1/amd64/initrd.cpio.gz


* ltp-timers.login: https://kernelci.org/test/case/id/62395630b9feca5ca82172c6
failing since 5 days (last pass: v4.19.233-cip69-1019-g2e5815777e975, first fail: v4.4.302-18-ga78419826225)


cip-gitlab/ci/pavel/linux-test ltp-pty: 3 runs, 3 regressions (v4.4.302-cip68-128-g4031bdd82383) #kernelci

kernelci.org bot <bot@...>
 

cip-gitlab/ci/pavel/linux-test ltp-pty: 3 runs, 3 regressions (v4.4.302-cip68-128-g4031bdd82383)

Regressions Summary
-------------------

platform | arch | lab | compiler | defconfig | regressions
--------------------------+--------+---------------+----------+------------------------------+------------
asus-C433TA-AJ0005-rammus | x86_64 | lab-collabora | gcc-10 | x86_64_defcon...6-chromebook | 1
asus-C523NA-A20057-coral | x86_64 | lab-collabora | gcc-10 | x86_64_defcon...6-chromebook | 1
hp-11A-G6-EE-grunt | x86_64 | lab-collabora | gcc-10 | x86_64_defcon...6-chromebook | 1

Details: https://kernelci.org/test/job/cip-gitlab/branch/ci%2Fpavel%2Flinux-test/kernel/v4.4.302-cip68-128-g4031bdd82383/plan/ltp-pty/

Test: ltp-pty
Tree: cip-gitlab
Branch: ci/pavel/linux-test
Describe: v4.4.302-cip68-128-g4031bdd82383
URL: https://gitlab.com/cip-project/cip-kernel/linux-cip.git
SHA: 4031bdd8238386ea87c992b18bc65b684bddc2d7

Test suite revisions:
ltp-tests
URL: https://github.com/linux-test-project/ltp.git
SHA: dc836ec4cd4e02e1346001f828c1f1988a8d7d54


Test Regressions
----------------


platform | arch | lab | compiler | defconfig | regressions
--------------------------+--------+---------------+----------+------------------------------+------------
asus-C433TA-AJ0005-rammus | x86_64 | lab-collabora | gcc-10 | x86_64_defcon...6-chromebook | 1

Details: https://kernelci.org/test/plan/id/623955ba645f634c43217355

Results: 0 PASS, 1 FAIL, 0 SKIP
Full config: x86_64_defconfig+x86-chromebook
Compiler: gcc-10 (gcc (Debian 10.2.1-6) 10.2.1 20210110)
Plain log: https://storage.kernelci.org//cip-gitlab/ci-pavel-linux-test/v4.4.302-cip68-128-g4031bdd82383/x86_64/x86_64_defconfig+x86-chromebook/gcc-10/lab-collabora/ltp-pty-asus-C433TA-AJ0005-rammus.txt
HTML log: https://storage.kernelci.org//cip-gitlab/ci-pavel-linux-test/v4.4.302-cip68-128-g4031bdd82383/x86_64/x86_64_defconfig+x86-chromebook/gcc-10/lab-collabora/ltp-pty-asus-C433TA-AJ0005-rammus.html
Rootfs: http://storage.kernelci.org/images/rootfs/debian/bullseye-ltp/20220311.1/amd64/initrd.cpio.gz


* ltp-pty.login: https://kernelci.org/test/case/id/623955ba645f634c43217356
failing since 5 days (last pass: v4.19.233-cip69-1019-g2e5815777e975, first fail: v4.4.302-18-ga78419826225)



platform | arch | lab | compiler | defconfig | regressions
--------------------------+--------+---------------+----------+------------------------------+------------
asus-C523NA-A20057-coral | x86_64 | lab-collabora | gcc-10 | x86_64_defcon...6-chromebook | 1

Details: https://kernelci.org/test/plan/id/623955b3645f634c43217334

Results: 0 PASS, 1 FAIL, 0 SKIP
Full config: x86_64_defconfig+x86-chromebook
Compiler: gcc-10 (gcc (Debian 10.2.1-6) 10.2.1 20210110)
Plain log: https://storage.kernelci.org//cip-gitlab/ci-pavel-linux-test/v4.4.302-cip68-128-g4031bdd82383/x86_64/x86_64_defconfig+x86-chromebook/gcc-10/lab-collabora/ltp-pty-asus-C523NA-A20057-coral.txt
HTML log: https://storage.kernelci.org//cip-gitlab/ci-pavel-linux-test/v4.4.302-cip68-128-g4031bdd82383/x86_64/x86_64_defconfig+x86-chromebook/gcc-10/lab-collabora/ltp-pty-asus-C523NA-A20057-coral.html
Rootfs: http://storage.kernelci.org/images/rootfs/debian/bullseye-ltp/20220311.1/amd64/initrd.cpio.gz


* ltp-pty.login: https://kernelci.org/test/case/id/623955b3645f634c43217335
failing since 5 days (last pass: v4.19.233-cip69-1019-g2e5815777e975, first fail: v4.4.302-18-ga78419826225)



platform | arch | lab | compiler | defconfig | regressions
--------------------------+--------+---------------+----------+------------------------------+------------
hp-11A-G6-EE-grunt | x86_64 | lab-collabora | gcc-10 | x86_64_defcon...6-chromebook | 1

Details: https://kernelci.org/test/plan/id/623955d42579fed1b32172cf

Results: 0 PASS, 1 FAIL, 0 SKIP
Full config: x86_64_defconfig+x86-chromebook
Compiler: gcc-10 (gcc (Debian 10.2.1-6) 10.2.1 20210110)
Plain log: https://storage.kernelci.org//cip-gitlab/ci-pavel-linux-test/v4.4.302-cip68-128-g4031bdd82383/x86_64/x86_64_defconfig+x86-chromebook/gcc-10/lab-collabora/ltp-pty-hp-11A-G6-EE-grunt.txt
HTML log: https://storage.kernelci.org//cip-gitlab/ci-pavel-linux-test/v4.4.302-cip68-128-g4031bdd82383/x86_64/x86_64_defconfig+x86-chromebook/gcc-10/lab-collabora/ltp-pty-hp-11A-G6-EE-grunt.html
Rootfs: http://storage.kernelci.org/images/rootfs/debian/bullseye-ltp/20220311.1/amd64/initrd.cpio.gz


* ltp-pty.login: https://kernelci.org/test/case/id/623955d42579fed1b32172d0
failing since 5 days (last pass: v4.19.233-cip69-1019-g2e5815777e975, first fail: v4.4.302-18-ga78419826225)


cip-gitlab/ci/pavel/linux-test ltp-mm: 4 runs, 4 regressions (v4.4.302-cip68-128-g4031bdd82383) #kernelci

kernelci.org bot <bot@...>
 

cip-gitlab/ci/pavel/linux-test ltp-mm: 4 runs, 4 regressions (v4.4.302-cip68-128-g4031bdd82383)

Regressions Summary
-------------------

platform | arch | lab | compiler | defconfig | regressions
--------------------------+--------+---------------+----------+------------------------------+------------
asus-C436FA-Flip-hatch | x86_64 | lab-collabora | gcc-10 | x86_64_defcon...6-chromebook | 1
asus-C523NA-A20057-coral | x86_64 | lab-collabora | gcc-10 | x86_64_defcon...6-chromebook | 1
hp-11A-G6-EE-grunt | x86_64 | lab-collabora | gcc-10 | x86_64_defcon...6-chromebook | 1
hp-x360-12b-n4000-octopus | x86_64 | lab-collabora | gcc-10 | x86_64_defcon...6-chromebook | 1

Details: https://kernelci.org/test/job/cip-gitlab/branch/ci%2Fpavel%2Flinux-test/kernel/v4.4.302-cip68-128-g4031bdd82383/plan/ltp-mm/

Test: ltp-mm
Tree: cip-gitlab
Branch: ci/pavel/linux-test
Describe: v4.4.302-cip68-128-g4031bdd82383
URL: https://gitlab.com/cip-project/cip-kernel/linux-cip.git
SHA: 4031bdd8238386ea87c992b18bc65b684bddc2d7

Test suite revisions:
ltp-tests
URL: https://github.com/linux-test-project/ltp.git
SHA: dc836ec4cd4e02e1346001f828c1f1988a8d7d54


Test Regressions
----------------


platform | arch | lab | compiler | defconfig | regressions
--------------------------+--------+---------------+----------+------------------------------+------------
asus-C436FA-Flip-hatch | x86_64 | lab-collabora | gcc-10 | x86_64_defcon...6-chromebook | 1

Details: https://kernelci.org/test/plan/id/623956b3209e24e7992172d7

Results: 0 PASS, 1 FAIL, 0 SKIP
Full config: x86_64_defconfig+x86-chromebook
Compiler: gcc-10 (gcc (Debian 10.2.1-6) 10.2.1 20210110)
Plain log: https://storage.kernelci.org//cip-gitlab/ci-pavel-linux-test/v4.4.302-cip68-128-g4031bdd82383/x86_64/x86_64_defconfig+x86-chromebook/gcc-10/lab-collabora/ltp-mm-asus-C436FA-Flip-hatch.txt
HTML log: https://storage.kernelci.org//cip-gitlab/ci-pavel-linux-test/v4.4.302-cip68-128-g4031bdd82383/x86_64/x86_64_defconfig+x86-chromebook/gcc-10/lab-collabora/ltp-mm-asus-C436FA-Flip-hatch.html
Rootfs: http://storage.kernelci.org/images/rootfs/debian/bullseye-ltp/20220311.1/amd64/initrd.cpio.gz


* ltp-mm.login: https://kernelci.org/test/case/id/623956b3209e24e7992172d8
failing since 7 days (last pass: v5.10.100-cip2-319-g7182f5032311, first fail: v4.19.233-cip69-1019-g2e5815777e975)



platform | arch | lab | compiler | defconfig | regressions
--------------------------+--------+---------------+----------+------------------------------+------------
asus-C523NA-A20057-coral | x86_64 | lab-collabora | gcc-10 | x86_64_defcon...6-chromebook | 1

Details: https://kernelci.org/test/plan/id/62395636e29546bd582172d1

Results: 0 PASS, 1 FAIL, 0 SKIP
Full config: x86_64_defconfig+x86-chromebook
Compiler: gcc-10 (gcc (Debian 10.2.1-6) 10.2.1 20210110)
Plain log: https://storage.kernelci.org//cip-gitlab/ci-pavel-linux-test/v4.4.302-cip68-128-g4031bdd82383/x86_64/x86_64_defconfig+x86-chromebook/gcc-10/lab-collabora/ltp-mm-asus-C523NA-A20057-coral.txt
HTML log: https://storage.kernelci.org//cip-gitlab/ci-pavel-linux-test/v4.4.302-cip68-128-g4031bdd82383/x86_64/x86_64_defconfig+x86-chromebook/gcc-10/lab-collabora/ltp-mm-asus-C523NA-A20057-coral.html
Rootfs: http://storage.kernelci.org/images/rootfs/debian/bullseye-ltp/20220311.1/amd64/initrd.cpio.gz


* ltp-mm.login: https://kernelci.org/test/case/id/62395636e29546bd582172d2
failing since 5 days (last pass: v4.19.233-cip69-1019-g2e5815777e975, first fail: v4.4.302-18-ga78419826225)



platform | arch | lab | compiler | defconfig | regressions
--------------------------+--------+---------------+----------+------------------------------+------------
hp-11A-G6-EE-grunt | x86_64 | lab-collabora | gcc-10 | x86_64_defcon...6-chromebook | 1

Details: https://kernelci.org/test/plan/id/623955ccfb2965ce2f2172fc

Results: 0 PASS, 1 FAIL, 0 SKIP
Full config: x86_64_defconfig+x86-chromebook
Compiler: gcc-10 (gcc (Debian 10.2.1-6) 10.2.1 20210110)
Plain log: https://storage.kernelci.org//cip-gitlab/ci-pavel-linux-test/v4.4.302-cip68-128-g4031bdd82383/x86_64/x86_64_defconfig+x86-chromebook/gcc-10/lab-collabora/ltp-mm-hp-11A-G6-EE-grunt.txt
HTML log: https://storage.kernelci.org//cip-gitlab/ci-pavel-linux-test/v4.4.302-cip68-128-g4031bdd82383/x86_64/x86_64_defconfig+x86-chromebook/gcc-10/lab-collabora/ltp-mm-hp-11A-G6-EE-grunt.html
Rootfs: http://storage.kernelci.org/images/rootfs/debian/bullseye-ltp/20220311.1/amd64/initrd.cpio.gz


* ltp-mm.login: https://kernelci.org/test/case/id/623955ccfb2965ce2f2172fd
failing since 5 days (last pass: v4.19.233-cip69-1019-g2e5815777e975, first fail: v4.4.302-18-ga78419826225)



platform | arch | lab | compiler | defconfig | regressions
--------------------------+--------+---------------+----------+------------------------------+------------
hp-x360-12b-n4000-octopus | x86_64 | lab-collabora | gcc-10 | x86_64_defcon...6-chromebook | 1

Details: https://kernelci.org/test/plan/id/623956e36fd7d24de0217337

Results: 0 PASS, 1 FAIL, 0 SKIP
Full config: x86_64_defconfig+x86-chromebook
Compiler: gcc-10 (gcc (Debian 10.2.1-6) 10.2.1 20210110)
Plain log: https://storage.kernelci.org//cip-gitlab/ci-pavel-linux-test/v4.4.302-cip68-128-g4031bdd82383/x86_64/x86_64_defconfig+x86-chromebook/gcc-10/lab-collabora/ltp-mm-hp-x360-12b-n4000-octopus.txt
HTML log: https://storage.kernelci.org//cip-gitlab/ci-pavel-linux-test/v4.4.302-cip68-128-g4031bdd82383/x86_64/x86_64_defconfig+x86-chromebook/gcc-10/lab-collabora/ltp-mm-hp-x360-12b-n4000-octopus.html
Rootfs: http://storage.kernelci.org/images/rootfs/debian/bullseye-ltp/20220311.1/amd64/initrd.cpio.gz


* ltp-mm.login: https://kernelci.org/test/case/id/623956e36fd7d24de0217338
failing since 5 days (last pass: v4.19.233-cip69-1019-g2e5815777e975, first fail: v4.4.302-18-ga78419826225)

1781 - 1800 of 9599