Date   

[isar-cip-core][PATCH 3/4] recipes-devtools/ovmf-binaries: Adapt to sbuild environment

Quirin Gylstorff
 

From: Quirin Gylstorff <quirin.gylstorff@...>

Due to sbuild we can no longer access the build chroot with all installed
packages.

Signed-off-by: Quirin Gylstorff <quirin.gylstorff@...>
---
.../ovmf-binaries/files/control.tmpl | 11 -----------
recipes-devtools/ovmf-binaries/files/rules | 17 +++++++++++++++++
.../ovmf-binaries/ovmf-binaries_0.1.bb | 18 +++++++++++-------
3 files changed, 28 insertions(+), 18 deletions(-)
delete mode 100644 recipes-devtools/ovmf-binaries/files/control.tmpl
create mode 100644 recipes-devtools/ovmf-binaries/files/rules

diff --git a/recipes-devtools/ovmf-binaries/files/control.tmpl b/recipes-devtools/ovmf-binaries/files/control.tmpl
deleted file mode 100644
index 54641d6..0000000
--- a/recipes-devtools/ovmf-binaries/files/control.tmpl
+++ /dev/null
@@ -1,11 +0,0 @@
-Source: ${PN}
-Section: misc
-Priority: optional
-Standards-Version: 3.9.6
-Maintainer: ${MAINTAINER}
-Build-Depends: debhelper (>= 9), ${DEBIAN_BUILD_DEPENDS}
-
-Package: ${PN}
-Architecture: ${DPKG_ARCH}
-Depends: ${DEBIAN_DEPENDS}
-Description: ${DESCRIPTION}
diff --git a/recipes-devtools/ovmf-binaries/files/rules b/recipes-devtools/ovmf-binaries/files/rules
new file mode 100644
index 0000000..dcbef80
--- /dev/null
+++ b/recipes-devtools/ovmf-binaries/files/rules
@@ -0,0 +1,17 @@
+#!/usr/bin/make -f
+#
+# Copyright (c) Siemens AG, 2022
+#
+# Authors:
+# Quirin Gylstorff <quirin.gylstorff@...>
+#
+# This file is subject to the terms and conditions of the MIT License.
+# See COPYING.MIT file in the top-level directory.
+#
+
+override_dh_auto_configure:
+ mkdir -p /home/builder/ovmf-binaries/image/var/share/
+ cp -r /usr/share/OVMF /home/builder/ovmf-binaries/image/var/share/
+
+%:
+ dh $@
diff --git a/recipes-devtools/ovmf-binaries/ovmf-binaries_0.1.bb b/recipes-devtools/ovmf-binaries/ovmf-binaries_0.1.bb
index 6524300..0f4592a 100644
--- a/recipes-devtools/ovmf-binaries/ovmf-binaries_0.1.bb
+++ b/recipes-devtools/ovmf-binaries/ovmf-binaries_0.1.bb
@@ -14,18 +14,22 @@ inherit dpkg-raw
DESCRIPTION = "Copy the OVMF biniaries from the build changeroot to the deploy dir"

# this is a empty debian package
-SRC_URI = "file://control.tmpl"
+SRC_URI = "file://rules"

DEBIAN_BUILD_DEPENDS = "ovmf"
-TEMPLATE_FILES = "control.tmpl"
-TEMPLATE_VARS += "PN DEBIAN_DEPENDS MAINTAINER DESCRIPTION DPKG_ARCH DEBIAN_BUILD_DEPENDS"

SSTATETASKS = ""

-do_extract_ovmf() {
+do_install() {
+ install -v -d ${D}/var/share
+ touch ${D}/var/share/test
+}
+
+do_deploy() {
install -m 0755 -d ${DEPLOY_DIR_IMAGE}
- cp -r ${BUILDCHROOT_DIR}/usr/share/OVMF ${DEPLOY_DIR_IMAGE}
- chown $(id -u):$(id -g) ${DEPLOY_DIR_IMAGE}/OVMF
+ dpkg --extract ${WORKDIR}/${PN}_${PV}*.deb ${WORKDIR}
+ cp -r ${WORKDIR}/var/share/OVMF ${DEPLOY_DIR_IMAGE}
}
+addtask do_deploy after do_dpkg_build before do_deploy_deb
+

-addtask do_extract_ovmf after do_install_builddeps before do_dpkg_build
--
2.35.1


[isar-cip-core][PATCH 4/4] kas-cip: Add patch for linux-cip with CONFIG_MODULES=n

Quirin Gylstorff
 

From: Quirin Gylstorff <quirin.gylstorff@...>

This fixes an error during the kernel build with sbuild if
Modules.symvers doesn't exist as find returns 1 if a name
could not be found.

Signed-off-by: Quirin Gylstorff <quirin.gylstorff@...>
---
...ernel-Check-if-CONFIG_MODULES-is-set.patch | 33 +++++++++++++++++++
kas-cip.yml | 4 +++
2 files changed, 37 insertions(+)
create mode 100644 isar-patches/0001-recipes-kernel-Check-if-CONFIG_MODULES-is-set.patch

diff --git a/isar-patches/0001-recipes-kernel-Check-if-CONFIG_MODULES-is-set.patch b/isar-patches/0001-recipes-kernel-Check-if-CONFIG_MODULES-is-set.patch
new file mode 100644
index 0000000..d07c36d
--- /dev/null
+++ b/isar-patches/0001-recipes-kernel-Check-if-CONFIG_MODULES-is-set.patch
@@ -0,0 +1,33 @@
+From 6ad8f9bb92d3722ff5eb60f09e5ef75ba5febcbd Mon Sep 17 00:00:00 2001
+From: Quirin Gylstorff <quirin.gylstorff@...>
+Date: Thu, 28 Jul 2022 16:24:16 +0200
+Subject: [PATCH] recipes-kernel: Check if CONFIG_MODULES is set
+
+This fixes an error during the kernel build with sbuild if
+Modules.symvers doesn't exist as find returns 1 if a name
+could not be found.
+
+Signed-off-by: Quirin Gylstorff <quirin.gylstorff@...>
+---
+ meta/recipes-kernel/linux/files/debian/isar/install.tmpl | 5 ++++-
+ 1 file changed, 4 insertions(+), 1 deletion(-)
+
+diff --git a/meta/recipes-kernel/linux/files/debian/isar/install.tmpl b/meta/recipes-kernel/linux/files/debian/isar/install.tmpl
+index c6b5059..909b01b 100644
+--- a/meta/recipes-kernel/linux/files/debian/isar/install.tmpl
++++ b/meta/recipes-kernel/linux/files/debian/isar/install.tmpl
+@@ -173,7 +173,10 @@ kernel_headers() {
+ (cd ${S}; find arch/${ARCH} -name module.lds -o -name Kbuild.platforms -o -name Platform) >>${src_hdr_files}
+ (cd ${S}; find $(find arch/${ARCH} -name include -o -name scripts -type d) -type f) >>${src_hdr_files}
+
+- (cd ${O}; find arch/${ARCH}/include Module.symvers include scripts -type f) >>${obj_hdr_files}
++ if [ -n "${CONFIG_MODULES}" ]; then
++ echo Module.symvers >> ${obj_hdr_files}
++ fi
++ (cd ${O}; find arch/${ARCH}/include include scripts -type f) >>${obj_hdr_files}
+ if [ -n "${CONFIG_STACK_VALIDATION}" ]; then
+ (cd ${O}; find tools/objtool -type f -executable) >>${obj_hdr_files}
+ fi
+--
+2.35.1
+
diff --git a/kas-cip.yml b/kas-cip.yml
index a39820f..5a43cd1 100644
--- a/kas-cip.yml
+++ b/kas-cip.yml
@@ -25,6 +25,10 @@ repos:
refspec: 64c755053d1252d183757b294cf9849fced64799
layers:
meta:
+ patches:
+ fix-hihope-kernel-build:
+ repo: cip-core
+ path: isar-patches/0001-recipes-kernel-Check-if-CONFIG_MODULES-is-set.patch

bblayers_conf_header:
standard: |
--
2.35.1


[isar-cip-core][PATCH 1/4] Update ISAR for sbuild integration

Quirin Gylstorff
 

From: Quirin Gylstorff <quirin.gylstorff@...>

Signed-off-by: Quirin Gylstorff <quirin.gylstorff@...>
---
kas-cip.yml | 2 +-
1 file changed, 1 insertion(+), 1 deletion(-)

diff --git a/kas-cip.yml b/kas-cip.yml
index c3477ed..a39820f 100644
--- a/kas-cip.yml
+++ b/kas-cip.yml
@@ -22,7 +22,7 @@ repos:

isar:
url: https://github.com/ilbers/isar.git
- refspec: 1000df8e98b9a5849a7897698039687fd0cdd7d3
+ refspec: 64c755053d1252d183757b294cf9849fced64799
layers:
meta:

--
2.35.1


[isar-cip-core][PATCH 0/4] Add support for ISAR with sbuild

Quirin Gylstorff
 

From: Quirin Gylstorff <quirin.gylstorff@...>

This patch series integrates ISAR with the Sbuild feature.

Quirin Gylstorff (4):
Update ISAR for sbuild integration
scripts/deploy-cip-core.sh: Use dtb from deploy dir
recipes-devtools/ovmf-binaries: Adapt to sbuild environment
kas-cip: Add patch for linux-cip with CONFIG_MODULES=n

.gitlab-ci.yml | 6 ++--
conf/machine/bbb.conf | 1 +
...ernel-Check-if-CONFIG_MODULES-is-set.patch | 33 +++++++++++++++++++
kas-cip.yml | 6 +++-
.../ovmf-binaries/files/control.tmpl | 11 -------
recipes-devtools/ovmf-binaries/files/rules | 17 ++++++++++
.../ovmf-binaries/ovmf-binaries_0.1.bb | 18 ++++++----
scripts/deploy-cip-core.sh | 2 +-
8 files changed, 71 insertions(+), 23 deletions(-)
create mode 100644 isar-patches/0001-recipes-kernel-Check-if-CONFIG_MODULES-is-set.patch
delete mode 100644 recipes-devtools/ovmf-binaries/files/control.tmpl
create mode 100644 recipes-devtools/ovmf-binaries/files/rules

--
2.35.1


cip-gitlab/ci/pavel/linux-test smc: 14 runs, 9 regressions (v4.4-st5-585-gc99f2b257bde) #kernelci

kernelci.org bot <bot@...>
 

cip-gitlab/ci/pavel/linux-test smc: 14 runs, 9 regressions (v4.4-st5-585-gc99f2b257bde)

Regressions Summary
-------------------

platform | arch | lab | compiler | defconfig | regressions
-----------------------------+--------+---------------+----------+------------------------------+------------
hp-x360-12b-c...4020-octopus | x86_64 | lab-collabora | gcc-10 | x86_64_defcon...6-chromebook | 1
juno-uboot | arm64 | lab-broonie | gcc-10 | defconfig | 1
qemu_arm-virt-gicv3 | arm | lab-broonie | gcc-10 | multi_v7_defconfig | 1
qemu_arm-virt-gicv3 | arm | lab-collabora | gcc-10 | multi_v7_defconfig | 1
qemu_arm64-virt-gicv3 | arm64 | lab-broonie | gcc-10 | defconfig | 1
qemu_arm64-virt-gicv3 | arm64 | lab-broonie | gcc-10 | defconfig+arm64-chromebook | 1
qemu_arm64-virt-gicv3 | arm64 | lab-collabora | gcc-10 | defconfig | 1
qemu_arm64-virt-gicv3 | arm64 | lab-collabora | gcc-10 | defconfig+arm64-chromebook | 1
qemu_x86_64 | x86_64 | lab-collabora | gcc-10 | x86_64_defconfig | 1

Details: https://kernelci.org/test/job/cip-gitlab/branch/ci%2Fpavel%2Flinux-test/kernel/v4.4-st5-585-gc99f2b257bde/plan/smc/

Test: smc
Tree: cip-gitlab
Branch: ci/pavel/linux-test
Describe: v4.4-st5-585-gc99f2b257bde
URL: https://gitlab.com/cip-project/cip-kernel/linux-cip.git
SHA: c99f2b257bde3cd60a833056aab624ad5fab3812


Test Regressions
----------------


platform | arch | lab | compiler | defconfig | regressions
-----------------------------+--------+---------------+----------+------------------------------+------------
hp-x360-12b-c...4020-octopus | x86_64 | lab-collabora | gcc-10 | x86_64_defcon...6-chromebook | 1

Details: https://kernelci.org/test/plan/id/62e0b4913305adedc0daf059

Results: 0 PASS, 1 FAIL, 0 SKIP
Full config: x86_64_defconfig+x86-chromebook
Compiler: gcc-10 (gcc (Debian 10.2.1-6) 10.2.1 20210110)
Plain log: https://storage.kernelci.org//cip-gitlab/ci-pavel-linux-test/v4.4-st5-585-gc99f2b257bde/x86_64/x86_64_defconfig+x86-chromebook/gcc-10/lab-collabora/smc-hp-x360-12b-ca0010nr-n4020-octopus.txt
HTML log: https://storage.kernelci.org//cip-gitlab/ci-pavel-linux-test/v4.4-st5-585-gc99f2b257bde/x86_64/x86_64_defconfig+x86-chromebook/gcc-10/lab-collabora/smc-hp-x360-12b-ca0010nr-n4020-octopus.html
Rootfs: http://storage.kernelci.org/images/rootfs/buildroot/buildroot-baseline/20220718.0/x86/rootfs.cpio.gz


* smc.login: https://kernelci.org/test/case/id/62e0b4913305adedc0daf05a
failing since 0 day (last pass: v5.10.129-cip12-36-g21d9d56f4de5a, first fail: v4.4-st5-586-geb97410e0086c)



platform | arch | lab | compiler | defconfig | regressions
-----------------------------+--------+---------------+----------+------------------------------+------------
juno-uboot | arm64 | lab-broonie | gcc-10 | defconfig | 1

Details: https://kernelci.org/test/plan/id/62e1c858d893940bf6daf05b

Results: 0 PASS, 1 FAIL, 0 SKIP
Full config: defconfig
Compiler: gcc-10 (aarch64-linux-gnu-gcc (Debian 10.2.1-6) 10.2.1 20210110)
Plain log: https://storage.kernelci.org//cip-gitlab/ci-pavel-linux-test/v4.4-st5-585-gc99f2b257bde/arm64/defconfig/gcc-10/lab-broonie/smc-juno-uboot.txt
HTML log: https://storage.kernelci.org//cip-gitlab/ci-pavel-linux-test/v4.4-st5-585-gc99f2b257bde/arm64/defconfig/gcc-10/lab-broonie/smc-juno-uboot.html
Rootfs: http://storage.kernelci.org/images/rootfs/buildroot/buildroot-baseline/20220718.0/arm64/rootfs.cpio.gz


* smc.login: https://kernelci.org/test/case/id/62e1c858d893940bf6daf05c
new failure (last pass: v5.10.129-cip12-36-g21d9d56f4de5a)



platform | arch | lab | compiler | defconfig | regressions
-----------------------------+--------+---------------+----------+------------------------------+------------
qemu_arm-virt-gicv3 | arm | lab-broonie | gcc-10 | multi_v7_defconfig | 1

Details: https://kernelci.org/test/plan/id/62e0b5468b4777a537daf05b

Results: 0 PASS, 1 FAIL, 0 SKIP
Full config: multi_v7_defconfig
Compiler: gcc-10 (arm-linux-gnueabihf-gcc (Debian 10.2.1-6) 10.2.1 20210110)
Plain log: https://storage.kernelci.org//cip-gitlab/ci-pavel-linux-test/v4.4-st5-585-gc99f2b257bde/arm/multi_v7_defconfig/gcc-10/lab-broonie/smc-qemu_arm-virt-gicv3.txt
HTML log: https://storage.kernelci.org//cip-gitlab/ci-pavel-linux-test/v4.4-st5-585-gc99f2b257bde/arm/multi_v7_defconfig/gcc-10/lab-broonie/smc-qemu_arm-virt-gicv3.html
Rootfs: http://storage.kernelci.org/images/rootfs/buildroot/buildroot-baseline/20220718.0/armel/rootfs.cpio.gz


* smc.login: https://kernelci.org/test/case/id/62e0b5468b4777a537daf05c
failing since 0 day (last pass: v5.10.129-cip12-36-g21d9d56f4de5a, first fail: v4.4-st5-586-geb97410e0086c)



platform | arch | lab | compiler | defconfig | regressions
-----------------------------+--------+---------------+----------+------------------------------+------------
qemu_arm-virt-gicv3 | arm | lab-collabora | gcc-10 | multi_v7_defconfig | 1

Details: https://kernelci.org/test/plan/id/62e0b6a2080c0d2cd6daf075

Results: 0 PASS, 1 FAIL, 0 SKIP
Full config: multi_v7_defconfig
Compiler: gcc-10 (arm-linux-gnueabihf-gcc (Debian 10.2.1-6) 10.2.1 20210110)
Plain log: https://storage.kernelci.org//cip-gitlab/ci-pavel-linux-test/v4.4-st5-585-gc99f2b257bde/arm/multi_v7_defconfig/gcc-10/lab-collabora/smc-qemu_arm-virt-gicv3.txt
HTML log: https://storage.kernelci.org//cip-gitlab/ci-pavel-linux-test/v4.4-st5-585-gc99f2b257bde/arm/multi_v7_defconfig/gcc-10/lab-collabora/smc-qemu_arm-virt-gicv3.html
Rootfs: http://storage.kernelci.org/images/rootfs/buildroot/buildroot-baseline/20220718.0/armel/rootfs.cpio.gz


* smc.login: https://kernelci.org/test/case/id/62e0b6a2080c0d2cd6daf076
failing since 0 day (last pass: v5.10.129-cip12-36-g21d9d56f4de5a, first fail: v4.4-st5-586-geb97410e0086c)



platform | arch | lab | compiler | defconfig | regressions
-----------------------------+--------+---------------+----------+------------------------------+------------
qemu_arm64-virt-gicv3 | arm64 | lab-broonie | gcc-10 | defconfig | 1

Details: https://kernelci.org/test/plan/id/62e0b096e4da64c7c8daf08a

Results: 0 PASS, 1 FAIL, 0 SKIP
Full config: defconfig
Compiler: gcc-10 (aarch64-linux-gnu-gcc (Debian 10.2.1-6) 10.2.1 20210110)
Plain log: https://storage.kernelci.org//cip-gitlab/ci-pavel-linux-test/v4.4-st5-585-gc99f2b257bde/arm64/defconfig/gcc-10/lab-broonie/smc-qemu_arm64-virt-gicv3.txt
HTML log: https://storage.kernelci.org//cip-gitlab/ci-pavel-linux-test/v4.4-st5-585-gc99f2b257bde/arm64/defconfig/gcc-10/lab-broonie/smc-qemu_arm64-virt-gicv3.html
Rootfs: http://storage.kernelci.org/images/rootfs/buildroot/buildroot-baseline/20220718.0/arm64/rootfs.cpio.gz


* smc.login: https://kernelci.org/test/case/id/62e0b096e4da64c7c8daf08b
failing since 77 days (last pass: v4.19.233-516-ge5e741fbfc87, first fail: v5.10.109-cip5-384-g722204542e8a)



platform | arch | lab | compiler | defconfig | regressions
-----------------------------+--------+---------------+----------+------------------------------+------------
qemu_arm64-virt-gicv3 | arm64 | lab-broonie | gcc-10 | defconfig+arm64-chromebook | 1

Details: https://kernelci.org/test/plan/id/62e0b3cadc4da3cd4fdaf064

Results: 0 PASS, 1 FAIL, 0 SKIP
Full config: defconfig+arm64-chromebook
Compiler: gcc-10 (aarch64-linux-gnu-gcc (Debian 10.2.1-6) 10.2.1 20210110)
Plain log: https://storage.kernelci.org//cip-gitlab/ci-pavel-linux-test/v4.4-st5-585-gc99f2b257bde/arm64/defconfig+arm64-chromebook/gcc-10/lab-broonie/smc-qemu_arm64-virt-gicv3.txt
HTML log: https://storage.kernelci.org//cip-gitlab/ci-pavel-linux-test/v4.4-st5-585-gc99f2b257bde/arm64/defconfig+arm64-chromebook/gcc-10/lab-broonie/smc-qemu_arm64-virt-gicv3.html
Rootfs: http://storage.kernelci.org/images/rootfs/buildroot/buildroot-baseline/20220718.0/arm64/rootfs.cpio.gz


* smc.login: https://kernelci.org/test/case/id/62e0b3cadc4da3cd4fdaf065
failing since 77 days (last pass: v4.19.233-516-ge5e741fbfc87, first fail: v5.10.109-cip5-384-g722204542e8a)



platform | arch | lab | compiler | defconfig | regressions
-----------------------------+--------+---------------+----------+------------------------------+------------
qemu_arm64-virt-gicv3 | arm64 | lab-collabora | gcc-10 | defconfig | 1

Details: https://kernelci.org/test/plan/id/62e0b21f25bd0639c4daf06a

Results: 0 PASS, 1 FAIL, 0 SKIP
Full config: defconfig
Compiler: gcc-10 (aarch64-linux-gnu-gcc (Debian 10.2.1-6) 10.2.1 20210110)
Plain log: https://storage.kernelci.org//cip-gitlab/ci-pavel-linux-test/v4.4-st5-585-gc99f2b257bde/arm64/defconfig/gcc-10/lab-collabora/smc-qemu_arm64-virt-gicv3.txt
HTML log: https://storage.kernelci.org//cip-gitlab/ci-pavel-linux-test/v4.4-st5-585-gc99f2b257bde/arm64/defconfig/gcc-10/lab-collabora/smc-qemu_arm64-virt-gicv3.html
Rootfs: http://storage.kernelci.org/images/rootfs/buildroot/buildroot-baseline/20220718.0/arm64/rootfs.cpio.gz


* smc.login: https://kernelci.org/test/case/id/62e0b21f25bd0639c4daf06b
failing since 77 days (last pass: v4.19.233-516-ge5e741fbfc87, first fail: v5.10.109-cip5-384-g722204542e8a)



platform | arch | lab | compiler | defconfig | regressions
-----------------------------+--------+---------------+----------+------------------------------+------------
qemu_arm64-virt-gicv3 | arm64 | lab-collabora | gcc-10 | defconfig+arm64-chromebook | 1

Details: https://kernelci.org/test/plan/id/62e0b3808f2659c50ddaf05c

Results: 0 PASS, 1 FAIL, 0 SKIP
Full config: defconfig+arm64-chromebook
Compiler: gcc-10 (aarch64-linux-gnu-gcc (Debian 10.2.1-6) 10.2.1 20210110)
Plain log: https://storage.kernelci.org//cip-gitlab/ci-pavel-linux-test/v4.4-st5-585-gc99f2b257bde/arm64/defconfig+arm64-chromebook/gcc-10/lab-collabora/smc-qemu_arm64-virt-gicv3.txt
HTML log: https://storage.kernelci.org//cip-gitlab/ci-pavel-linux-test/v4.4-st5-585-gc99f2b257bde/arm64/defconfig+arm64-chromebook/gcc-10/lab-collabora/smc-qemu_arm64-virt-gicv3.html
Rootfs: http://storage.kernelci.org/images/rootfs/buildroot/buildroot-baseline/20220718.0/arm64/rootfs.cpio.gz


* smc.login: https://kernelci.org/test/case/id/62e0b3808f2659c50ddaf05d
failing since 77 days (last pass: v4.19.233-516-ge5e741fbfc87, first fail: v5.10.109-cip5-384-g722204542e8a)



platform | arch | lab | compiler | defconfig | regressions
-----------------------------+--------+---------------+----------+------------------------------+------------
qemu_x86_64 | x86_64 | lab-collabora | gcc-10 | x86_64_defconfig | 1

Details: https://kernelci.org/test/plan/id/62e0b3bd16421b94efdaf065

Results: 14 PASS, 2 FAIL, 0 SKIP
Full config: x86_64_defconfig
Compiler: gcc-10 (gcc (Debian 10.2.1-6) 10.2.1 20210110)
Plain log: https://storage.kernelci.org//cip-gitlab/ci-pavel-linux-test/v4.4-st5-585-gc99f2b257bde/x86_64/x86_64_defconfig/gcc-10/lab-collabora/smc-qemu_x86_64.txt
HTML log: https://storage.kernelci.org//cip-gitlab/ci-pavel-linux-test/v4.4-st5-585-gc99f2b257bde/x86_64/x86_64_defconfig/gcc-10/lab-collabora/smc-qemu_x86_64.html
Rootfs: http://storage.kernelci.org/images/rootfs/buildroot/buildroot-baseline/20220718.0/x86/rootfs.cpio.gz


* smc.CVE-2020-0543: https://kernelci.org/test/case/id/62e0b3bd16421b94efdaf067
new failure (last pass: v5.10.129-cip12-36-g21d9d56f4de5a)


cip-gitlab/ci/pavel/linux-test ltp-timers: 9 runs, 4 regressions (v4.4-st5-585-gc99f2b257bde) #kernelci

kernelci.org bot <bot@...>
 

cip-gitlab/ci/pavel/linux-test ltp-timers: 9 runs, 4 regressions (v4.4-st5-585-gc99f2b257bde)

Regressions Summary
-------------------

platform | arch | lab | compiler | defconfig | regressions
--------------------------+--------+---------------+----------+------------------------------+------------
asus-C433TA-AJ0005-rammus | x86_64 | lab-collabora | gcc-10 | x86_64_defcon...6-chromebook | 1
asus-C436FA-Flip-hatch | x86_64 | lab-collabora | gcc-10 | x86_64_defcon...6-chromebook | 1
hp-11A-G6-EE-grunt | x86_64 | lab-collabora | gcc-10 | x86_64_defcon...6-chromebook | 1
rk3288-veyron-jaq | arm | lab-collabora | gcc-10 | multi_v7_defconfig | 1

Details: https://kernelci.org/test/job/cip-gitlab/branch/ci%2Fpavel%2Flinux-test/kernel/v4.4-st5-585-gc99f2b257bde/plan/ltp-timers/

Test: ltp-timers
Tree: cip-gitlab
Branch: ci/pavel/linux-test
Describe: v4.4-st5-585-gc99f2b257bde
URL: https://gitlab.com/cip-project/cip-kernel/linux-cip.git
SHA: c99f2b257bde3cd60a833056aab624ad5fab3812

Test suite revisions:
ltp-tests
URL: https://github.com/linux-test-project/ltp.git
SHA: bda92ad659a52d38ac810099f69adff626b064c6


Test Regressions
----------------


platform | arch | lab | compiler | defconfig | regressions
--------------------------+--------+---------------+----------+------------------------------+------------
asus-C433TA-AJ0005-rammus | x86_64 | lab-collabora | gcc-10 | x86_64_defcon...6-chromebook | 1

Details: https://kernelci.org/test/plan/id/62e0b0d9d351fa0553daf068

Results: 0 PASS, 1 FAIL, 0 SKIP
Full config: x86_64_defconfig+x86-chromebook
Compiler: gcc-10 (gcc (Debian 10.2.1-6) 10.2.1 20210110)
Plain log: https://storage.kernelci.org//cip-gitlab/ci-pavel-linux-test/v4.4-st5-585-gc99f2b257bde/x86_64/x86_64_defconfig+x86-chromebook/gcc-10/lab-collabora/ltp-timers-asus-C433TA-AJ0005-rammus.txt
HTML log: https://storage.kernelci.org//cip-gitlab/ci-pavel-linux-test/v4.4-st5-585-gc99f2b257bde/x86_64/x86_64_defconfig+x86-chromebook/gcc-10/lab-collabora/ltp-timers-asus-C433TA-AJ0005-rammus.html
Rootfs: http://storage.kernelci.org/images/rootfs/debian/bullseye-ltp/20220716.0/amd64/initrd.cpio.gz


* ltp-timers.login: https://kernelci.org/test/case/id/62e0b0d9d351fa0553daf069
failing since 0 day (last pass: v5.10.129-cip12-36-g21d9d56f4de5a, first fail: v4.4-st5-586-geb97410e0086c)



platform | arch | lab | compiler | defconfig | regressions
--------------------------+--------+---------------+----------+------------------------------+------------
asus-C436FA-Flip-hatch | x86_64 | lab-collabora | gcc-10 | x86_64_defcon...6-chromebook | 1

Details: https://kernelci.org/test/plan/id/62e0b325eabb58f740daf073

Results: 0 PASS, 1 FAIL, 0 SKIP
Full config: x86_64_defconfig+x86-chromebook
Compiler: gcc-10 (gcc (Debian 10.2.1-6) 10.2.1 20210110)
Plain log: https://storage.kernelci.org//cip-gitlab/ci-pavel-linux-test/v4.4-st5-585-gc99f2b257bde/x86_64/x86_64_defconfig+x86-chromebook/gcc-10/lab-collabora/ltp-timers-asus-C436FA-Flip-hatch.txt
HTML log: https://storage.kernelci.org//cip-gitlab/ci-pavel-linux-test/v4.4-st5-585-gc99f2b257bde/x86_64/x86_64_defconfig+x86-chromebook/gcc-10/lab-collabora/ltp-timers-asus-C436FA-Flip-hatch.html
Rootfs: http://storage.kernelci.org/images/rootfs/debian/bullseye-ltp/20220716.0/amd64/initrd.cpio.gz


* ltp-timers.login: https://kernelci.org/test/case/id/62e0b325eabb58f740daf074
failing since 0 day (last pass: v5.10.129-cip12-36-g21d9d56f4de5a, first fail: v4.4-st5-586-geb97410e0086c)



platform | arch | lab | compiler | defconfig | regressions
--------------------------+--------+---------------+----------+------------------------------+------------
hp-11A-G6-EE-grunt | x86_64 | lab-collabora | gcc-10 | x86_64_defcon...6-chromebook | 1

Details: https://kernelci.org/test/plan/id/62e0b14c0fd9fd6aa7daf066

Results: 0 PASS, 1 FAIL, 0 SKIP
Full config: x86_64_defconfig+x86-chromebook
Compiler: gcc-10 (gcc (Debian 10.2.1-6) 10.2.1 20210110)
Plain log: https://storage.kernelci.org//cip-gitlab/ci-pavel-linux-test/v4.4-st5-585-gc99f2b257bde/x86_64/x86_64_defconfig+x86-chromebook/gcc-10/lab-collabora/ltp-timers-hp-11A-G6-EE-grunt.txt
HTML log: https://storage.kernelci.org//cip-gitlab/ci-pavel-linux-test/v4.4-st5-585-gc99f2b257bde/x86_64/x86_64_defconfig+x86-chromebook/gcc-10/lab-collabora/ltp-timers-hp-11A-G6-EE-grunt.html
Rootfs: http://storage.kernelci.org/images/rootfs/debian/bullseye-ltp/20220716.0/amd64/initrd.cpio.gz


* ltp-timers.login: https://kernelci.org/test/case/id/62e0b14c0fd9fd6aa7daf067
failing since 0 day (last pass: v5.10.129-cip12-36-g21d9d56f4de5a, first fail: v4.4-st5-586-geb97410e0086c)



platform | arch | lab | compiler | defconfig | regressions
--------------------------+--------+---------------+----------+------------------------------+------------
rk3288-veyron-jaq | arm | lab-collabora | gcc-10 | multi_v7_defconfig | 1

Details: https://kernelci.org/test/plan/id/62e0d6cb3e2170e6f5daf06a

Results: 0 PASS, 1 FAIL, 0 SKIP
Full config: multi_v7_defconfig
Compiler: gcc-10 (arm-linux-gnueabihf-gcc (Debian 10.2.1-6) 10.2.1 20210110)
Plain log: https://storage.kernelci.org//cip-gitlab/ci-pavel-linux-test/v4.4-st5-585-gc99f2b257bde/arm/multi_v7_defconfig/gcc-10/lab-collabora/ltp-timers-rk3288-veyron-jaq.txt
HTML log: https://storage.kernelci.org//cip-gitlab/ci-pavel-linux-test/v4.4-st5-585-gc99f2b257bde/arm/multi_v7_defconfig/gcc-10/lab-collabora/ltp-timers-rk3288-veyron-jaq.html
Rootfs: http://storage.kernelci.org/images/rootfs/debian/bullseye-ltp/20220716.0/armhf/initrd.cpio.gz


* ltp-timers.login: https://kernelci.org/test/case/id/62e0d6cb3e2170e6f5daf06b
failing since 0 day (last pass: v5.10.129-cip12-36-g21d9d56f4de5a, first fail: v4.4-st5-586-geb97410e0086c)


cip-gitlab/ci/pavel/linux-test ltp-pty: 3 runs, 3 regressions (v4.4-st5-585-gc99f2b257bde) #kernelci

kernelci.org bot <bot@...>
 

cip-gitlab/ci/pavel/linux-test ltp-pty: 3 runs, 3 regressions (v4.4-st5-585-gc99f2b257bde)

Regressions Summary
-------------------

platform | arch | lab | compiler | defconfig | regressions
--------------------------+--------+---------------+----------+------------------------------+------------
asus-C433TA-AJ0005-rammus | x86_64 | lab-collabora | gcc-10 | x86_64_defcon...6-chromebook | 1
asus-C523NA-A20057-coral | x86_64 | lab-collabora | gcc-10 | x86_64_defcon...6-chromebook | 1
hp-11A-G6-EE-grunt | x86_64 | lab-collabora | gcc-10 | x86_64_defcon...6-chromebook | 1

Details: https://kernelci.org/test/job/cip-gitlab/branch/ci%2Fpavel%2Flinux-test/kernel/v4.4-st5-585-gc99f2b257bde/plan/ltp-pty/

Test: ltp-pty
Tree: cip-gitlab
Branch: ci/pavel/linux-test
Describe: v4.4-st5-585-gc99f2b257bde
URL: https://gitlab.com/cip-project/cip-kernel/linux-cip.git
SHA: c99f2b257bde3cd60a833056aab624ad5fab3812

Test suite revisions:
ltp-tests
URL: https://github.com/linux-test-project/ltp.git
SHA: bda92ad659a52d38ac810099f69adff626b064c6


Test Regressions
----------------


platform | arch | lab | compiler | defconfig | regressions
--------------------------+--------+---------------+----------+------------------------------+------------
asus-C433TA-AJ0005-rammus | x86_64 | lab-collabora | gcc-10 | x86_64_defcon...6-chromebook | 1

Details: https://kernelci.org/test/plan/id/62e0b0d6fd8baa0417daf07c

Results: 0 PASS, 1 FAIL, 0 SKIP
Full config: x86_64_defconfig+x86-chromebook
Compiler: gcc-10 (gcc (Debian 10.2.1-6) 10.2.1 20210110)
Plain log: https://storage.kernelci.org//cip-gitlab/ci-pavel-linux-test/v4.4-st5-585-gc99f2b257bde/x86_64/x86_64_defconfig+x86-chromebook/gcc-10/lab-collabora/ltp-pty-asus-C433TA-AJ0005-rammus.txt
HTML log: https://storage.kernelci.org//cip-gitlab/ci-pavel-linux-test/v4.4-st5-585-gc99f2b257bde/x86_64/x86_64_defconfig+x86-chromebook/gcc-10/lab-collabora/ltp-pty-asus-C433TA-AJ0005-rammus.html
Rootfs: http://storage.kernelci.org/images/rootfs/debian/bullseye-ltp/20220716.0/amd64/initrd.cpio.gz


* ltp-pty.login: https://kernelci.org/test/case/id/62e0b0d6fd8baa0417daf07d
failing since 0 day (last pass: v5.10.129-cip12-36-g21d9d56f4de5a, first fail: v4.4-st5-586-geb97410e0086c)



platform | arch | lab | compiler | defconfig | regressions
--------------------------+--------+---------------+----------+------------------------------+------------
asus-C523NA-A20057-coral | x86_64 | lab-collabora | gcc-10 | x86_64_defcon...6-chromebook | 1

Details: https://kernelci.org/test/plan/id/62e0b117e66615f436daf07a

Results: 0 PASS, 1 FAIL, 0 SKIP
Full config: x86_64_defconfig+x86-chromebook
Compiler: gcc-10 (gcc (Debian 10.2.1-6) 10.2.1 20210110)
Plain log: https://storage.kernelci.org//cip-gitlab/ci-pavel-linux-test/v4.4-st5-585-gc99f2b257bde/x86_64/x86_64_defconfig+x86-chromebook/gcc-10/lab-collabora/ltp-pty-asus-C523NA-A20057-coral.txt
HTML log: https://storage.kernelci.org//cip-gitlab/ci-pavel-linux-test/v4.4-st5-585-gc99f2b257bde/x86_64/x86_64_defconfig+x86-chromebook/gcc-10/lab-collabora/ltp-pty-asus-C523NA-A20057-coral.html
Rootfs: http://storage.kernelci.org/images/rootfs/debian/bullseye-ltp/20220716.0/amd64/initrd.cpio.gz


* ltp-pty.login: https://kernelci.org/test/case/id/62e0b117e66615f436daf07b
failing since 0 day (last pass: v5.10.129-cip12-36-g21d9d56f4de5a, first fail: v4.4-st5-586-geb97410e0086c)



platform | arch | lab | compiler | defconfig | regressions
--------------------------+--------+---------------+----------+------------------------------+------------
hp-11A-G6-EE-grunt | x86_64 | lab-collabora | gcc-10 | x86_64_defcon...6-chromebook | 1

Details: https://kernelci.org/test/plan/id/62e0b0d7fd8baa0417daf082

Results: 0 PASS, 1 FAIL, 0 SKIP
Full config: x86_64_defconfig+x86-chromebook
Compiler: gcc-10 (gcc (Debian 10.2.1-6) 10.2.1 20210110)
Plain log: https://storage.kernelci.org//cip-gitlab/ci-pavel-linux-test/v4.4-st5-585-gc99f2b257bde/x86_64/x86_64_defconfig+x86-chromebook/gcc-10/lab-collabora/ltp-pty-hp-11A-G6-EE-grunt.txt
HTML log: https://storage.kernelci.org//cip-gitlab/ci-pavel-linux-test/v4.4-st5-585-gc99f2b257bde/x86_64/x86_64_defconfig+x86-chromebook/gcc-10/lab-collabora/ltp-pty-hp-11A-G6-EE-grunt.html
Rootfs: http://storage.kernelci.org/images/rootfs/debian/bullseye-ltp/20220716.0/amd64/initrd.cpio.gz


* ltp-pty.login: https://kernelci.org/test/case/id/62e0b0d7fd8baa0417daf083
failing since 0 day (last pass: v5.10.129-cip12-36-g21d9d56f4de5a, first fail: v4.4-st5-586-geb97410e0086c)


cip-gitlab/ci/pavel/linux-test ltp-mm: 4 runs, 4 regressions (v4.4-st5-585-gc99f2b257bde) #kernelci

kernelci.org bot <bot@...>
 

cip-gitlab/ci/pavel/linux-test ltp-mm: 4 runs, 4 regressions (v4.4-st5-585-gc99f2b257bde)

Regressions Summary
-------------------

platform | arch | lab | compiler | defconfig | regressions
-----------------------------+--------+---------------+----------+------------------------------+------------
asus-C436FA-Flip-hatch | x86_64 | lab-collabora | gcc-10 | x86_64_defcon...6-chromebook | 1
asus-C523NA-A20057-coral | x86_64 | lab-collabora | gcc-10 | x86_64_defcon...6-chromebook | 1
hp-11A-G6-EE-grunt | x86_64 | lab-collabora | gcc-10 | x86_64_defcon...6-chromebook | 1
hp-x360-12b-c...4020-octopus | x86_64 | lab-collabora | gcc-10 | x86_64_defcon...6-chromebook | 1

Details: https://kernelci.org/test/job/cip-gitlab/branch/ci%2Fpavel%2Flinux-test/kernel/v4.4-st5-585-gc99f2b257bde/plan/ltp-mm/

Test: ltp-mm
Tree: cip-gitlab
Branch: ci/pavel/linux-test
Describe: v4.4-st5-585-gc99f2b257bde
URL: https://gitlab.com/cip-project/cip-kernel/linux-cip.git
SHA: c99f2b257bde3cd60a833056aab624ad5fab3812

Test suite revisions:
ltp-tests
URL: https://github.com/linux-test-project/ltp.git
SHA: bda92ad659a52d38ac810099f69adff626b064c6


Test Regressions
----------------


platform | arch | lab | compiler | defconfig | regressions
-----------------------------+--------+---------------+----------+------------------------------+------------
asus-C436FA-Flip-hatch | x86_64 | lab-collabora | gcc-10 | x86_64_defcon...6-chromebook | 1

Details: https://kernelci.org/test/plan/id/62e0b1cbb27451e36cdaf059

Results: 0 PASS, 1 FAIL, 0 SKIP
Full config: x86_64_defconfig+x86-chromebook
Compiler: gcc-10 (gcc (Debian 10.2.1-6) 10.2.1 20210110)
Plain log: https://storage.kernelci.org//cip-gitlab/ci-pavel-linux-test/v4.4-st5-585-gc99f2b257bde/x86_64/x86_64_defconfig+x86-chromebook/gcc-10/lab-collabora/ltp-mm-asus-C436FA-Flip-hatch.txt
HTML log: https://storage.kernelci.org//cip-gitlab/ci-pavel-linux-test/v4.4-st5-585-gc99f2b257bde/x86_64/x86_64_defconfig+x86-chromebook/gcc-10/lab-collabora/ltp-mm-asus-C436FA-Flip-hatch.html
Rootfs: http://storage.kernelci.org/images/rootfs/debian/bullseye-ltp/20220716.0/amd64/initrd.cpio.gz


* ltp-mm.login: https://kernelci.org/test/case/id/62e0b1cbb27451e36cdaf05a
failing since 0 day (last pass: v5.10.129-cip12-36-g21d9d56f4de5a, first fail: v4.4-st5-586-geb97410e0086c)



platform | arch | lab | compiler | defconfig | regressions
-----------------------------+--------+---------------+----------+------------------------------+------------
asus-C523NA-A20057-coral | x86_64 | lab-collabora | gcc-10 | x86_64_defcon...6-chromebook | 1

Details: https://kernelci.org/test/plan/id/62e0b0c6ac1cc65984daf07d

Results: 0 PASS, 1 FAIL, 0 SKIP
Full config: x86_64_defconfig+x86-chromebook
Compiler: gcc-10 (gcc (Debian 10.2.1-6) 10.2.1 20210110)
Plain log: https://storage.kernelci.org//cip-gitlab/ci-pavel-linux-test/v4.4-st5-585-gc99f2b257bde/x86_64/x86_64_defconfig+x86-chromebook/gcc-10/lab-collabora/ltp-mm-asus-C523NA-A20057-coral.txt
HTML log: https://storage.kernelci.org//cip-gitlab/ci-pavel-linux-test/v4.4-st5-585-gc99f2b257bde/x86_64/x86_64_defconfig+x86-chromebook/gcc-10/lab-collabora/ltp-mm-asus-C523NA-A20057-coral.html
Rootfs: http://storage.kernelci.org/images/rootfs/debian/bullseye-ltp/20220716.0/amd64/initrd.cpio.gz


* ltp-mm.login: https://kernelci.org/test/case/id/62e0b0c6ac1cc65984daf07e
failing since 0 day (last pass: v5.10.129-cip12-36-g21d9d56f4de5a, first fail: v4.4-st5-586-geb97410e0086c)



platform | arch | lab | compiler | defconfig | regressions
-----------------------------+--------+---------------+----------+------------------------------+------------
hp-11A-G6-EE-grunt | x86_64 | lab-collabora | gcc-10 | x86_64_defcon...6-chromebook | 1

Details: https://kernelci.org/test/plan/id/62e0b12cbb46d10172daf080

Results: 0 PASS, 1 FAIL, 0 SKIP
Full config: x86_64_defconfig+x86-chromebook
Compiler: gcc-10 (gcc (Debian 10.2.1-6) 10.2.1 20210110)
Plain log: https://storage.kernelci.org//cip-gitlab/ci-pavel-linux-test/v4.4-st5-585-gc99f2b257bde/x86_64/x86_64_defconfig+x86-chromebook/gcc-10/lab-collabora/ltp-mm-hp-11A-G6-EE-grunt.txt
HTML log: https://storage.kernelci.org//cip-gitlab/ci-pavel-linux-test/v4.4-st5-585-gc99f2b257bde/x86_64/x86_64_defconfig+x86-chromebook/gcc-10/lab-collabora/ltp-mm-hp-11A-G6-EE-grunt.html
Rootfs: http://storage.kernelci.org/images/rootfs/debian/bullseye-ltp/20220716.0/amd64/initrd.cpio.gz


* ltp-mm.login: https://kernelci.org/test/case/id/62e0b12cbb46d10172daf081
failing since 0 day (last pass: v5.10.129-cip12-36-g21d9d56f4de5a, first fail: v4.4-st5-586-geb97410e0086c)



platform | arch | lab | compiler | defconfig | regressions
-----------------------------+--------+---------------+----------+------------------------------+------------
hp-x360-12b-c...4020-octopus | x86_64 | lab-collabora | gcc-10 | x86_64_defcon...6-chromebook | 1

Details: https://kernelci.org/test/plan/id/62e0b33d6bdf6ca513daf064

Results: 0 PASS, 1 FAIL, 0 SKIP
Full config: x86_64_defconfig+x86-chromebook
Compiler: gcc-10 (gcc (Debian 10.2.1-6) 10.2.1 20210110)
Plain log: https://storage.kernelci.org//cip-gitlab/ci-pavel-linux-test/v4.4-st5-585-gc99f2b257bde/x86_64/x86_64_defconfig+x86-chromebook/gcc-10/lab-collabora/ltp-mm-hp-x360-12b-ca0010nr-n4020-octopus.txt
HTML log: https://storage.kernelci.org//cip-gitlab/ci-pavel-linux-test/v4.4-st5-585-gc99f2b257bde/x86_64/x86_64_defconfig+x86-chromebook/gcc-10/lab-collabora/ltp-mm-hp-x360-12b-ca0010nr-n4020-octopus.html
Rootfs: http://storage.kernelci.org/images/rootfs/debian/bullseye-ltp/20220716.0/amd64/initrd.cpio.gz


* ltp-mm.login: https://kernelci.org/test/case/id/62e0b33d6bdf6ca513daf065
failing since 0 day (last pass: v5.10.129-cip12-36-g21d9d56f4de5a, first fail: v4.4-st5-586-geb97410e0086c)


cip-gitlab/ci/pavel/linux-test ltp-ipc: 8 runs, 6 regressions (v4.4-st5-585-gc99f2b257bde) #kernelci

kernelci.org bot <bot@...>
 

cip-gitlab/ci/pavel/linux-test ltp-ipc: 8 runs, 6 regressions (v4.4-st5-585-gc99f2b257bde)

Regressions Summary
-------------------

platform | arch | lab | compiler | defconfig | regressions
-----------------------------+--------+---------------+----------+------------------------------+------------
asus-C436FA-Flip-hatch | x86_64 | lab-collabora | gcc-10 | x86_64_defcon...6-chromebook | 1
asus-C523NA-A20057-coral | x86_64 | lab-collabora | gcc-10 | x86_64_defcon...6-chromebook | 1
asus-cx9400-volteer | x86_64 | lab-collabora | gcc-10 | x86_64_defcon...6-chromebook | 1
hp-11A-G6-EE-grunt | x86_64 | lab-collabora | gcc-10 | x86_64_defcon...6-chromebook | 1
hp-x360-12b-c...4020-octopus | x86_64 | lab-collabora | gcc-10 | x86_64_defcon...6-chromebook | 1
juno-uboot | arm64 | lab-broonie | gcc-10 | defconfig | 1

Details: https://kernelci.org/test/job/cip-gitlab/branch/ci%2Fpavel%2Flinux-test/kernel/v4.4-st5-585-gc99f2b257bde/plan/ltp-ipc/

Test: ltp-ipc
Tree: cip-gitlab
Branch: ci/pavel/linux-test
Describe: v4.4-st5-585-gc99f2b257bde
URL: https://gitlab.com/cip-project/cip-kernel/linux-cip.git
SHA: c99f2b257bde3cd60a833056aab624ad5fab3812

Test suite revisions:
ltp-tests
URL: https://github.com/linux-test-project/ltp.git
SHA: bda92ad659a52d38ac810099f69adff626b064c6


Test Regressions
----------------


platform | arch | lab | compiler | defconfig | regressions
-----------------------------+--------+---------------+----------+------------------------------+------------
asus-C436FA-Flip-hatch | x86_64 | lab-collabora | gcc-10 | x86_64_defcon...6-chromebook | 1

Details: https://kernelci.org/test/plan/id/62e0b1db53de665417daf06f

Results: 0 PASS, 1 FAIL, 0 SKIP
Full config: x86_64_defconfig+x86-chromebook
Compiler: gcc-10 (gcc (Debian 10.2.1-6) 10.2.1 20210110)
Plain log: https://storage.kernelci.org//cip-gitlab/ci-pavel-linux-test/v4.4-st5-585-gc99f2b257bde/x86_64/x86_64_defconfig+x86-chromebook/gcc-10/lab-collabora/ltp-ipc-asus-C436FA-Flip-hatch.txt
HTML log: https://storage.kernelci.org//cip-gitlab/ci-pavel-linux-test/v4.4-st5-585-gc99f2b257bde/x86_64/x86_64_defconfig+x86-chromebook/gcc-10/lab-collabora/ltp-ipc-asus-C436FA-Flip-hatch.html
Rootfs: http://storage.kernelci.org/images/rootfs/debian/bullseye-ltp/20220716.0/amd64/initrd.cpio.gz


* ltp-ipc.login: https://kernelci.org/test/case/id/62e0b1db53de665417daf070
failing since 0 day (last pass: v5.10.129-cip12-36-g21d9d56f4de5a, first fail: v4.4-st5-586-geb97410e0086c)



platform | arch | lab | compiler | defconfig | regressions
-----------------------------+--------+---------------+----------+------------------------------+------------
asus-C523NA-A20057-coral | x86_64 | lab-collabora | gcc-10 | x86_64_defcon...6-chromebook | 1

Details: https://kernelci.org/test/plan/id/62e0b0cbfd8baa0417daf059

Results: 0 PASS, 1 FAIL, 0 SKIP
Full config: x86_64_defconfig+x86-chromebook
Compiler: gcc-10 (gcc (Debian 10.2.1-6) 10.2.1 20210110)
Plain log: https://storage.kernelci.org//cip-gitlab/ci-pavel-linux-test/v4.4-st5-585-gc99f2b257bde/x86_64/x86_64_defconfig+x86-chromebook/gcc-10/lab-collabora/ltp-ipc-asus-C523NA-A20057-coral.txt
HTML log: https://storage.kernelci.org//cip-gitlab/ci-pavel-linux-test/v4.4-st5-585-gc99f2b257bde/x86_64/x86_64_defconfig+x86-chromebook/gcc-10/lab-collabora/ltp-ipc-asus-C523NA-A20057-coral.html
Rootfs: http://storage.kernelci.org/images/rootfs/debian/bullseye-ltp/20220716.0/amd64/initrd.cpio.gz


* ltp-ipc.login: https://kernelci.org/test/case/id/62e0b0cbfd8baa0417daf05a
failing since 0 day (last pass: v5.10.129-cip12-36-g21d9d56f4de5a, first fail: v4.4-st5-586-geb97410e0086c)



platform | arch | lab | compiler | defconfig | regressions
-----------------------------+--------+---------------+----------+------------------------------+------------
asus-cx9400-volteer | x86_64 | lab-collabora | gcc-10 | x86_64_defcon...6-chromebook | 1

Details: https://kernelci.org/test/plan/id/62e0b1ddb27451e36cdaf080

Results: 0 PASS, 1 FAIL, 0 SKIP
Full config: x86_64_defconfig+x86-chromebook
Compiler: gcc-10 (gcc (Debian 10.2.1-6) 10.2.1 20210110)
Plain log: https://storage.kernelci.org//cip-gitlab/ci-pavel-linux-test/v4.4-st5-585-gc99f2b257bde/x86_64/x86_64_defconfig+x86-chromebook/gcc-10/lab-collabora/ltp-ipc-asus-cx9400-volteer.txt
HTML log: https://storage.kernelci.org//cip-gitlab/ci-pavel-linux-test/v4.4-st5-585-gc99f2b257bde/x86_64/x86_64_defconfig+x86-chromebook/gcc-10/lab-collabora/ltp-ipc-asus-cx9400-volteer.html
Rootfs: http://storage.kernelci.org/images/rootfs/debian/bullseye-ltp/20220716.0/amd64/initrd.cpio.gz


* ltp-ipc.login: https://kernelci.org/test/case/id/62e0b1ddb27451e36cdaf081
failing since 0 day (last pass: v5.10.129-cip12-36-g21d9d56f4de5a, first fail: v4.4-st5-586-geb97410e0086c)



platform | arch | lab | compiler | defconfig | regressions
-----------------------------+--------+---------------+----------+------------------------------+------------
hp-11A-G6-EE-grunt | x86_64 | lab-collabora | gcc-10 | x86_64_defcon...6-chromebook | 1

Details: https://kernelci.org/test/plan/id/62e0b1905bba492157daf065

Results: 0 PASS, 1 FAIL, 0 SKIP
Full config: x86_64_defconfig+x86-chromebook
Compiler: gcc-10 (gcc (Debian 10.2.1-6) 10.2.1 20210110)
Plain log: https://storage.kernelci.org//cip-gitlab/ci-pavel-linux-test/v4.4-st5-585-gc99f2b257bde/x86_64/x86_64_defconfig+x86-chromebook/gcc-10/lab-collabora/ltp-ipc-hp-11A-G6-EE-grunt.txt
HTML log: https://storage.kernelci.org//cip-gitlab/ci-pavel-linux-test/v4.4-st5-585-gc99f2b257bde/x86_64/x86_64_defconfig+x86-chromebook/gcc-10/lab-collabora/ltp-ipc-hp-11A-G6-EE-grunt.html
Rootfs: http://storage.kernelci.org/images/rootfs/debian/bullseye-ltp/20220716.0/amd64/initrd.cpio.gz


* ltp-ipc.login: https://kernelci.org/test/case/id/62e0b1905bba492157daf066
failing since 0 day (last pass: v5.10.129-cip12-36-g21d9d56f4de5a, first fail: v4.4-st5-586-geb97410e0086c)



platform | arch | lab | compiler | defconfig | regressions
-----------------------------+--------+---------------+----------+------------------------------+------------
hp-x360-12b-c...4020-octopus | x86_64 | lab-collabora | gcc-10 | x86_64_defcon...6-chromebook | 1

Details: https://kernelci.org/test/plan/id/62e0b1d5b27451e36cdaf06e

Results: 0 PASS, 1 FAIL, 0 SKIP
Full config: x86_64_defconfig+x86-chromebook
Compiler: gcc-10 (gcc (Debian 10.2.1-6) 10.2.1 20210110)
Plain log: https://storage.kernelci.org//cip-gitlab/ci-pavel-linux-test/v4.4-st5-585-gc99f2b257bde/x86_64/x86_64_defconfig+x86-chromebook/gcc-10/lab-collabora/ltp-ipc-hp-x360-12b-ca0010nr-n4020-octopus.txt
HTML log: https://storage.kernelci.org//cip-gitlab/ci-pavel-linux-test/v4.4-st5-585-gc99f2b257bde/x86_64/x86_64_defconfig+x86-chromebook/gcc-10/lab-collabora/ltp-ipc-hp-x360-12b-ca0010nr-n4020-octopus.html
Rootfs: http://storage.kernelci.org/images/rootfs/debian/bullseye-ltp/20220716.0/amd64/initrd.cpio.gz


* ltp-ipc.login: https://kernelci.org/test/case/id/62e0b1d5b27451e36cdaf06f
failing since 0 day (last pass: v5.10.129-cip12-36-g21d9d56f4de5a, first fail: v4.4-st5-586-geb97410e0086c)



platform | arch | lab | compiler | defconfig | regressions
-----------------------------+--------+---------------+----------+------------------------------+------------
juno-uboot | arm64 | lab-broonie | gcc-10 | defconfig | 1

Details: https://kernelci.org/test/plan/id/62e1cb50b67a701246daf056

Results: 0 PASS, 1 FAIL, 0 SKIP
Full config: defconfig
Compiler: gcc-10 (aarch64-linux-gnu-gcc (Debian 10.2.1-6) 10.2.1 20210110)
Plain log: https://storage.kernelci.org//cip-gitlab/ci-pavel-linux-test/v4.4-st5-585-gc99f2b257bde/arm64/defconfig/gcc-10/lab-broonie/ltp-ipc-juno-uboot.txt
HTML log: https://storage.kernelci.org//cip-gitlab/ci-pavel-linux-test/v4.4-st5-585-gc99f2b257bde/arm64/defconfig/gcc-10/lab-broonie/ltp-ipc-juno-uboot.html
Rootfs: http://storage.kernelci.org/images/rootfs/debian/bullseye-ltp/20220716.0/arm64/initrd.cpio.gz


* ltp-ipc.login: https://kernelci.org/test/case/id/62e1cb50b67a701246daf057
failing since 0 day (last pass: v5.10.129-cip12-36-g21d9d56f4de5a, first fail: v4.4-st5-586-geb97410e0086c)


cip-gitlab/ci/pavel/linux-test ltp-fcntl-locktests: 4 runs, 4 regressions (v4.4-st5-585-gc99f2b257bde) #kernelci

kernelci.org bot <bot@...>
 

cip-gitlab/ci/pavel/linux-test ltp-fcntl-locktests: 4 runs, 4 regressions (v4.4-st5-585-gc99f2b257bde)

Regressions Summary
-------------------

platform | arch | lab | compiler | defconfig | regressions
--------------------------+--------+---------------+----------+------------------------------+------------
asus-C433TA-AJ0005-rammus | x86_64 | lab-collabora | gcc-10 | x86_64_defcon...6-chromebook | 1
asus-C523NA-A20057-coral | x86_64 | lab-collabora | gcc-10 | x86_64_defcon...6-chromebook | 1
hp-11A-G6-EE-grunt | x86_64 | lab-collabora | gcc-10 | x86_64_defcon...6-chromebook | 1
juno-uboot | arm64 | lab-broonie | gcc-10 | defconfig | 1

Details: https://kernelci.org/test/job/cip-gitlab/branch/ci%2Fpavel%2Flinux-test/kernel/v4.4-st5-585-gc99f2b257bde/plan/ltp-fcntl-locktests/

Test: ltp-fcntl-locktests
Tree: cip-gitlab
Branch: ci/pavel/linux-test
Describe: v4.4-st5-585-gc99f2b257bde
URL: https://gitlab.com/cip-project/cip-kernel/linux-cip.git
SHA: c99f2b257bde3cd60a833056aab624ad5fab3812

Test suite revisions:
ltp-tests
URL: https://github.com/linux-test-project/ltp.git
SHA: bda92ad659a52d38ac810099f69adff626b064c6


Test Regressions
----------------


platform | arch | lab | compiler | defconfig | regressions
--------------------------+--------+---------------+----------+------------------------------+------------
asus-C433TA-AJ0005-rammus | x86_64 | lab-collabora | gcc-10 | x86_64_defcon...6-chromebook | 1

Details: https://kernelci.org/test/plan/id/62e0b0d0fd8baa0417daf05c

Results: 0 PASS, 1 FAIL, 0 SKIP
Full config: x86_64_defconfig+x86-chromebook
Compiler: gcc-10 (gcc (Debian 10.2.1-6) 10.2.1 20210110)
Plain log: https://storage.kernelci.org//cip-gitlab/ci-pavel-linux-test/v4.4-st5-585-gc99f2b257bde/x86_64/x86_64_defconfig+x86-chromebook/gcc-10/lab-collabora/ltp-fcntl-locktests-asus-C433TA-AJ0005-rammus.txt
HTML log: https://storage.kernelci.org//cip-gitlab/ci-pavel-linux-test/v4.4-st5-585-gc99f2b257bde/x86_64/x86_64_defconfig+x86-chromebook/gcc-10/lab-collabora/ltp-fcntl-locktests-asus-C433TA-AJ0005-rammus.html
Rootfs: http://storage.kernelci.org/images/rootfs/debian/bullseye-ltp/20220716.0/amd64/initrd.cpio.gz


* ltp-fcntl-locktests.login: https://kernelci.org/test/case/id/62e0b0d0fd8baa0417daf05d
failing since 0 day (last pass: v5.10.129-cip12-36-g21d9d56f4de5a, first fail: v4.4-st5-586-geb97410e0086c)



platform | arch | lab | compiler | defconfig | regressions
--------------------------+--------+---------------+----------+------------------------------+------------
asus-C523NA-A20057-coral | x86_64 | lab-collabora | gcc-10 | x86_64_defcon...6-chromebook | 1

Details: https://kernelci.org/test/plan/id/62e0b1b7ef3df23dfedaf07c

Results: 0 PASS, 1 FAIL, 0 SKIP
Full config: x86_64_defconfig+x86-chromebook
Compiler: gcc-10 (gcc (Debian 10.2.1-6) 10.2.1 20210110)
Plain log: https://storage.kernelci.org//cip-gitlab/ci-pavel-linux-test/v4.4-st5-585-gc99f2b257bde/x86_64/x86_64_defconfig+x86-chromebook/gcc-10/lab-collabora/ltp-fcntl-locktests-asus-C523NA-A20057-coral.txt
HTML log: https://storage.kernelci.org//cip-gitlab/ci-pavel-linux-test/v4.4-st5-585-gc99f2b257bde/x86_64/x86_64_defconfig+x86-chromebook/gcc-10/lab-collabora/ltp-fcntl-locktests-asus-C523NA-A20057-coral.html
Rootfs: http://storage.kernelci.org/images/rootfs/debian/bullseye-ltp/20220716.0/amd64/initrd.cpio.gz


* ltp-fcntl-locktests.login: https://kernelci.org/test/case/id/62e0b1b7ef3df23dfedaf07d
failing since 0 day (last pass: v5.10.129-cip12-36-g21d9d56f4de5a, first fail: v4.4-st5-586-geb97410e0086c)



platform | arch | lab | compiler | defconfig | regressions
--------------------------+--------+---------------+----------+------------------------------+------------
hp-11A-G6-EE-grunt | x86_64 | lab-collabora | gcc-10 | x86_64_defcon...6-chromebook | 1

Details: https://kernelci.org/test/plan/id/62e0b12b0fd9fd6aa7daf056

Results: 0 PASS, 1 FAIL, 0 SKIP
Full config: x86_64_defconfig+x86-chromebook
Compiler: gcc-10 (gcc (Debian 10.2.1-6) 10.2.1 20210110)
Plain log: https://storage.kernelci.org//cip-gitlab/ci-pavel-linux-test/v4.4-st5-585-gc99f2b257bde/x86_64/x86_64_defconfig+x86-chromebook/gcc-10/lab-collabora/ltp-fcntl-locktests-hp-11A-G6-EE-grunt.txt
HTML log: https://storage.kernelci.org//cip-gitlab/ci-pavel-linux-test/v4.4-st5-585-gc99f2b257bde/x86_64/x86_64_defconfig+x86-chromebook/gcc-10/lab-collabora/ltp-fcntl-locktests-hp-11A-G6-EE-grunt.html
Rootfs: http://storage.kernelci.org/images/rootfs/debian/bullseye-ltp/20220716.0/amd64/initrd.cpio.gz


* ltp-fcntl-locktests.login: https://kernelci.org/test/case/id/62e0b12b0fd9fd6aa7daf057
failing since 0 day (last pass: v5.10.129-cip12-36-g21d9d56f4de5a, first fail: v4.4-st5-586-geb97410e0086c)



platform | arch | lab | compiler | defconfig | regressions
--------------------------+--------+---------------+----------+------------------------------+------------
juno-uboot | arm64 | lab-broonie | gcc-10 | defconfig | 1

Details: https://kernelci.org/test/plan/id/62e1c9d4062de25f36daf056

Results: 0 PASS, 1 FAIL, 0 SKIP
Full config: defconfig
Compiler: gcc-10 (aarch64-linux-gnu-gcc (Debian 10.2.1-6) 10.2.1 20210110)
Plain log: https://storage.kernelci.org//cip-gitlab/ci-pavel-linux-test/v4.4-st5-585-gc99f2b257bde/arm64/defconfig/gcc-10/lab-broonie/ltp-fcntl-locktests-juno-uboot.txt
HTML log: https://storage.kernelci.org//cip-gitlab/ci-pavel-linux-test/v4.4-st5-585-gc99f2b257bde/arm64/defconfig/gcc-10/lab-broonie/ltp-fcntl-locktests-juno-uboot.html
Rootfs: http://storage.kernelci.org/images/rootfs/debian/bullseye-ltp/20220716.0/arm64/initrd.cpio.gz


* ltp-fcntl-locktests.login: https://kernelci.org/test/case/id/62e1c9d4062de25f36daf057
new failure (last pass: v5.10.129-cip12-36-g21d9d56f4de5a)


cip-gitlab/ci/pavel/linux-test kselftest-futex: 7 runs, 5 regressions (v4.4-st5-585-gc99f2b257bde) #kernelci

kernelci.org bot <bot@...>
 

cip-gitlab/ci/pavel/linux-test kselftest-futex: 7 runs, 5 regressions (v4.4-st5-585-gc99f2b257bde)

Regressions Summary
-------------------

platform | arch | lab | compiler | defconfig | regressions
-----------------------------+--------+---------------+----------+------------------------------+------------
asus-C436FA-Flip-hatch | x86_64 | lab-collabora | gcc-10 | x86_64_defcon...6-chromebook | 1
asus-C523NA-A20057-coral | x86_64 | lab-collabora | gcc-10 | x86_64_defcon...6-chromebook | 1
hp-11A-G6-EE-grunt | x86_64 | lab-collabora | gcc-10 | x86_64_defcon...6-chromebook | 1
hp-x360-12b-c...4020-octopus | x86_64 | lab-collabora | gcc-10 | x86_64_defcon...6-chromebook | 1
juno-uboot | arm64 | lab-broonie | gcc-10 | defconfig | 1

Details: https://kernelci.org/test/job/cip-gitlab/branch/ci%2Fpavel%2Flinux-test/kernel/v4.4-st5-585-gc99f2b257bde/plan/kselftest-futex/

Test: kselftest-futex
Tree: cip-gitlab
Branch: ci/pavel/linux-test
Describe: v4.4-st5-585-gc99f2b257bde
URL: https://gitlab.com/cip-project/cip-kernel/linux-cip.git
SHA: c99f2b257bde3cd60a833056aab624ad5fab3812


Test Regressions
----------------


platform | arch | lab | compiler | defconfig | regressions
-----------------------------+--------+---------------+----------+------------------------------+------------
asus-C436FA-Flip-hatch | x86_64 | lab-collabora | gcc-10 | x86_64_defcon...6-chromebook | 1

Details: https://kernelci.org/test/plan/id/62e0b3446bdf6ca513daf06f

Results: 0 PASS, 1 FAIL, 0 SKIP
Full config: x86_64_defconfig+x86-chromebook
Compiler: gcc-10 (gcc (Debian 10.2.1-6) 10.2.1 20210110)
Plain log: https://storage.kernelci.org//cip-gitlab/ci-pavel-linux-test/v4.4-st5-585-gc99f2b257bde/x86_64/x86_64_defconfig+x86-chromebook/gcc-10/lab-collabora/kselftest-futex-asus-C436FA-Flip-hatch.txt
HTML log: https://storage.kernelci.org//cip-gitlab/ci-pavel-linux-test/v4.4-st5-585-gc99f2b257bde/x86_64/x86_64_defconfig+x86-chromebook/gcc-10/lab-collabora/kselftest-futex-asus-C436FA-Flip-hatch.html
Rootfs: http://storage.kernelci.org/images/rootfs/debian/bullseye-kselftest/20220718.0/amd64/initrd.cpio.gz


* kselftest-futex.login: https://kernelci.org/test/case/id/62e0b3446bdf6ca513daf070
failing since 0 day (last pass: v5.10.129-cip12-36-g21d9d56f4de5a, first fail: v4.4-st5-586-geb97410e0086c)



platform | arch | lab | compiler | defconfig | regressions
-----------------------------+--------+---------------+----------+------------------------------+------------
asus-C523NA-A20057-coral | x86_64 | lab-collabora | gcc-10 | x86_64_defcon...6-chromebook | 1

Details: https://kernelci.org/test/plan/id/62e0b1a7ef3df23dfedaf05a

Results: 0 PASS, 1 FAIL, 0 SKIP
Full config: x86_64_defconfig+x86-chromebook
Compiler: gcc-10 (gcc (Debian 10.2.1-6) 10.2.1 20210110)
Plain log: https://storage.kernelci.org//cip-gitlab/ci-pavel-linux-test/v4.4-st5-585-gc99f2b257bde/x86_64/x86_64_defconfig+x86-chromebook/gcc-10/lab-collabora/kselftest-futex-asus-C523NA-A20057-coral.txt
HTML log: https://storage.kernelci.org//cip-gitlab/ci-pavel-linux-test/v4.4-st5-585-gc99f2b257bde/x86_64/x86_64_defconfig+x86-chromebook/gcc-10/lab-collabora/kselftest-futex-asus-C523NA-A20057-coral.html
Rootfs: http://storage.kernelci.org/images/rootfs/debian/bullseye-kselftest/20220718.0/amd64/initrd.cpio.gz


* kselftest-futex.login: https://kernelci.org/test/case/id/62e0b1a7ef3df23dfedaf05b
failing since 0 day (last pass: v5.10.129-cip12-36-g21d9d56f4de5a, first fail: v4.4-st5-586-geb97410e0086c)



platform | arch | lab | compiler | defconfig | regressions
-----------------------------+--------+---------------+----------+------------------------------+------------
hp-11A-G6-EE-grunt | x86_64 | lab-collabora | gcc-10 | x86_64_defcon...6-chromebook | 1

Details: https://kernelci.org/test/plan/id/62e0b0d4fd8baa0417daf076

Results: 0 PASS, 1 FAIL, 0 SKIP
Full config: x86_64_defconfig+x86-chromebook
Compiler: gcc-10 (gcc (Debian 10.2.1-6) 10.2.1 20210110)
Plain log: https://storage.kernelci.org//cip-gitlab/ci-pavel-linux-test/v4.4-st5-585-gc99f2b257bde/x86_64/x86_64_defconfig+x86-chromebook/gcc-10/lab-collabora/kselftest-futex-hp-11A-G6-EE-grunt.txt
HTML log: https://storage.kernelci.org//cip-gitlab/ci-pavel-linux-test/v4.4-st5-585-gc99f2b257bde/x86_64/x86_64_defconfig+x86-chromebook/gcc-10/lab-collabora/kselftest-futex-hp-11A-G6-EE-grunt.html
Rootfs: http://storage.kernelci.org/images/rootfs/debian/bullseye-kselftest/20220718.0/amd64/initrd.cpio.gz


* kselftest-futex.login: https://kernelci.org/test/case/id/62e0b0d4fd8baa0417daf077
failing since 0 day (last pass: v5.10.129-cip12-36-g21d9d56f4de5a, first fail: v4.4-st5-586-geb97410e0086c)



platform | arch | lab | compiler | defconfig | regressions
-----------------------------+--------+---------------+----------+------------------------------+------------
hp-x360-12b-c...4020-octopus | x86_64 | lab-collabora | gcc-10 | x86_64_defcon...6-chromebook | 1

Details: https://kernelci.org/test/plan/id/62e0b4738fd25dce30daf073

Results: 0 PASS, 1 FAIL, 0 SKIP
Full config: x86_64_defconfig+x86-chromebook
Compiler: gcc-10 (gcc (Debian 10.2.1-6) 10.2.1 20210110)
Plain log: https://storage.kernelci.org//cip-gitlab/ci-pavel-linux-test/v4.4-st5-585-gc99f2b257bde/x86_64/x86_64_defconfig+x86-chromebook/gcc-10/lab-collabora/kselftest-futex-hp-x360-12b-ca0010nr-n4020-octopus.txt
HTML log: https://storage.kernelci.org//cip-gitlab/ci-pavel-linux-test/v4.4-st5-585-gc99f2b257bde/x86_64/x86_64_defconfig+x86-chromebook/gcc-10/lab-collabora/kselftest-futex-hp-x360-12b-ca0010nr-n4020-octopus.html
Rootfs: http://storage.kernelci.org/images/rootfs/debian/bullseye-kselftest/20220718.0/amd64/initrd.cpio.gz


* kselftest-futex.login: https://kernelci.org/test/case/id/62e0b4738fd25dce30daf074
failing since 0 day (last pass: v5.10.129-cip12-36-g21d9d56f4de5a, first fail: v4.4-st5-586-geb97410e0086c)



platform | arch | lab | compiler | defconfig | regressions
-----------------------------+--------+---------------+----------+------------------------------+------------
juno-uboot | arm64 | lab-broonie | gcc-10 | defconfig | 1

Details: https://kernelci.org/test/plan/id/62e1c2f38967d09707daf05c

Results: 0 PASS, 1 FAIL, 0 SKIP
Full config: defconfig
Compiler: gcc-10 (aarch64-linux-gnu-gcc (Debian 10.2.1-6) 10.2.1 20210110)
Plain log: https://storage.kernelci.org//cip-gitlab/ci-pavel-linux-test/v4.4-st5-585-gc99f2b257bde/arm64/defconfig/gcc-10/lab-broonie/kselftest-futex-juno-uboot.txt
HTML log: https://storage.kernelci.org//cip-gitlab/ci-pavel-linux-test/v4.4-st5-585-gc99f2b257bde/arm64/defconfig/gcc-10/lab-broonie/kselftest-futex-juno-uboot.html
Rootfs: http://storage.kernelci.org/images/rootfs/debian/bullseye-kselftest/20220718.0/arm64/initrd.cpio.gz


* kselftest-futex.login: https://kernelci.org/test/case/id/62e1c2f38967d09707daf05d
failing since 0 day (last pass: v5.10.129-cip12-36-g21d9d56f4de5a, first fail: v4.4-st5-586-geb97410e0086c)


cip-gitlab/ci/pavel/linux-test kselftest-filesystems: 7 runs, 4 regressions (v4.4-st5-585-gc99f2b257bde) #kernelci

kernelci.org bot <bot@...>
 

cip-gitlab/ci/pavel/linux-test kselftest-filesystems: 7 runs, 4 regressions (v4.4-st5-585-gc99f2b257bde)

Regressions Summary
-------------------

platform | arch | lab | compiler | defconfig | regressions
-----------------------------+--------+---------------+----------+------------------------------+------------
asus-C436FA-Flip-hatch | x86_64 | lab-collabora | gcc-10 | x86_64_defcon...6-chromebook | 1
asus-C523NA-A20057-coral | x86_64 | lab-collabora | gcc-10 | x86_64_defcon...6-chromebook | 1
hp-11A-G6-EE-grunt | x86_64 | lab-collabora | gcc-10 | x86_64_defcon...6-chromebook | 1
hp-x360-12b-c...4020-octopus | x86_64 | lab-collabora | gcc-10 | x86_64_defcon...6-chromebook | 1

Details: https://kernelci.org/test/job/cip-gitlab/branch/ci%2Fpavel%2Flinux-test/kernel/v4.4-st5-585-gc99f2b257bde/plan/kselftest-filesystems/

Test: kselftest-filesystems
Tree: cip-gitlab
Branch: ci/pavel/linux-test
Describe: v4.4-st5-585-gc99f2b257bde
URL: https://gitlab.com/cip-project/cip-kernel/linux-cip.git
SHA: c99f2b257bde3cd60a833056aab624ad5fab3812


Test Regressions
----------------


platform | arch | lab | compiler | defconfig | regressions
-----------------------------+--------+---------------+----------+------------------------------+------------
asus-C436FA-Flip-hatch | x86_64 | lab-collabora | gcc-10 | x86_64_defcon...6-chromebook | 1

Details: https://kernelci.org/test/plan/id/62e0b31eeabb58f740daf062

Results: 0 PASS, 1 FAIL, 0 SKIP
Full config: x86_64_defconfig+x86-chromebook
Compiler: gcc-10 (gcc (Debian 10.2.1-6) 10.2.1 20210110)
Plain log: https://storage.kernelci.org//cip-gitlab/ci-pavel-linux-test/v4.4-st5-585-gc99f2b257bde/x86_64/x86_64_defconfig+x86-chromebook/gcc-10/lab-collabora/kselftest-filesystems-asus-C436FA-Flip-hatch.txt
HTML log: https://storage.kernelci.org//cip-gitlab/ci-pavel-linux-test/v4.4-st5-585-gc99f2b257bde/x86_64/x86_64_defconfig+x86-chromebook/gcc-10/lab-collabora/kselftest-filesystems-asus-C436FA-Flip-hatch.html
Rootfs: http://storage.kernelci.org/images/rootfs/debian/bullseye-kselftest/20220718.0/amd64/initrd.cpio.gz


* kselftest-filesystems.login: https://kernelci.org/test/case/id/62e0b31eeabb58f740daf063
failing since 0 day (last pass: v5.10.129-cip12-36-g21d9d56f4de5a, first fail: v4.4-st5-586-geb97410e0086c)



platform | arch | lab | compiler | defconfig | regressions
-----------------------------+--------+---------------+----------+------------------------------+------------
asus-C523NA-A20057-coral | x86_64 | lab-collabora | gcc-10 | x86_64_defcon...6-chromebook | 1

Details: https://kernelci.org/test/plan/id/62e0b17b5bba492157daf057

Results: 0 PASS, 1 FAIL, 0 SKIP
Full config: x86_64_defconfig+x86-chromebook
Compiler: gcc-10 (gcc (Debian 10.2.1-6) 10.2.1 20210110)
Plain log: https://storage.kernelci.org//cip-gitlab/ci-pavel-linux-test/v4.4-st5-585-gc99f2b257bde/x86_64/x86_64_defconfig+x86-chromebook/gcc-10/lab-collabora/kselftest-filesystems-asus-C523NA-A20057-coral.txt
HTML log: https://storage.kernelci.org//cip-gitlab/ci-pavel-linux-test/v4.4-st5-585-gc99f2b257bde/x86_64/x86_64_defconfig+x86-chromebook/gcc-10/lab-collabora/kselftest-filesystems-asus-C523NA-A20057-coral.html
Rootfs: http://storage.kernelci.org/images/rootfs/debian/bullseye-kselftest/20220718.0/amd64/initrd.cpio.gz


* kselftest-filesystems.login: https://kernelci.org/test/case/id/62e0b17b5bba492157daf058
failing since 0 day (last pass: v5.10.129-cip12-36-g21d9d56f4de5a, first fail: v4.4-st5-586-geb97410e0086c)



platform | arch | lab | compiler | defconfig | regressions
-----------------------------+--------+---------------+----------+------------------------------+------------
hp-11A-G6-EE-grunt | x86_64 | lab-collabora | gcc-10 | x86_64_defcon...6-chromebook | 1

Details: https://kernelci.org/test/plan/id/62e0b14e0fd9fd6aa7daf069

Results: 0 PASS, 1 FAIL, 0 SKIP
Full config: x86_64_defconfig+x86-chromebook
Compiler: gcc-10 (gcc (Debian 10.2.1-6) 10.2.1 20210110)
Plain log: https://storage.kernelci.org//cip-gitlab/ci-pavel-linux-test/v4.4-st5-585-gc99f2b257bde/x86_64/x86_64_defconfig+x86-chromebook/gcc-10/lab-collabora/kselftest-filesystems-hp-11A-G6-EE-grunt.txt
HTML log: https://storage.kernelci.org//cip-gitlab/ci-pavel-linux-test/v4.4-st5-585-gc99f2b257bde/x86_64/x86_64_defconfig+x86-chromebook/gcc-10/lab-collabora/kselftest-filesystems-hp-11A-G6-EE-grunt.html
Rootfs: http://storage.kernelci.org/images/rootfs/debian/bullseye-kselftest/20220718.0/amd64/initrd.cpio.gz


* kselftest-filesystems.login: https://kernelci.org/test/case/id/62e0b14e0fd9fd6aa7daf06a
failing since 0 day (last pass: v5.10.129-cip12-36-g21d9d56f4de5a, first fail: v4.4-st5-586-geb97410e0086c)



platform | arch | lab | compiler | defconfig | regressions
-----------------------------+--------+---------------+----------+------------------------------+------------
hp-x360-12b-c...4020-octopus | x86_64 | lab-collabora | gcc-10 | x86_64_defcon...6-chromebook | 1

Details: https://kernelci.org/test/plan/id/62e0b23c43d1bb1072daf059

Results: 0 PASS, 1 FAIL, 0 SKIP
Full config: x86_64_defconfig+x86-chromebook
Compiler: gcc-10 (gcc (Debian 10.2.1-6) 10.2.1 20210110)
Plain log: https://storage.kernelci.org//cip-gitlab/ci-pavel-linux-test/v4.4-st5-585-gc99f2b257bde/x86_64/x86_64_defconfig+x86-chromebook/gcc-10/lab-collabora/kselftest-filesystems-hp-x360-12b-ca0010nr-n4020-octopus.txt
HTML log: https://storage.kernelci.org//cip-gitlab/ci-pavel-linux-test/v4.4-st5-585-gc99f2b257bde/x86_64/x86_64_defconfig+x86-chromebook/gcc-10/lab-collabora/kselftest-filesystems-hp-x360-12b-ca0010nr-n4020-octopus.html
Rootfs: http://storage.kernelci.org/images/rootfs/debian/bullseye-kselftest/20220718.0/amd64/initrd.cpio.gz


* kselftest-filesystems.login: https://kernelci.org/test/case/id/62e0b23c43d1bb1072daf05a
failing since 0 day (last pass: v5.10.129-cip12-36-g21d9d56f4de5a, first fail: v4.4-st5-586-geb97410e0086c)


Re: CIP IRC weekly meeting today on libera.chat

Chris Paterson
 

Hello Jan, all,

From: cip-dev@... <cip-dev@...> On
Behalf Of Jan Kiszka via lists.cip-project.org
Sent: 28 July 2022 08:11

Hi all,

Kindly be reminded to attend the weekly meeting through IRC to discuss
technical topics with CIP kernel today. Our channel is the following:
Please accept my apologies for the meeting today.

[...]


* Action items
1. Resolve/ignore failures of KernelCI on 4.4-cip - alicefm
2. Check cip devices on kernelci old pull request - patersonc
No updates.

* Kernel maintenance updates
* Kernel testing
All LAVA labs/boards are online again.
I'm not sure what happened last week, but I've been away since today, hence not addressing the issues sooner.

Kind regards, Chris

* AOB

Jan


cip-gitlab/ci/pavel/linux-test baseline-nfs: 26 runs, 11 regressions (v4.4-st5-585-gc99f2b257bde) #kernelci

kernelci.org bot <bot@...>
 

cip-gitlab/ci/pavel/linux-test baseline-nfs: 26 runs, 11 regressions (v4.4-st5-585-gc99f2b257bde)

Regressions Summary
-------------------

platform | arch | lab | compiler | defconfig | regressions
-----------------------------+--------+---------------+----------+------------------------------+------------
asus-C433TA-AJ0005-rammus | x86_64 | lab-collabora | gcc-10 | x86_64_defcon...6-chromebook | 1
asus-C436FA-Flip-hatch | x86_64 | lab-collabora | gcc-10 | x86_64_defcon...6-chromebook | 1
asus-C523NA-A20057-coral | x86_64 | lab-collabora | gcc-10 | x86_64_defcon...6-chromebook | 1
asus-cx9400-volteer | x86_64 | lab-collabora | gcc-10 | x86_64_defcon...6-chromebook | 1
beaglebone-black | arm | lab-cip | gcc-10 | multi_v7_defconfig | 1
hp-11A-G6-EE-grunt | x86_64 | lab-collabora | gcc-10 | x86_64_defcon...6-chromebook | 1
hp-x360-12b-c...4020-octopus | x86_64 | lab-collabora | gcc-10 | x86_64_defcon...6-chromebook | 1
hp-x360-14-G1-sona | x86_64 | lab-collabora | gcc-10 | x86_64_defcon...6-chromebook | 1
juno-uboot | arm64 | lab-broonie | gcc-10 | defconfig | 1
rk3288-veyron-jaq | arm | lab-collabora | gcc-10 | multi_v7_defconfig | 1
sun4i-a10-olinuxino-lime | arm | lab-baylibre | gcc-10 | sunxi_defconfig | 1

Details: https://kernelci.org/test/job/cip-gitlab/branch/ci%2Fpavel%2Flinux-test/kernel/v4.4-st5-585-gc99f2b257bde/plan/baseline-nfs/

Test: baseline-nfs
Tree: cip-gitlab
Branch: ci/pavel/linux-test
Describe: v4.4-st5-585-gc99f2b257bde
URL: https://gitlab.com/cip-project/cip-kernel/linux-cip.git
SHA: c99f2b257bde3cd60a833056aab624ad5fab3812


Test Regressions
----------------


platform | arch | lab | compiler | defconfig | regressions
-----------------------------+--------+---------------+----------+------------------------------+------------
asus-C433TA-AJ0005-rammus | x86_64 | lab-collabora | gcc-10 | x86_64_defcon...6-chromebook | 1

Details: https://kernelci.org/test/plan/id/62e0b0b4ac1cc65984daf06a

Results: 0 PASS, 1 FAIL, 0 SKIP
Full config: x86_64_defconfig+x86-chromebook
Compiler: gcc-10 (gcc (Debian 10.2.1-6) 10.2.1 20210110)
Plain log: https://storage.kernelci.org//cip-gitlab/ci-pavel-linux-test/v4.4-st5-585-gc99f2b257bde/x86_64/x86_64_defconfig+x86-chromebook/gcc-10/lab-collabora/baseline-nfs-asus-C433TA-AJ0005-rammus.txt
HTML log: https://storage.kernelci.org//cip-gitlab/ci-pavel-linux-test/v4.4-st5-585-gc99f2b257bde/x86_64/x86_64_defconfig+x86-chromebook/gcc-10/lab-collabora/baseline-nfs-asus-C433TA-AJ0005-rammus.html
Rootfs: http://storage.kernelci.org/images/rootfs/debian/bullseye/20220718.0/amd64/initrd.cpio.gz


* baseline-nfs.login: https://kernelci.org/test/case/id/62e0b0b4ac1cc65984daf06b
failing since 0 day (last pass: v5.10.129-cip12-36-g21d9d56f4de5a, first fail: v4.4-st5-586-geb97410e0086c)



platform | arch | lab | compiler | defconfig | regressions
-----------------------------+--------+---------------+----------+------------------------------+------------
asus-C436FA-Flip-hatch | x86_64 | lab-collabora | gcc-10 | x86_64_defcon...6-chromebook | 1

Details: https://kernelci.org/test/plan/id/62e0b1b6d14a67a1c2daf098

Results: 0 PASS, 1 FAIL, 0 SKIP
Full config: x86_64_defconfig+x86-chromebook
Compiler: gcc-10 (gcc (Debian 10.2.1-6) 10.2.1 20210110)
Plain log: https://storage.kernelci.org//cip-gitlab/ci-pavel-linux-test/v4.4-st5-585-gc99f2b257bde/x86_64/x86_64_defconfig+x86-chromebook/gcc-10/lab-collabora/baseline-nfs-asus-C436FA-Flip-hatch.txt
HTML log: https://storage.kernelci.org//cip-gitlab/ci-pavel-linux-test/v4.4-st5-585-gc99f2b257bde/x86_64/x86_64_defconfig+x86-chromebook/gcc-10/lab-collabora/baseline-nfs-asus-C436FA-Flip-hatch.html
Rootfs: http://storage.kernelci.org/images/rootfs/debian/bullseye/20220718.0/amd64/initrd.cpio.gz


* baseline-nfs.login: https://kernelci.org/test/case/id/62e0b1b6d14a67a1c2daf099
failing since 0 day (last pass: v5.10.129-cip12-36-g21d9d56f4de5a, first fail: v4.4-st5-586-geb97410e0086c)



platform | arch | lab | compiler | defconfig | regressions
-----------------------------+--------+---------------+----------+------------------------------+------------
asus-C523NA-A20057-coral | x86_64 | lab-collabora | gcc-10 | x86_64_defcon...6-chromebook | 1

Details: https://kernelci.org/test/plan/id/62e0b17f5bba492157daf05d

Results: 0 PASS, 1 FAIL, 0 SKIP
Full config: x86_64_defconfig+x86-chromebook
Compiler: gcc-10 (gcc (Debian 10.2.1-6) 10.2.1 20210110)
Plain log: https://storage.kernelci.org//cip-gitlab/ci-pavel-linux-test/v4.4-st5-585-gc99f2b257bde/x86_64/x86_64_defconfig+x86-chromebook/gcc-10/lab-collabora/baseline-nfs-asus-C523NA-A20057-coral.txt
HTML log: https://storage.kernelci.org//cip-gitlab/ci-pavel-linux-test/v4.4-st5-585-gc99f2b257bde/x86_64/x86_64_defconfig+x86-chromebook/gcc-10/lab-collabora/baseline-nfs-asus-C523NA-A20057-coral.html
Rootfs: http://storage.kernelci.org/images/rootfs/debian/bullseye/20220718.0/amd64/initrd.cpio.gz


* baseline-nfs.login: https://kernelci.org/test/case/id/62e0b17f5bba492157daf05e
failing since 0 day (last pass: v5.10.129-cip12-36-g21d9d56f4de5a, first fail: v4.4-st5-586-geb97410e0086c)



platform | arch | lab | compiler | defconfig | regressions
-----------------------------+--------+---------------+----------+------------------------------+------------
asus-cx9400-volteer | x86_64 | lab-collabora | gcc-10 | x86_64_defcon...6-chromebook | 1

Details: https://kernelci.org/test/plan/id/62e0b1c7b27451e36cdaf056

Results: 0 PASS, 1 FAIL, 0 SKIP
Full config: x86_64_defconfig+x86-chromebook
Compiler: gcc-10 (gcc (Debian 10.2.1-6) 10.2.1 20210110)
Plain log: https://storage.kernelci.org//cip-gitlab/ci-pavel-linux-test/v4.4-st5-585-gc99f2b257bde/x86_64/x86_64_defconfig+x86-chromebook/gcc-10/lab-collabora/baseline-nfs-asus-cx9400-volteer.txt
HTML log: https://storage.kernelci.org//cip-gitlab/ci-pavel-linux-test/v4.4-st5-585-gc99f2b257bde/x86_64/x86_64_defconfig+x86-chromebook/gcc-10/lab-collabora/baseline-nfs-asus-cx9400-volteer.html
Rootfs: http://storage.kernelci.org/images/rootfs/debian/bullseye/20220718.0/amd64/initrd.cpio.gz


* baseline-nfs.login: https://kernelci.org/test/case/id/62e0b1c7b27451e36cdaf057
failing since 0 day (last pass: v5.10.129-cip12-36-g21d9d56f4de5a, first fail: v4.4-st5-586-geb97410e0086c)



platform | arch | lab | compiler | defconfig | regressions
-----------------------------+--------+---------------+----------+------------------------------+------------
beaglebone-black | arm | lab-cip | gcc-10 | multi_v7_defconfig | 1

Details: https://kernelci.org/test/plan/id/62e0b5aeee47496d50daf057

Results: 3 PASS, 1 FAIL, 1 SKIP
Full config: multi_v7_defconfig
Compiler: gcc-10 (arm-linux-gnueabihf-gcc (Debian 10.2.1-6) 10.2.1 20210110)
Plain log: https://storage.kernelci.org//cip-gitlab/ci-pavel-linux-test/v4.4-st5-585-gc99f2b257bde/arm/multi_v7_defconfig/gcc-10/lab-cip/baseline-nfs-beaglebone-black.txt
HTML log: https://storage.kernelci.org//cip-gitlab/ci-pavel-linux-test/v4.4-st5-585-gc99f2b257bde/arm/multi_v7_defconfig/gcc-10/lab-cip/baseline-nfs-beaglebone-black.html
Rootfs: http://storage.kernelci.org/images/rootfs/debian/bullseye/20220718.0/armhf/initrd.cpio.gz


* baseline-nfs.dmesg.crit: https://kernelci.org/test/case/id/62e0b5aeee47496d50daf05c
failing since 0 day (last pass: v5.10.129-cip12-36-g21d9d56f4de5a, first fail: v4.4-st5-586-geb97410e0086c)
1 lines

2022-07-27T03:48:48.248244 / #
2022-07-27T03:48:48.250529
2022-07-27T03:48:53.260035 / # export NFS_ROOTFS='/var/lib/lava/dispatcher/tmp/716783/extract-nfsrootfs-va054nc8'
2022-07-27T03:48:53.270727 export NFS_ROOTFS='/var/lib/lava/dispatcher/tmp/716783/extract-nfsrootfs-va054nc8'
2022-07-27T03:48:55.437197 / # export NFS_SERVER_IP='192.168.11.5'
2022-07-27T03:48:55.447835 export NFS_SERVER_IP='192.168.11.5'
2022-07-27T03:48:55.551165 / # #
2022-07-27T03:48:55.553489 #
2022-07-27T03:48:55.656664 / # export SHELL=/bin/sh
2022-07-27T03:48:55.659012 export SHELL=/bin/sh
... (13 line(s) more)



platform | arch | lab | compiler | defconfig | regressions
-----------------------------+--------+---------------+----------+------------------------------+------------
hp-11A-G6-EE-grunt | x86_64 | lab-collabora | gcc-10 | x86_64_defcon...6-chromebook | 1

Details: https://kernelci.org/test/plan/id/62e0b135bb46d10172daf086

Results: 0 PASS, 1 FAIL, 0 SKIP
Full config: x86_64_defconfig+x86-chromebook
Compiler: gcc-10 (gcc (Debian 10.2.1-6) 10.2.1 20210110)
Plain log: https://storage.kernelci.org//cip-gitlab/ci-pavel-linux-test/v4.4-st5-585-gc99f2b257bde/x86_64/x86_64_defconfig+x86-chromebook/gcc-10/lab-collabora/baseline-nfs-hp-11A-G6-EE-grunt.txt
HTML log: https://storage.kernelci.org//cip-gitlab/ci-pavel-linux-test/v4.4-st5-585-gc99f2b257bde/x86_64/x86_64_defconfig+x86-chromebook/gcc-10/lab-collabora/baseline-nfs-hp-11A-G6-EE-grunt.html
Rootfs: http://storage.kernelci.org/images/rootfs/debian/bullseye/20220718.0/amd64/initrd.cpio.gz


* baseline-nfs.login: https://kernelci.org/test/case/id/62e0b135bb46d10172daf087
failing since 0 day (last pass: v5.10.129-cip12-36-g21d9d56f4de5a, first fail: v4.4-st5-586-geb97410e0086c)



platform | arch | lab | compiler | defconfig | regressions
-----------------------------+--------+---------------+----------+------------------------------+------------
hp-x360-12b-c...4020-octopus | x86_64 | lab-collabora | gcc-10 | x86_64_defcon...6-chromebook | 1

Details: https://kernelci.org/test/plan/id/62e0b30beabb58f740daf058

Results: 0 PASS, 1 FAIL, 0 SKIP
Full config: x86_64_defconfig+x86-chromebook
Compiler: gcc-10 (gcc (Debian 10.2.1-6) 10.2.1 20210110)
Plain log: https://storage.kernelci.org//cip-gitlab/ci-pavel-linux-test/v4.4-st5-585-gc99f2b257bde/x86_64/x86_64_defconfig+x86-chromebook/gcc-10/lab-collabora/baseline-nfs-hp-x360-12b-ca0010nr-n4020-octopus.txt
HTML log: https://storage.kernelci.org//cip-gitlab/ci-pavel-linux-test/v4.4-st5-585-gc99f2b257bde/x86_64/x86_64_defconfig+x86-chromebook/gcc-10/lab-collabora/baseline-nfs-hp-x360-12b-ca0010nr-n4020-octopus.html
Rootfs: http://storage.kernelci.org/images/rootfs/debian/bullseye/20220718.0/amd64/initrd.cpio.gz


* baseline-nfs.login: https://kernelci.org/test/case/id/62e0b30beabb58f740daf059
failing since 0 day (last pass: v5.10.129-cip12-36-g21d9d56f4de5a, first fail: v4.4-st5-586-geb97410e0086c)



platform | arch | lab | compiler | defconfig | regressions
-----------------------------+--------+---------------+----------+------------------------------+------------
hp-x360-14-G1-sona | x86_64 | lab-collabora | gcc-10 | x86_64_defcon...6-chromebook | 1

Details: https://kernelci.org/test/plan/id/62e0b78ac79b59e730daf058

Results: 0 PASS, 1 FAIL, 0 SKIP
Full config: x86_64_defconfig+x86-chromebook
Compiler: gcc-10 (gcc (Debian 10.2.1-6) 10.2.1 20210110)
Plain log: https://storage.kernelci.org//cip-gitlab/ci-pavel-linux-test/v4.4-st5-585-gc99f2b257bde/x86_64/x86_64_defconfig+x86-chromebook/gcc-10/lab-collabora/baseline-nfs-hp-x360-14-G1-sona.txt
HTML log: https://storage.kernelci.org//cip-gitlab/ci-pavel-linux-test/v4.4-st5-585-gc99f2b257bde/x86_64/x86_64_defconfig+x86-chromebook/gcc-10/lab-collabora/baseline-nfs-hp-x360-14-G1-sona.html
Rootfs: http://storage.kernelci.org/images/rootfs/debian/bullseye/20220718.0/amd64/initrd.cpio.gz


* baseline-nfs.login: https://kernelci.org/test/case/id/62e0b78ac79b59e730daf059
failing since 0 day (last pass: v5.10.129-cip12-36-g21d9d56f4de5a, first fail: v4.4-st5-586-geb97410e0086c)



platform | arch | lab | compiler | defconfig | regressions
-----------------------------+--------+---------------+----------+------------------------------+------------
juno-uboot | arm64 | lab-broonie | gcc-10 | defconfig | 1

Details: https://kernelci.org/test/plan/id/62e0b1f7d3501f0966daf07d

Results: 0 PASS, 1 FAIL, 0 SKIP
Full config: defconfig
Compiler: gcc-10 (aarch64-linux-gnu-gcc (Debian 10.2.1-6) 10.2.1 20210110)
Plain log: https://storage.kernelci.org//cip-gitlab/ci-pavel-linux-test/v4.4-st5-585-gc99f2b257bde/arm64/defconfig/gcc-10/lab-broonie/baseline-nfs-juno-uboot.txt
HTML log: https://storage.kernelci.org//cip-gitlab/ci-pavel-linux-test/v4.4-st5-585-gc99f2b257bde/arm64/defconfig/gcc-10/lab-broonie/baseline-nfs-juno-uboot.html
Rootfs: http://storage.kernelci.org/images/rootfs/debian/bullseye/20220718.0/arm64/initrd.cpio.gz


* baseline-nfs.login: https://kernelci.org/test/case/id/62e0b1f7d3501f0966daf07e
failing since 0 day (last pass: v5.10.129-cip12-36-g21d9d56f4de5a, first fail: v4.4-st5-586-geb97410e0086c)



platform | arch | lab | compiler | defconfig | regressions
-----------------------------+--------+---------------+----------+------------------------------+------------
rk3288-veyron-jaq | arm | lab-collabora | gcc-10 | multi_v7_defconfig | 1

Details: https://kernelci.org/test/plan/id/62e0d89875eb55cf6edaf05d

Results: 0 PASS, 1 FAIL, 0 SKIP
Full config: multi_v7_defconfig
Compiler: gcc-10 (arm-linux-gnueabihf-gcc (Debian 10.2.1-6) 10.2.1 20210110)
Plain log: https://storage.kernelci.org//cip-gitlab/ci-pavel-linux-test/v4.4-st5-585-gc99f2b257bde/arm/multi_v7_defconfig/gcc-10/lab-collabora/baseline-nfs-rk3288-veyron-jaq.txt
HTML log: https://storage.kernelci.org//cip-gitlab/ci-pavel-linux-test/v4.4-st5-585-gc99f2b257bde/arm/multi_v7_defconfig/gcc-10/lab-collabora/baseline-nfs-rk3288-veyron-jaq.html
Rootfs: http://storage.kernelci.org/images/rootfs/debian/bullseye/20220718.0/armhf/initrd.cpio.gz


* baseline-nfs.login: https://kernelci.org/test/case/id/62e0d89875eb55cf6edaf05e
failing since 0 day (last pass: v5.10.129-cip12-36-g21d9d56f4de5a, first fail: v4.4-st5-586-geb97410e0086c)



platform | arch | lab | compiler | defconfig | regressions
-----------------------------+--------+---------------+----------+------------------------------+------------
sun4i-a10-olinuxino-lime | arm | lab-baylibre | gcc-10 | sunxi_defconfig | 1

Details: https://kernelci.org/test/plan/id/62e119e9ff6e556754daf056

Results: 0 PASS, 1 FAIL, 0 SKIP
Full config: sunxi_defconfig
Compiler: gcc-10 (arm-linux-gnueabihf-gcc (Debian 10.2.1-6) 10.2.1 20210110)
Plain log: https://storage.kernelci.org//cip-gitlab/ci-pavel-linux-test/v4.4-st5-585-gc99f2b257bde/arm/sunxi_defconfig/gcc-10/lab-baylibre/baseline-nfs-sun4i-a10-olinuxino-lime.txt
HTML log: https://storage.kernelci.org//cip-gitlab/ci-pavel-linux-test/v4.4-st5-585-gc99f2b257bde/arm/sunxi_defconfig/gcc-10/lab-baylibre/baseline-nfs-sun4i-a10-olinuxino-lime.html
Rootfs: http://storage.kernelci.org/images/rootfs/debian/bullseye/20220718.0/armhf/initrd.cpio.gz


* baseline-nfs.login: https://kernelci.org/test/case/id/62e119e9ff6e556754daf057
new failure (last pass: v4.4-st5-586-geb97410e0086c)


cip-gitlab/ci/pavel/linux-test baseline: 91 runs, 68 regressions (v4.4-st5-585-gc99f2b257bde) #kernelci

kernelci.org bot <bot@...>
 

cip-gitlab/ci/pavel/linux-test baseline: 91 runs, 68 regressions (v4.4-st5-585-gc99f2b257bde)

Regressions Summary
-------------------

platform | arch | lab | compiler | defconfig | regressions
-----------------------------+--------+---------------+----------+------------------------------+------------
asus-C436FA-Flip-hatch | x86_64 | lab-collabora | gcc-10 | x86_64_defcon...6-chromebook | 1
at91-sama5d4_xplained | arm | lab-baylibre | gcc-10 | multi_v7_defconfig | 1
beaglebone-black | arm | lab-broonie | gcc-10 | multi_v7_defconfig | 1
beaglebone-black | arm | lab-cip | gcc-10 | multi_v7_defconfig | 1
hp-x360-12b-c...4020-octopus | x86_64 | lab-collabora | gcc-10 | x86_64_defcon...6-chromebook | 1
juno-uboot | arm64 | lab-broonie | gcc-10 | defconfig | 1
qemu_arm-virt-gicv2 | arm | lab-baylibre | gcc-10 | multi_v7_defconfig | 1
qemu_arm-virt-gicv2 | arm | lab-broonie | gcc-10 | multi_v7_defconfig | 1
qemu_arm-virt-gicv2 | arm | lab-collabora | gcc-10 | multi_v7_defconfig | 1
qemu_arm-virt-gicv2-uefi | arm | lab-baylibre | gcc-10 | multi_v7_defconfig | 1
qemu_arm-virt-gicv2-uefi | arm | lab-broonie | gcc-10 | multi_v7_defconfig | 1
qemu_arm-virt-gicv2-uefi | arm | lab-collabora | gcc-10 | multi_v7_defconfig | 1
qemu_arm-virt-gicv3 | arm | lab-baylibre | gcc-10 | multi_v7_defconfig | 1
qemu_arm-virt-gicv3 | arm | lab-broonie | gcc-10 | multi_v7_defconfig | 1
qemu_arm-virt-gicv3 | arm | lab-collabora | gcc-10 | multi_v7_defconfig | 1
qemu_arm-virt-gicv3-uefi | arm | lab-baylibre | gcc-10 | multi_v7_defconfig | 1
qemu_arm-virt-gicv3-uefi | arm | lab-broonie | gcc-10 | multi_v7_defconfig | 1
qemu_arm-virt-gicv3-uefi | arm | lab-collabora | gcc-10 | multi_v7_defconfig | 1
qemu_arm64-virt-gicv2 | arm64 | lab-broonie | gcc-10 | defconfig | 1
qemu_arm64-virt-gicv2 | arm64 | lab-broonie | gcc-10 | defconfig+arm64-chromebook | 1
qemu_arm64-virt-gicv2 | arm64 | lab-collabora | gcc-10 | defconfig | 1
qemu_arm64-virt-gicv2 | arm64 | lab-collabora | gcc-10 | defconfig+arm64-chromebook | 1
qemu_arm64-virt-gicv2-uefi | arm64 | lab-broonie | gcc-10 | defconfig | 1
qemu_arm64-virt-gicv2-uefi | arm64 | lab-broonie | gcc-10 | defconfig+arm64-chromebook | 1
qemu_arm64-virt-gicv2-uefi | arm64 | lab-collabora | gcc-10 | defconfig | 1
qemu_arm64-virt-gicv2-uefi | arm64 | lab-collabora | gcc-10 | defconfig+arm64-chromebook | 1
qemu_arm64-virt-gicv3 | arm64 | lab-broonie | gcc-10 | defconfig | 1
qemu_arm64-virt-gicv3 | arm64 | lab-broonie | gcc-10 | defconfig+arm64-chromebook | 1
qemu_arm64-virt-gicv3 | arm64 | lab-collabora | gcc-10 | defconfig | 1
qemu_arm64-virt-gicv3 | arm64 | lab-collabora | gcc-10 | defconfig+arm64-chromebook | 1
qemu_arm64-virt-gicv3-uefi | arm64 | lab-broonie | gcc-10 | defconfig | 1
qemu_arm64-virt-gicv3-uefi | arm64 | lab-broonie | gcc-10 | defconfig+arm64-chromebook | 1
qemu_arm64-virt-gicv3-uefi | arm64 | lab-collabora | gcc-10 | defconfig | 1
qemu_arm64-virt-gicv3-uefi | arm64 | lab-collabora | gcc-10 | defconfig+arm64-chromebook | 1
qemu_x86_64-uefi-mixed | x86_64 | lab-baylibre | gcc-10 | x86_64_defcon...6-chromebook | 1
qemu_x86_64-uefi-mixed | x86_64 | lab-baylibre | gcc-10 | x86_64_defconfig | 1
qemu_x86_64-uefi-mixed | x86_64 | lab-broonie | gcc-10 | x86_64_defcon...6-chromebook | 1
qemu_x86_64-uefi-mixed | x86_64 | lab-broonie | gcc-10 | x86_64_defconfig | 1
qemu_x86_64-uefi-mixed | x86_64 | lab-collabora | gcc-10 | x86_64_defconfig | 1
qemu_x86_64-uefi-mixed | x86_64 | lab-collabora | gcc-10 | x86_64_defcon...6-chromebook | 1
rk3288-veyron-jaq | arm | lab-collabora | gcc-10 | multi_v7_defconfig | 28

Details: https://kernelci.org/test/job/cip-gitlab/branch/ci%2Fpavel%2Flinux-test/kernel/v4.4-st5-585-gc99f2b257bde/plan/baseline/

Test: baseline
Tree: cip-gitlab
Branch: ci/pavel/linux-test
Describe: v4.4-st5-585-gc99f2b257bde
URL: https://gitlab.com/cip-project/cip-kernel/linux-cip.git
SHA: c99f2b257bde3cd60a833056aab624ad5fab3812


Test Regressions
----------------


platform | arch | lab | compiler | defconfig | regressions
-----------------------------+--------+---------------+----------+------------------------------+------------
asus-C436FA-Flip-hatch | x86_64 | lab-collabora | gcc-10 | x86_64_defcon...6-chromebook | 1

Details: https://kernelci.org/test/plan/id/62e0b1bbef3df23dfedaf082

Results: 0 PASS, 1 FAIL, 0 SKIP
Full config: x86_64_defconfig+x86-chromebook
Compiler: gcc-10 (gcc (Debian 10.2.1-6) 10.2.1 20210110)
Plain log: https://storage.kernelci.org//cip-gitlab/ci-pavel-linux-test/v4.4-st5-585-gc99f2b257bde/x86_64/x86_64_defconfig+x86-chromebook/gcc-10/lab-collabora/baseline-asus-C436FA-Flip-hatch.txt
HTML log: https://storage.kernelci.org//cip-gitlab/ci-pavel-linux-test/v4.4-st5-585-gc99f2b257bde/x86_64/x86_64_defconfig+x86-chromebook/gcc-10/lab-collabora/baseline-asus-C436FA-Flip-hatch.html
Rootfs: http://storage.kernelci.org/images/rootfs/buildroot/buildroot-baseline/20220718.0/x86/rootfs.cpio.gz


* baseline.login: https://kernelci.org/test/case/id/62e0b1bbef3df23dfedaf083
failing since 0 day (last pass: v5.10.129-cip12-36-g21d9d56f4de5a, first fail: v4.4-st5-586-geb97410e0086c)



platform | arch | lab | compiler | defconfig | regressions
-----------------------------+--------+---------------+----------+------------------------------+------------
at91-sama5d4_xplained | arm | lab-baylibre | gcc-10 | multi_v7_defconfig | 1

Details: https://kernelci.org/test/plan/id/62e0b29398ca3bdb44daf06c

Results: 0 PASS, 1 FAIL, 0 SKIP
Full config: multi_v7_defconfig
Compiler: gcc-10 (arm-linux-gnueabihf-gcc (Debian 10.2.1-6) 10.2.1 20210110)
Plain log: https://storage.kernelci.org//cip-gitlab/ci-pavel-linux-test/v4.4-st5-585-gc99f2b257bde/arm/multi_v7_defconfig/gcc-10/lab-baylibre/baseline-at91-sama5d4_xplained.txt
HTML log: https://storage.kernelci.org//cip-gitlab/ci-pavel-linux-test/v4.4-st5-585-gc99f2b257bde/arm/multi_v7_defconfig/gcc-10/lab-baylibre/baseline-at91-sama5d4_xplained.html
Rootfs: http://storage.kernelci.org/images/rootfs/buildroot/buildroot-baseline/20220718.0/armel/rootfs.cpio.gz


* baseline.login: https://kernelci.org/test/case/id/62e0b29398ca3bdb44daf06d
failing since 0 day (last pass: v5.10.129-cip12-36-g21d9d56f4de5a, first fail: v4.4-st5-586-geb97410e0086c)



platform | arch | lab | compiler | defconfig | regressions
-----------------------------+--------+---------------+----------+------------------------------+------------
beaglebone-black | arm | lab-broonie | gcc-10 | multi_v7_defconfig | 1

Details: https://kernelci.org/test/plan/id/62e0b1afef3df23dfedaf060

Results: 4 PASS, 1 FAIL, 2 SKIP
Full config: multi_v7_defconfig
Compiler: gcc-10 (arm-linux-gnueabihf-gcc (Debian 10.2.1-6) 10.2.1 20210110)
Plain log: https://storage.kernelci.org//cip-gitlab/ci-pavel-linux-test/v4.4-st5-585-gc99f2b257bde/arm/multi_v7_defconfig/gcc-10/lab-broonie/baseline-beaglebone-black.txt
HTML log: https://storage.kernelci.org//cip-gitlab/ci-pavel-linux-test/v4.4-st5-585-gc99f2b257bde/arm/multi_v7_defconfig/gcc-10/lab-broonie/baseline-beaglebone-black.html
Rootfs: http://storage.kernelci.org/images/rootfs/buildroot/buildroot-baseline/20220718.0/armel/rootfs.cpio.gz


* baseline.dmesg.crit: https://kernelci.org/test/case/id/62e0b1afef3df23dfedaf069
failing since 0 day (last pass: v5.10.129-cip12-36-g21d9d56f4de5a, first fail: v4.4-st5-586-geb97410e0086c)
1 lines

2022-07-27T03:31:51.421029 / #
2022-07-27T03:31:51.426905
2022-07-27T03:31:51.530686 / # #
2022-07-27T03:31:51.536430 #
2022-07-27T03:31:51.638472 / # export SHELL=/bin/sh
2022-07-27T03:31:51.644252 export SHELL=/bin/sh
2022-07-27T03:31:51.746052 / # . /lava-354837/environment
2022-07-27T03:31:51.752056 . /lava-354837/environment
2022-07-27T03:31:51.853943 / # /lava-354837/bin/lava-test-runner /lava-354837/0
2022-07-27T03:31:51.859294 /lava-354837/bin/lava-test-runner /lava-354837/0
... (9 line(s) more)



platform | arch | lab | compiler | defconfig | regressions
-----------------------------+--------+---------------+----------+------------------------------+------------
beaglebone-black | arm | lab-cip | gcc-10 | multi_v7_defconfig | 1

Details: https://kernelci.org/test/plan/id/62e0b61211d6839b16daf05b

Results: 4 PASS, 1 FAIL, 2 SKIP
Full config: multi_v7_defconfig
Compiler: gcc-10 (arm-linux-gnueabihf-gcc (Debian 10.2.1-6) 10.2.1 20210110)
Plain log: https://storage.kernelci.org//cip-gitlab/ci-pavel-linux-test/v4.4-st5-585-gc99f2b257bde/arm/multi_v7_defconfig/gcc-10/lab-cip/baseline-beaglebone-black.txt
HTML log: https://storage.kernelci.org//cip-gitlab/ci-pavel-linux-test/v4.4-st5-585-gc99f2b257bde/arm/multi_v7_defconfig/gcc-10/lab-cip/baseline-beaglebone-black.html
Rootfs: http://storage.kernelci.org/images/rootfs/buildroot/buildroot-baseline/20220718.0/armel/rootfs.cpio.gz


* baseline.dmesg.crit: https://kernelci.org/test/case/id/62e0b61211d6839b16daf062
failing since 0 day (last pass: v5.10.129-cip12-36-g21d9d56f4de5a, first fail: v4.4-st5-586-geb97410e0086c)
1 lines

2022-07-27T03:50:19.570469 / #
2022-07-27T03:50:19.573397
2022-07-27T03:50:19.678329 / # #
2022-07-27T03:50:19.681182 #
2022-07-27T03:50:19.782988 / # export SHELL=/bin/sh
2022-07-27T03:50:19.785921 export SHELL=/bin/sh
2022-07-27T03:50:19.887408 / # . /lava-716785/environment
2022-07-27T03:50:19.890249 . /lava-716785/environment
2022-07-27T03:50:19.991712 / # /lava-716785/bin/lava-test-runner /lava-716785/0
2022-07-27T03:50:19.994032 /lava-716785/bin/lava-test-runner /lava-716785/0
... (9 line(s) more)



platform | arch | lab | compiler | defconfig | regressions
-----------------------------+--------+---------------+----------+------------------------------+------------
hp-x360-12b-c...4020-octopus | x86_64 | lab-collabora | gcc-10 | x86_64_defcon...6-chromebook | 1

Details: https://kernelci.org/test/plan/id/62e0b3a58f2659c50ddaf085

Results: 0 PASS, 1 FAIL, 0 SKIP
Full config: x86_64_defconfig+x86-chromebook
Compiler: gcc-10 (gcc (Debian 10.2.1-6) 10.2.1 20210110)
Plain log: https://storage.kernelci.org//cip-gitlab/ci-pavel-linux-test/v4.4-st5-585-gc99f2b257bde/x86_64/x86_64_defconfig+x86-chromebook/gcc-10/lab-collabora/baseline-hp-x360-12b-ca0010nr-n4020-octopus.txt
HTML log: https://storage.kernelci.org//cip-gitlab/ci-pavel-linux-test/v4.4-st5-585-gc99f2b257bde/x86_64/x86_64_defconfig+x86-chromebook/gcc-10/lab-collabora/baseline-hp-x360-12b-ca0010nr-n4020-octopus.html
Rootfs: http://storage.kernelci.org/images/rootfs/buildroot/buildroot-baseline/20220718.0/x86/rootfs.cpio.gz


* baseline.login: https://kernelci.org/test/case/id/62e0b3a58f2659c50ddaf086
failing since 0 day (last pass: v5.10.129-cip12-36-g21d9d56f4de5a, first fail: v4.4-st5-586-geb97410e0086c)



platform | arch | lab | compiler | defconfig | regressions
-----------------------------+--------+---------------+----------+------------------------------+------------
juno-uboot | arm64 | lab-broonie | gcc-10 | defconfig | 1

Details: https://kernelci.org/test/plan/id/62e0b08fe4da64c7c8daf087

Results: 0 PASS, 1 FAIL, 0 SKIP
Full config: defconfig
Compiler: gcc-10 (aarch64-linux-gnu-gcc (Debian 10.2.1-6) 10.2.1 20210110)
Plain log: https://storage.kernelci.org//cip-gitlab/ci-pavel-linux-test/v4.4-st5-585-gc99f2b257bde/arm64/defconfig/gcc-10/lab-broonie/baseline-juno-uboot.txt
HTML log: https://storage.kernelci.org//cip-gitlab/ci-pavel-linux-test/v4.4-st5-585-gc99f2b257bde/arm64/defconfig/gcc-10/lab-broonie/baseline-juno-uboot.html
Rootfs: http://storage.kernelci.org/images/rootfs/buildroot/buildroot-baseline/20220718.0/arm64/rootfs.cpio.gz


* baseline.login: https://kernelci.org/test/case/id/62e0b08fe4da64c7c8daf088
failing since 0 day (last pass: v5.10.129-cip12-36-g21d9d56f4de5a, first fail: v4.4-st5-586-geb97410e0086c)



platform | arch | lab | compiler | defconfig | regressions
-----------------------------+--------+---------------+----------+------------------------------+------------
qemu_arm-virt-gicv2 | arm | lab-baylibre | gcc-10 | multi_v7_defconfig | 1

Details: https://kernelci.org/test/plan/id/62e0b21025bd0639c4daf064

Results: 0 PASS, 1 FAIL, 0 SKIP
Full config: multi_v7_defconfig
Compiler: gcc-10 (arm-linux-gnueabihf-gcc (Debian 10.2.1-6) 10.2.1 20210110)
Plain log: https://storage.kernelci.org//cip-gitlab/ci-pavel-linux-test/v4.4-st5-585-gc99f2b257bde/arm/multi_v7_defconfig/gcc-10/lab-baylibre/baseline-qemu_arm-virt-gicv2.txt
HTML log: https://storage.kernelci.org//cip-gitlab/ci-pavel-linux-test/v4.4-st5-585-gc99f2b257bde/arm/multi_v7_defconfig/gcc-10/lab-baylibre/baseline-qemu_arm-virt-gicv2.html
Rootfs: http://storage.kernelci.org/images/rootfs/buildroot/buildroot-baseline/20220718.0/armel/rootfs.cpio.gz


* baseline.login: https://kernelci.org/test/case/id/62e0b21025bd0639c4daf065
failing since 0 day (last pass: v5.10.129-cip12-36-g21d9d56f4de5a, first fail: v4.4-st5-586-geb97410e0086c)



platform | arch | lab | compiler | defconfig | regressions
-----------------------------+--------+---------------+----------+------------------------------+------------
qemu_arm-virt-gicv2 | arm | lab-broonie | gcc-10 | multi_v7_defconfig | 1

Details: https://kernelci.org/test/plan/id/62e0b276bc071248ccdaf05f

Results: 0 PASS, 1 FAIL, 0 SKIP
Full config: multi_v7_defconfig
Compiler: gcc-10 (arm-linux-gnueabihf-gcc (Debian 10.2.1-6) 10.2.1 20210110)
Plain log: https://storage.kernelci.org//cip-gitlab/ci-pavel-linux-test/v4.4-st5-585-gc99f2b257bde/arm/multi_v7_defconfig/gcc-10/lab-broonie/baseline-qemu_arm-virt-gicv2.txt
HTML log: https://storage.kernelci.org//cip-gitlab/ci-pavel-linux-test/v4.4-st5-585-gc99f2b257bde/arm/multi_v7_defconfig/gcc-10/lab-broonie/baseline-qemu_arm-virt-gicv2.html
Rootfs: http://storage.kernelci.org/images/rootfs/buildroot/buildroot-baseline/20220718.0/armel/rootfs.cpio.gz


* baseline.login: https://kernelci.org/test/case/id/62e0b276bc071248ccdaf060
failing since 0 day (last pass: v5.10.129-cip12-36-g21d9d56f4de5a, first fail: v4.4-st5-586-geb97410e0086c)



platform | arch | lab | compiler | defconfig | regressions
-----------------------------+--------+---------------+----------+------------------------------+------------
qemu_arm-virt-gicv2 | arm | lab-collabora | gcc-10 | multi_v7_defconfig | 1

Details: https://kernelci.org/test/plan/id/62e0b575797fd63d30daf058

Results: 0 PASS, 1 FAIL, 0 SKIP
Full config: multi_v7_defconfig
Compiler: gcc-10 (arm-linux-gnueabihf-gcc (Debian 10.2.1-6) 10.2.1 20210110)
Plain log: https://storage.kernelci.org//cip-gitlab/ci-pavel-linux-test/v4.4-st5-585-gc99f2b257bde/arm/multi_v7_defconfig/gcc-10/lab-collabora/baseline-qemu_arm-virt-gicv2.txt
HTML log: https://storage.kernelci.org//cip-gitlab/ci-pavel-linux-test/v4.4-st5-585-gc99f2b257bde/arm/multi_v7_defconfig/gcc-10/lab-collabora/baseline-qemu_arm-virt-gicv2.html
Rootfs: http://storage.kernelci.org/images/rootfs/buildroot/buildroot-baseline/20220718.0/armel/rootfs.cpio.gz


* baseline.login: https://kernelci.org/test/case/id/62e0b575797fd63d30daf059
failing since 0 day (last pass: v5.10.129-cip12-36-g21d9d56f4de5a, first fail: v4.4-st5-586-geb97410e0086c)



platform | arch | lab | compiler | defconfig | regressions
-----------------------------+--------+---------------+----------+------------------------------+------------
qemu_arm-virt-gicv2-uefi | arm | lab-baylibre | gcc-10 | multi_v7_defconfig | 1

Details: https://kernelci.org/test/plan/id/62e0b2b100e29c907cdaf05c

Results: 0 PASS, 1 FAIL, 0 SKIP
Full config: multi_v7_defconfig
Compiler: gcc-10 (arm-linux-gnueabihf-gcc (Debian 10.2.1-6) 10.2.1 20210110)
Plain log: https://storage.kernelci.org//cip-gitlab/ci-pavel-linux-test/v4.4-st5-585-gc99f2b257bde/arm/multi_v7_defconfig/gcc-10/lab-baylibre/baseline-qemu_arm-virt-gicv2-uefi.txt
HTML log: https://storage.kernelci.org//cip-gitlab/ci-pavel-linux-test/v4.4-st5-585-gc99f2b257bde/arm/multi_v7_defconfig/gcc-10/lab-baylibre/baseline-qemu_arm-virt-gicv2-uefi.html
Rootfs: http://storage.kernelci.org/images/rootfs/buildroot/buildroot-baseline/20220718.0/armel/rootfs.cpio.gz


* baseline.login: https://kernelci.org/test/case/id/62e0b2b100e29c907cdaf05d
failing since 0 day (last pass: v5.10.129-cip12-36-g21d9d56f4de5a, first fail: v4.4-st5-586-geb97410e0086c)



platform | arch | lab | compiler | defconfig | regressions
-----------------------------+--------+---------------+----------+------------------------------+------------
qemu_arm-virt-gicv2-uefi | arm | lab-broonie | gcc-10 | multi_v7_defconfig | 1

Details: https://kernelci.org/test/plan/id/62e0b35309932b8e89daf056

Results: 0 PASS, 1 FAIL, 0 SKIP
Full config: multi_v7_defconfig
Compiler: gcc-10 (arm-linux-gnueabihf-gcc (Debian 10.2.1-6) 10.2.1 20210110)
Plain log: https://storage.kernelci.org//cip-gitlab/ci-pavel-linux-test/v4.4-st5-585-gc99f2b257bde/arm/multi_v7_defconfig/gcc-10/lab-broonie/baseline-qemu_arm-virt-gicv2-uefi.txt
HTML log: https://storage.kernelci.org//cip-gitlab/ci-pavel-linux-test/v4.4-st5-585-gc99f2b257bde/arm/multi_v7_defconfig/gcc-10/lab-broonie/baseline-qemu_arm-virt-gicv2-uefi.html
Rootfs: http://storage.kernelci.org/images/rootfs/buildroot/buildroot-baseline/20220718.0/armel/rootfs.cpio.gz


* baseline.login: https://kernelci.org/test/case/id/62e0b35309932b8e89daf057
failing since 0 day (last pass: v5.10.129-cip12-36-g21d9d56f4de5a, first fail: v4.4-st5-586-geb97410e0086c)



platform | arch | lab | compiler | defconfig | regressions
-----------------------------+--------+---------------+----------+------------------------------+------------
qemu_arm-virt-gicv2-uefi | arm | lab-collabora | gcc-10 | multi_v7_defconfig | 1

Details: https://kernelci.org/test/plan/id/62e0b5a4797fd63d30daf06a

Results: 0 PASS, 1 FAIL, 0 SKIP
Full config: multi_v7_defconfig
Compiler: gcc-10 (arm-linux-gnueabihf-gcc (Debian 10.2.1-6) 10.2.1 20210110)
Plain log: https://storage.kernelci.org//cip-gitlab/ci-pavel-linux-test/v4.4-st5-585-gc99f2b257bde/arm/multi_v7_defconfig/gcc-10/lab-collabora/baseline-qemu_arm-virt-gicv2-uefi.txt
HTML log: https://storage.kernelci.org//cip-gitlab/ci-pavel-linux-test/v4.4-st5-585-gc99f2b257bde/arm/multi_v7_defconfig/gcc-10/lab-collabora/baseline-qemu_arm-virt-gicv2-uefi.html
Rootfs: http://storage.kernelci.org/images/rootfs/buildroot/buildroot-baseline/20220718.0/armel/rootfs.cpio.gz


* baseline.login: https://kernelci.org/test/case/id/62e0b5a4797fd63d30daf06b
failing since 0 day (last pass: v5.10.129-cip12-36-g21d9d56f4de5a, first fail: v4.4-st5-586-geb97410e0086c)



platform | arch | lab | compiler | defconfig | regressions
-----------------------------+--------+---------------+----------+------------------------------+------------
qemu_arm-virt-gicv3 | arm | lab-baylibre | gcc-10 | multi_v7_defconfig | 1

Details: https://kernelci.org/test/plan/id/62e0b2110b09667771daf05e

Results: 0 PASS, 1 FAIL, 0 SKIP
Full config: multi_v7_defconfig
Compiler: gcc-10 (arm-linux-gnueabihf-gcc (Debian 10.2.1-6) 10.2.1 20210110)
Plain log: https://storage.kernelci.org//cip-gitlab/ci-pavel-linux-test/v4.4-st5-585-gc99f2b257bde/arm/multi_v7_defconfig/gcc-10/lab-baylibre/baseline-qemu_arm-virt-gicv3.txt
HTML log: https://storage.kernelci.org//cip-gitlab/ci-pavel-linux-test/v4.4-st5-585-gc99f2b257bde/arm/multi_v7_defconfig/gcc-10/lab-baylibre/baseline-qemu_arm-virt-gicv3.html
Rootfs: http://storage.kernelci.org/images/rootfs/buildroot/buildroot-baseline/20220718.0/armel/rootfs.cpio.gz


* baseline.login: https://kernelci.org/test/case/id/62e0b2110b09667771daf05f
failing since 0 day (last pass: v5.10.129-cip12-36-g21d9d56f4de5a, first fail: v4.4-st5-586-geb97410e0086c)



platform | arch | lab | compiler | defconfig | regressions
-----------------------------+--------+---------------+----------+------------------------------+------------
qemu_arm-virt-gicv3 | arm | lab-broonie | gcc-10 | multi_v7_defconfig | 1

Details: https://kernelci.org/test/plan/id/62e0b27898ca3bdb44daf066

Results: 0 PASS, 1 FAIL, 0 SKIP
Full config: multi_v7_defconfig
Compiler: gcc-10 (arm-linux-gnueabihf-gcc (Debian 10.2.1-6) 10.2.1 20210110)
Plain log: https://storage.kernelci.org//cip-gitlab/ci-pavel-linux-test/v4.4-st5-585-gc99f2b257bde/arm/multi_v7_defconfig/gcc-10/lab-broonie/baseline-qemu_arm-virt-gicv3.txt
HTML log: https://storage.kernelci.org//cip-gitlab/ci-pavel-linux-test/v4.4-st5-585-gc99f2b257bde/arm/multi_v7_defconfig/gcc-10/lab-broonie/baseline-qemu_arm-virt-gicv3.html
Rootfs: http://storage.kernelci.org/images/rootfs/buildroot/buildroot-baseline/20220718.0/armel/rootfs.cpio.gz


* baseline.login: https://kernelci.org/test/case/id/62e0b27898ca3bdb44daf067
failing since 0 day (last pass: v5.10.129-cip12-36-g21d9d56f4de5a, first fail: v4.4-st5-586-geb97410e0086c)



platform | arch | lab | compiler | defconfig | regressions
-----------------------------+--------+---------------+----------+------------------------------+------------
qemu_arm-virt-gicv3 | arm | lab-collabora | gcc-10 | multi_v7_defconfig | 1

Details: https://kernelci.org/test/plan/id/62e0b588797fd63d30daf05e

Results: 0 PASS, 1 FAIL, 0 SKIP
Full config: multi_v7_defconfig
Compiler: gcc-10 (arm-linux-gnueabihf-gcc (Debian 10.2.1-6) 10.2.1 20210110)
Plain log: https://storage.kernelci.org//cip-gitlab/ci-pavel-linux-test/v4.4-st5-585-gc99f2b257bde/arm/multi_v7_defconfig/gcc-10/lab-collabora/baseline-qemu_arm-virt-gicv3.txt
HTML log: https://storage.kernelci.org//cip-gitlab/ci-pavel-linux-test/v4.4-st5-585-gc99f2b257bde/arm/multi_v7_defconfig/gcc-10/lab-collabora/baseline-qemu_arm-virt-gicv3.html
Rootfs: http://storage.kernelci.org/images/rootfs/buildroot/buildroot-baseline/20220718.0/armel/rootfs.cpio.gz


* baseline.login: https://kernelci.org/test/case/id/62e0b588797fd63d30daf05f
failing since 0 day (last pass: v5.10.129-cip12-36-g21d9d56f4de5a, first fail: v4.4-st5-586-geb97410e0086c)



platform | arch | lab | compiler | defconfig | regressions
-----------------------------+--------+---------------+----------+------------------------------+------------
qemu_arm-virt-gicv3-uefi | arm | lab-baylibre | gcc-10 | multi_v7_defconfig | 1

Details: https://kernelci.org/test/plan/id/62e0b2b000e29c907cdaf057

Results: 0 PASS, 1 FAIL, 0 SKIP
Full config: multi_v7_defconfig
Compiler: gcc-10 (arm-linux-gnueabihf-gcc (Debian 10.2.1-6) 10.2.1 20210110)
Plain log: https://storage.kernelci.org//cip-gitlab/ci-pavel-linux-test/v4.4-st5-585-gc99f2b257bde/arm/multi_v7_defconfig/gcc-10/lab-baylibre/baseline-qemu_arm-virt-gicv3-uefi.txt
HTML log: https://storage.kernelci.org//cip-gitlab/ci-pavel-linux-test/v4.4-st5-585-gc99f2b257bde/arm/multi_v7_defconfig/gcc-10/lab-baylibre/baseline-qemu_arm-virt-gicv3-uefi.html
Rootfs: http://storage.kernelci.org/images/rootfs/buildroot/buildroot-baseline/20220718.0/armel/rootfs.cpio.gz


* baseline.login: https://kernelci.org/test/case/id/62e0b2b000e29c907cdaf058
failing since 0 day (last pass: v5.10.129-cip12-36-g21d9d56f4de5a, first fail: v4.4-st5-586-geb97410e0086c)



platform | arch | lab | compiler | defconfig | regressions
-----------------------------+--------+---------------+----------+------------------------------+------------
qemu_arm-virt-gicv3-uefi | arm | lab-broonie | gcc-10 | multi_v7_defconfig | 1

Details: https://kernelci.org/test/plan/id/62e0b352d58ca6540fdaf056

Results: 0 PASS, 1 FAIL, 0 SKIP
Full config: multi_v7_defconfig
Compiler: gcc-10 (arm-linux-gnueabihf-gcc (Debian 10.2.1-6) 10.2.1 20210110)
Plain log: https://storage.kernelci.org//cip-gitlab/ci-pavel-linux-test/v4.4-st5-585-gc99f2b257bde/arm/multi_v7_defconfig/gcc-10/lab-broonie/baseline-qemu_arm-virt-gicv3-uefi.txt
HTML log: https://storage.kernelci.org//cip-gitlab/ci-pavel-linux-test/v4.4-st5-585-gc99f2b257bde/arm/multi_v7_defconfig/gcc-10/lab-broonie/baseline-qemu_arm-virt-gicv3-uefi.html
Rootfs: http://storage.kernelci.org/images/rootfs/buildroot/buildroot-baseline/20220718.0/armel/rootfs.cpio.gz


* baseline.login: https://kernelci.org/test/case/id/62e0b352d58ca6540fdaf057
failing since 0 day (last pass: v5.10.129-cip12-36-g21d9d56f4de5a, first fail: v4.4-st5-586-geb97410e0086c)



platform | arch | lab | compiler | defconfig | regressions
-----------------------------+--------+---------------+----------+------------------------------+------------
qemu_arm-virt-gicv3-uefi | arm | lab-collabora | gcc-10 | multi_v7_defconfig | 1

Details: https://kernelci.org/test/plan/id/62e0b590797fd63d30daf063

Results: 0 PASS, 1 FAIL, 0 SKIP
Full config: multi_v7_defconfig
Compiler: gcc-10 (arm-linux-gnueabihf-gcc (Debian 10.2.1-6) 10.2.1 20210110)
Plain log: https://storage.kernelci.org//cip-gitlab/ci-pavel-linux-test/v4.4-st5-585-gc99f2b257bde/arm/multi_v7_defconfig/gcc-10/lab-collabora/baseline-qemu_arm-virt-gicv3-uefi.txt
HTML log: https://storage.kernelci.org//cip-gitlab/ci-pavel-linux-test/v4.4-st5-585-gc99f2b257bde/arm/multi_v7_defconfig/gcc-10/lab-collabora/baseline-qemu_arm-virt-gicv3-uefi.html
Rootfs: http://storage.kernelci.org/images/rootfs/buildroot/buildroot-baseline/20220718.0/armel/rootfs.cpio.gz


* baseline.login: https://kernelci.org/test/case/id/62e0b590797fd63d30daf064
failing since 0 day (last pass: v5.10.129-cip12-36-g21d9d56f4de5a, first fail: v4.4-st5-586-geb97410e0086c)



platform | arch | lab | compiler | defconfig | regressions
-----------------------------+--------+---------------+----------+------------------------------+------------
qemu_arm64-virt-gicv2 | arm64 | lab-broonie | gcc-10 | defconfig | 1

Details: https://kernelci.org/test/plan/id/62e0b0838df463716ddaf060

Results: 0 PASS, 1 FAIL, 0 SKIP
Full config: defconfig
Compiler: gcc-10 (aarch64-linux-gnu-gcc (Debian 10.2.1-6) 10.2.1 20210110)
Plain log: https://storage.kernelci.org//cip-gitlab/ci-pavel-linux-test/v4.4-st5-585-gc99f2b257bde/arm64/defconfig/gcc-10/lab-broonie/baseline-qemu_arm64-virt-gicv2.txt
HTML log: https://storage.kernelci.org//cip-gitlab/ci-pavel-linux-test/v4.4-st5-585-gc99f2b257bde/arm64/defconfig/gcc-10/lab-broonie/baseline-qemu_arm64-virt-gicv2.html
Rootfs: http://storage.kernelci.org/images/rootfs/buildroot/buildroot-baseline/20220718.0/arm64/rootfs.cpio.gz


* baseline.login: https://kernelci.org/test/case/id/62e0b0838df463716ddaf061
failing since 77 days (last pass: v4.19.233-516-ge5e741fbfc87, first fail: v5.10.109-cip5-384-g722204542e8a)



platform | arch | lab | compiler | defconfig | regressions
-----------------------------+--------+---------------+----------+------------------------------+------------
qemu_arm64-virt-gicv2 | arm64 | lab-broonie | gcc-10 | defconfig+arm64-chromebook | 1

Details: https://kernelci.org/test/plan/id/62e0b1ead3501f0966daf05e

Results: 0 PASS, 1 FAIL, 0 SKIP
Full config: defconfig+arm64-chromebook
Compiler: gcc-10 (aarch64-linux-gnu-gcc (Debian 10.2.1-6) 10.2.1 20210110)
Plain log: https://storage.kernelci.org//cip-gitlab/ci-pavel-linux-test/v4.4-st5-585-gc99f2b257bde/arm64/defconfig+arm64-chromebook/gcc-10/lab-broonie/baseline-qemu_arm64-virt-gicv2.txt
HTML log: https://storage.kernelci.org//cip-gitlab/ci-pavel-linux-test/v4.4-st5-585-gc99f2b257bde/arm64/defconfig+arm64-chromebook/gcc-10/lab-broonie/baseline-qemu_arm64-virt-gicv2.html
Rootfs: http://storage.kernelci.org/images/rootfs/buildroot/buildroot-baseline/20220718.0/arm64/rootfs.cpio.gz


* baseline.login: https://kernelci.org/test/case/id/62e0b1ead3501f0966daf05f
failing since 77 days (last pass: v4.19.233-516-ge5e741fbfc87, first fail: v5.10.109-cip5-384-g722204542e8a)



platform | arch | lab | compiler | defconfig | regressions
-----------------------------+--------+---------------+----------+------------------------------+------------
qemu_arm64-virt-gicv2 | arm64 | lab-collabora | gcc-10 | defconfig | 1

Details: https://kernelci.org/test/plan/id/62e0b2e755c296c1c3daf07e

Results: 0 PASS, 1 FAIL, 0 SKIP
Full config: defconfig
Compiler: gcc-10 (aarch64-linux-gnu-gcc (Debian 10.2.1-6) 10.2.1 20210110)
Plain log: https://storage.kernelci.org//cip-gitlab/ci-pavel-linux-test/v4.4-st5-585-gc99f2b257bde/arm64/defconfig/gcc-10/lab-collabora/baseline-qemu_arm64-virt-gicv2.txt
HTML log: https://storage.kernelci.org//cip-gitlab/ci-pavel-linux-test/v4.4-st5-585-gc99f2b257bde/arm64/defconfig/gcc-10/lab-collabora/baseline-qemu_arm64-virt-gicv2.html
Rootfs: http://storage.kernelci.org/images/rootfs/buildroot/buildroot-baseline/20220718.0/arm64/rootfs.cpio.gz


* baseline.login: https://kernelci.org/test/case/id/62e0b2e755c296c1c3daf07f
failing since 77 days (last pass: v4.19.233-516-ge5e741fbfc87, first fail: v5.10.109-cip5-384-g722204542e8a)



platform | arch | lab | compiler | defconfig | regressions
-----------------------------+--------+---------------+----------+------------------------------+------------
qemu_arm64-virt-gicv2 | arm64 | lab-collabora | gcc-10 | defconfig+arm64-chromebook | 1

Details: https://kernelci.org/test/plan/id/62e0b38109932b8e89daf079

Results: 0 PASS, 1 FAIL, 0 SKIP
Full config: defconfig+arm64-chromebook
Compiler: gcc-10 (aarch64-linux-gnu-gcc (Debian 10.2.1-6) 10.2.1 20210110)
Plain log: https://storage.kernelci.org//cip-gitlab/ci-pavel-linux-test/v4.4-st5-585-gc99f2b257bde/arm64/defconfig+arm64-chromebook/gcc-10/lab-collabora/baseline-qemu_arm64-virt-gicv2.txt
HTML log: https://storage.kernelci.org//cip-gitlab/ci-pavel-linux-test/v4.4-st5-585-gc99f2b257bde/arm64/defconfig+arm64-chromebook/gcc-10/lab-collabora/baseline-qemu_arm64-virt-gicv2.html
Rootfs: http://storage.kernelci.org/images/rootfs/buildroot/buildroot-baseline/20220718.0/arm64/rootfs.cpio.gz


* baseline.login: https://kernelci.org/test/case/id/62e0b38109932b8e89daf07a
failing since 77 days (last pass: v4.19.233-516-ge5e741fbfc87, first fail: v5.10.109-cip5-384-g722204542e8a)



platform | arch | lab | compiler | defconfig | regressions
-----------------------------+--------+---------------+----------+------------------------------+------------
qemu_arm64-virt-gicv2-uefi | arm64 | lab-broonie | gcc-10 | defconfig | 1

Details: https://kernelci.org/test/plan/id/62e0b082e4da64c7c8daf05c

Results: 0 PASS, 1 FAIL, 0 SKIP
Full config: defconfig
Compiler: gcc-10 (aarch64-linux-gnu-gcc (Debian 10.2.1-6) 10.2.1 20210110)
Plain log: https://storage.kernelci.org//cip-gitlab/ci-pavel-linux-test/v4.4-st5-585-gc99f2b257bde/arm64/defconfig/gcc-10/lab-broonie/baseline-qemu_arm64-virt-gicv2-uefi.txt
HTML log: https://storage.kernelci.org//cip-gitlab/ci-pavel-linux-test/v4.4-st5-585-gc99f2b257bde/arm64/defconfig/gcc-10/lab-broonie/baseline-qemu_arm64-virt-gicv2-uefi.html
Rootfs: http://storage.kernelci.org/images/rootfs/buildroot/buildroot-baseline/20220718.0/arm64/rootfs.cpio.gz


* baseline.login: https://kernelci.org/test/case/id/62e0b082e4da64c7c8daf05d
failing since 77 days (last pass: v4.19.233-516-ge5e741fbfc87, first fail: v5.10.109-cip5-384-g722204542e8a)



platform | arch | lab | compiler | defconfig | regressions
-----------------------------+--------+---------------+----------+------------------------------+------------
qemu_arm64-virt-gicv2-uefi | arm64 | lab-broonie | gcc-10 | defconfig+arm64-chromebook | 1

Details: https://kernelci.org/test/plan/id/62e0b1ecd3501f0966daf06f

Results: 0 PASS, 1 FAIL, 0 SKIP
Full config: defconfig+arm64-chromebook
Compiler: gcc-10 (aarch64-linux-gnu-gcc (Debian 10.2.1-6) 10.2.1 20210110)
Plain log: https://storage.kernelci.org//cip-gitlab/ci-pavel-linux-test/v4.4-st5-585-gc99f2b257bde/arm64/defconfig+arm64-chromebook/gcc-10/lab-broonie/baseline-qemu_arm64-virt-gicv2-uefi.txt
HTML log: https://storage.kernelci.org//cip-gitlab/ci-pavel-linux-test/v4.4-st5-585-gc99f2b257bde/arm64/defconfig+arm64-chromebook/gcc-10/lab-broonie/baseline-qemu_arm64-virt-gicv2-uefi.html
Rootfs: http://storage.kernelci.org/images/rootfs/buildroot/buildroot-baseline/20220718.0/arm64/rootfs.cpio.gz


* baseline.login: https://kernelci.org/test/case/id/62e0b1ecd3501f0966daf070
failing since 77 days (last pass: v4.19.233-516-ge5e741fbfc87, first fail: v5.10.109-cip5-384-g722204542e8a)



platform | arch | lab | compiler | defconfig | regressions
-----------------------------+--------+---------------+----------+------------------------------+------------
qemu_arm64-virt-gicv2-uefi | arm64 | lab-collabora | gcc-10 | defconfig | 1

Details: https://kernelci.org/test/plan/id/62e0b2bf55c296c1c3daf05b

Results: 0 PASS, 1 FAIL, 0 SKIP
Full config: defconfig
Compiler: gcc-10 (aarch64-linux-gnu-gcc (Debian 10.2.1-6) 10.2.1 20210110)
Plain log: https://storage.kernelci.org//cip-gitlab/ci-pavel-linux-test/v4.4-st5-585-gc99f2b257bde/arm64/defconfig/gcc-10/lab-collabora/baseline-qemu_arm64-virt-gicv2-uefi.txt
HTML log: https://storage.kernelci.org//cip-gitlab/ci-pavel-linux-test/v4.4-st5-585-gc99f2b257bde/arm64/defconfig/gcc-10/lab-collabora/baseline-qemu_arm64-virt-gicv2-uefi.html
Rootfs: http://storage.kernelci.org/images/rootfs/buildroot/buildroot-baseline/20220718.0/arm64/rootfs.cpio.gz


* baseline.login: https://kernelci.org/test/case/id/62e0b2bf55c296c1c3daf05c
failing since 77 days (last pass: v4.19.233-516-ge5e741fbfc87, first fail: v5.10.109-cip5-384-g722204542e8a)



platform | arch | lab | compiler | defconfig | regressions
-----------------------------+--------+---------------+----------+------------------------------+------------
qemu_arm64-virt-gicv2-uefi | arm64 | lab-collabora | gcc-10 | defconfig+arm64-chromebook | 1

Details: https://kernelci.org/test/plan/id/62e0b43c89fe9f9132daf06b

Results: 0 PASS, 1 FAIL, 0 SKIP
Full config: defconfig+arm64-chromebook
Compiler: gcc-10 (aarch64-linux-gnu-gcc (Debian 10.2.1-6) 10.2.1 20210110)
Plain log: https://storage.kernelci.org//cip-gitlab/ci-pavel-linux-test/v4.4-st5-585-gc99f2b257bde/arm64/defconfig+arm64-chromebook/gcc-10/lab-collabora/baseline-qemu_arm64-virt-gicv2-uefi.txt
HTML log: https://storage.kernelci.org//cip-gitlab/ci-pavel-linux-test/v4.4-st5-585-gc99f2b257bde/arm64/defconfig+arm64-chromebook/gcc-10/lab-collabora/baseline-qemu_arm64-virt-gicv2-uefi.html
Rootfs: http://storage.kernelci.org/images/rootfs/buildroot/buildroot-baseline/20220718.0/arm64/rootfs.cpio.gz


* baseline.login: https://kernelci.org/test/case/id/62e0b43c89fe9f9132daf06c
failing since 77 days (last pass: v4.19.233-516-ge5e741fbfc87, first fail: v5.10.109-cip5-384-g722204542e8a)



platform | arch | lab | compiler | defconfig | regressions
-----------------------------+--------+---------------+----------+------------------------------+------------
qemu_arm64-virt-gicv3 | arm64 | lab-broonie | gcc-10 | defconfig | 1

Details: https://kernelci.org/test/plan/id/62e0b0858df463716ddaf073

Results: 0 PASS, 1 FAIL, 0 SKIP
Full config: defconfig
Compiler: gcc-10 (aarch64-linux-gnu-gcc (Debian 10.2.1-6) 10.2.1 20210110)
Plain log: https://storage.kernelci.org//cip-gitlab/ci-pavel-linux-test/v4.4-st5-585-gc99f2b257bde/arm64/defconfig/gcc-10/lab-broonie/baseline-qemu_arm64-virt-gicv3.txt
HTML log: https://storage.kernelci.org//cip-gitlab/ci-pavel-linux-test/v4.4-st5-585-gc99f2b257bde/arm64/defconfig/gcc-10/lab-broonie/baseline-qemu_arm64-virt-gicv3.html
Rootfs: http://storage.kernelci.org/images/rootfs/buildroot/buildroot-baseline/20220718.0/arm64/rootfs.cpio.gz


* baseline.login: https://kernelci.org/test/case/id/62e0b0858df463716ddaf074
failing since 77 days (last pass: v4.19.233-516-ge5e741fbfc87, first fail: v5.10.109-cip5-384-g722204542e8a)



platform | arch | lab | compiler | defconfig | regressions
-----------------------------+--------+---------------+----------+------------------------------+------------
qemu_arm64-virt-gicv3 | arm64 | lab-broonie | gcc-10 | defconfig+arm64-chromebook | 1

Details: https://kernelci.org/test/plan/id/62e0b1ebd3501f0966daf06c

Results: 0 PASS, 1 FAIL, 0 SKIP
Full config: defconfig+arm64-chromebook
Compiler: gcc-10 (aarch64-linux-gnu-gcc (Debian 10.2.1-6) 10.2.1 20210110)
Plain log: https://storage.kernelci.org//cip-gitlab/ci-pavel-linux-test/v4.4-st5-585-gc99f2b257bde/arm64/defconfig+arm64-chromebook/gcc-10/lab-broonie/baseline-qemu_arm64-virt-gicv3.txt
HTML log: https://storage.kernelci.org//cip-gitlab/ci-pavel-linux-test/v4.4-st5-585-gc99f2b257bde/arm64/defconfig+arm64-chromebook/gcc-10/lab-broonie/baseline-qemu_arm64-virt-gicv3.html
Rootfs: http://storage.kernelci.org/images/rootfs/buildroot/buildroot-baseline/20220718.0/arm64/rootfs.cpio.gz


* baseline.login: https://kernelci.org/test/case/id/62e0b1ebd3501f0966daf06d
failing since 77 days (last pass: v4.19.233-516-ge5e741fbfc87, first fail: v5.10.109-cip5-384-g722204542e8a)



platform | arch | lab | compiler | defconfig | regressions
-----------------------------+--------+---------------+----------+------------------------------+------------
qemu_arm64-virt-gicv3 | arm64 | lab-collabora | gcc-10 | defconfig | 1

Details: https://kernelci.org/test/plan/id/62e0b31ceabb58f740daf05e

Results: 0 PASS, 1 FAIL, 0 SKIP
Full config: defconfig
Compiler: gcc-10 (aarch64-linux-gnu-gcc (Debian 10.2.1-6) 10.2.1 20210110)
Plain log: https://storage.kernelci.org//cip-gitlab/ci-pavel-linux-test/v4.4-st5-585-gc99f2b257bde/arm64/defconfig/gcc-10/lab-collabora/baseline-qemu_arm64-virt-gicv3.txt
HTML log: https://storage.kernelci.org//cip-gitlab/ci-pavel-linux-test/v4.4-st5-585-gc99f2b257bde/arm64/defconfig/gcc-10/lab-collabora/baseline-qemu_arm64-virt-gicv3.html
Rootfs: http://storage.kernelci.org/images/rootfs/buildroot/buildroot-baseline/20220718.0/arm64/rootfs.cpio.gz


* baseline.login: https://kernelci.org/test/case/id/62e0b31ceabb58f740daf05f
failing since 77 days (last pass: v4.19.233-516-ge5e741fbfc87, first fail: v5.10.109-cip5-384-g722204542e8a)



platform | arch | lab | compiler | defconfig | regressions
-----------------------------+--------+---------------+----------+------------------------------+------------
qemu_arm64-virt-gicv3 | arm64 | lab-collabora | gcc-10 | defconfig+arm64-chromebook | 1

Details: https://kernelci.org/test/plan/id/62e0b41489fe9f9132daf058

Results: 0 PASS, 1 FAIL, 0 SKIP
Full config: defconfig+arm64-chromebook
Compiler: gcc-10 (aarch64-linux-gnu-gcc (Debian 10.2.1-6) 10.2.1 20210110)
Plain log: https://storage.kernelci.org//cip-gitlab/ci-pavel-linux-test/v4.4-st5-585-gc99f2b257bde/arm64/defconfig+arm64-chromebook/gcc-10/lab-collabora/baseline-qemu_arm64-virt-gicv3.txt
HTML log: https://storage.kernelci.org//cip-gitlab/ci-pavel-linux-test/v4.4-st5-585-gc99f2b257bde/arm64/defconfig+arm64-chromebook/gcc-10/lab-collabora/baseline-qemu_arm64-virt-gicv3.html
Rootfs: http://storage.kernelci.org/images/rootfs/buildroot/buildroot-baseline/20220718.0/arm64/rootfs.cpio.gz


* baseline.login: https://kernelci.org/test/case/id/62e0b41489fe9f9132daf059
failing since 77 days (last pass: v4.19.233-516-ge5e741fbfc87, first fail: v5.10.109-cip5-384-g722204542e8a)



platform | arch | lab | compiler | defconfig | regressions
-----------------------------+--------+---------------+----------+------------------------------+------------
qemu_arm64-virt-gicv3-uefi | arm64 | lab-broonie | gcc-10 | defconfig | 1

Details: https://kernelci.org/test/plan/id/62e0b084e4da64c7c8daf06c

Results: 0 PASS, 1 FAIL, 0 SKIP
Full config: defconfig
Compiler: gcc-10 (aarch64-linux-gnu-gcc (Debian 10.2.1-6) 10.2.1 20210110)
Plain log: https://storage.kernelci.org//cip-gitlab/ci-pavel-linux-test/v4.4-st5-585-gc99f2b257bde/arm64/defconfig/gcc-10/lab-broonie/baseline-qemu_arm64-virt-gicv3-uefi.txt
HTML log: https://storage.kernelci.org//cip-gitlab/ci-pavel-linux-test/v4.4-st5-585-gc99f2b257bde/arm64/defconfig/gcc-10/lab-broonie/baseline-qemu_arm64-virt-gicv3-uefi.html
Rootfs: http://storage.kernelci.org/images/rootfs/buildroot/buildroot-baseline/20220718.0/arm64/rootfs.cpio.gz


* baseline.login: https://kernelci.org/test/case/id/62e0b084e4da64c7c8daf06d
failing since 77 days (last pass: v4.19.233-516-ge5e741fbfc87, first fail: v5.10.109-cip5-384-g722204542e8a)



platform | arch | lab | compiler | defconfig | regressions
-----------------------------+--------+---------------+----------+------------------------------+------------
qemu_arm64-virt-gicv3-uefi | arm64 | lab-broonie | gcc-10 | defconfig+arm64-chromebook | 1

Details: https://kernelci.org/test/plan/id/62e0b1364ef6c70c5bdaf067

Results: 0 PASS, 1 FAIL, 0 SKIP
Full config: defconfig+arm64-chromebook
Compiler: gcc-10 (aarch64-linux-gnu-gcc (Debian 10.2.1-6) 10.2.1 20210110)
Plain log: https://storage.kernelci.org//cip-gitlab/ci-pavel-linux-test/v4.4-st5-585-gc99f2b257bde/arm64/defconfig+arm64-chromebook/gcc-10/lab-broonie/baseline-qemu_arm64-virt-gicv3-uefi.txt
HTML log: https://storage.kernelci.org//cip-gitlab/ci-pavel-linux-test/v4.4-st5-585-gc99f2b257bde/arm64/defconfig+arm64-chromebook/gcc-10/lab-broonie/baseline-qemu_arm64-virt-gicv3-uefi.html
Rootfs: http://storage.kernelci.org/images/rootfs/buildroot/buildroot-baseline/20220718.0/arm64/rootfs.cpio.gz


* baseline.login: https://kernelci.org/test/case/id/62e0b1364ef6c70c5bdaf068
failing since 77 days (last pass: v4.19.233-516-ge5e741fbfc87, first fail: v5.10.109-cip5-384-g722204542e8a)



platform | arch | lab | compiler | defconfig | regressions
-----------------------------+--------+---------------+----------+------------------------------+------------
qemu_arm64-virt-gicv3-uefi | arm64 | lab-collabora | gcc-10 | defconfig | 1

Details: https://kernelci.org/test/plan/id/62e0b2f44992d6b21fdaf056

Results: 0 PASS, 1 FAIL, 0 SKIP
Full config: defconfig
Compiler: gcc-10 (aarch64-linux-gnu-gcc (Debian 10.2.1-6) 10.2.1 20210110)
Plain log: https://storage.kernelci.org//cip-gitlab/ci-pavel-linux-test/v4.4-st5-585-gc99f2b257bde/arm64/defconfig/gcc-10/lab-collabora/baseline-qemu_arm64-virt-gicv3-uefi.txt
HTML log: https://storage.kernelci.org//cip-gitlab/ci-pavel-linux-test/v4.4-st5-585-gc99f2b257bde/arm64/defconfig/gcc-10/lab-collabora/baseline-qemu_arm64-virt-gicv3-uefi.html
Rootfs: http://storage.kernelci.org/images/rootfs/buildroot/buildroot-baseline/20220718.0/arm64/rootfs.cpio.gz


* baseline.login: https://kernelci.org/test/case/id/62e0b2f44992d6b21fdaf057
failing since 77 days (last pass: v4.19.233-516-ge5e741fbfc87, first fail: v5.10.109-cip5-384-g722204542e8a)



platform | arch | lab | compiler | defconfig | regressions
-----------------------------+--------+---------------+----------+------------------------------+------------
qemu_arm64-virt-gicv3-uefi | arm64 | lab-collabora | gcc-10 | defconfig+arm64-chromebook | 1

Details: https://kernelci.org/test/plan/id/62e0b3748f2659c50ddaf057

Results: 0 PASS, 1 FAIL, 0 SKIP
Full config: defconfig+arm64-chromebook
Compiler: gcc-10 (aarch64-linux-gnu-gcc (Debian 10.2.1-6) 10.2.1 20210110)
Plain log: https://storage.kernelci.org//cip-gitlab/ci-pavel-linux-test/v4.4-st5-585-gc99f2b257bde/arm64/defconfig+arm64-chromebook/gcc-10/lab-collabora/baseline-qemu_arm64-virt-gicv3-uefi.txt
HTML log: https://storage.kernelci.org//cip-gitlab/ci-pavel-linux-test/v4.4-st5-585-gc99f2b257bde/arm64/defconfig+arm64-chromebook/gcc-10/lab-collabora/baseline-qemu_arm64-virt-gicv3-uefi.html
Rootfs: http://storage.kernelci.org/images/rootfs/buildroot/buildroot-baseline/20220718.0/arm64/rootfs.cpio.gz


* baseline.login: https://kernelci.org/test/case/id/62e0b3748f2659c50ddaf058
failing since 77 days (last pass: v4.19.233-516-ge5e741fbfc87, first fail: v5.10.109-cip5-384-g722204542e8a)



platform | arch | lab | compiler | defconfig | regressions
-----------------------------+--------+---------------+----------+------------------------------+------------
qemu_x86_64-uefi-mixed | x86_64 | lab-baylibre | gcc-10 | x86_64_defcon...6-chromebook | 1

Details: https://kernelci.org/test/plan/id/62e0b1e8d3501f0966daf058

Results: 0 PASS, 1 FAIL, 0 SKIP
Full config: x86_64_defconfig+x86-chromebook
Compiler: gcc-10 (gcc (Debian 10.2.1-6) 10.2.1 20210110)
Plain log: https://storage.kernelci.org//cip-gitlab/ci-pavel-linux-test/v4.4-st5-585-gc99f2b257bde/x86_64/x86_64_defconfig+x86-chromebook/gcc-10/lab-baylibre/baseline-qemu_x86_64-uefi-mixed.txt
HTML log: https://storage.kernelci.org//cip-gitlab/ci-pavel-linux-test/v4.4-st5-585-gc99f2b257bde/x86_64/x86_64_defconfig+x86-chromebook/gcc-10/lab-baylibre/baseline-qemu_x86_64-uefi-mixed.html
Rootfs: http://storage.kernelci.org/images/rootfs/buildroot/buildroot-baseline/20220718.0/x86/rootfs.cpio.gz


* baseline.login: https://kernelci.org/test/case/id/62e0b1e8d3501f0966daf059
failing since 0 day (last pass: v5.10.129-cip12-36-g21d9d56f4de5a, first fail: v4.4-st5-586-geb97410e0086c)



platform | arch | lab | compiler | defconfig | regressions
-----------------------------+--------+---------------+----------+------------------------------+------------
qemu_x86_64-uefi-mixed | x86_64 | lab-baylibre | gcc-10 | x86_64_defconfig | 1

Details: https://kernelci.org/test/plan/id/62e0b1e9d3501f0966daf05b

Results: 0 PASS, 1 FAIL, 0 SKIP
Full config: x86_64_defconfig
Compiler: gcc-10 (gcc (Debian 10.2.1-6) 10.2.1 20210110)
Plain log: https://storage.kernelci.org//cip-gitlab/ci-pavel-linux-test/v4.4-st5-585-gc99f2b257bde/x86_64/x86_64_defconfig/gcc-10/lab-baylibre/baseline-qemu_x86_64-uefi-mixed.txt
HTML log: https://storage.kernelci.org//cip-gitlab/ci-pavel-linux-test/v4.4-st5-585-gc99f2b257bde/x86_64/x86_64_defconfig/gcc-10/lab-baylibre/baseline-qemu_x86_64-uefi-mixed.html
Rootfs: http://storage.kernelci.org/images/rootfs/buildroot/buildroot-baseline/20220718.0/x86/rootfs.cpio.gz


* baseline.login: https://kernelci.org/test/case/id/62e0b1e9d3501f0966daf05c
failing since 0 day (last pass: v5.10.129-cip12-36-g21d9d56f4de5a, first fail: v4.4-st5-586-geb97410e0086c)



platform | arch | lab | compiler | defconfig | regressions
-----------------------------+--------+---------------+----------+------------------------------+------------
qemu_x86_64-uefi-mixed | x86_64 | lab-broonie | gcc-10 | x86_64_defcon...6-chromebook | 1

Details: https://kernelci.org/test/plan/id/62e0b24ebc071248ccdaf056

Results: 0 PASS, 1 FAIL, 0 SKIP
Full config: x86_64_defconfig+x86-chromebook
Compiler: gcc-10 (gcc (Debian 10.2.1-6) 10.2.1 20210110)
Plain log: https://storage.kernelci.org//cip-gitlab/ci-pavel-linux-test/v4.4-st5-585-gc99f2b257bde/x86_64/x86_64_defconfig+x86-chromebook/gcc-10/lab-broonie/baseline-qemu_x86_64-uefi-mixed.txt
HTML log: https://storage.kernelci.org//cip-gitlab/ci-pavel-linux-test/v4.4-st5-585-gc99f2b257bde/x86_64/x86_64_defconfig+x86-chromebook/gcc-10/lab-broonie/baseline-qemu_x86_64-uefi-mixed.html
Rootfs: http://storage.kernelci.org/images/rootfs/buildroot/buildroot-baseline/20220718.0/x86/rootfs.cpio.gz


* baseline.login: https://kernelci.org/test/case/id/62e0b24ebc071248ccdaf057
failing since 0 day (last pass: v5.10.129-cip12-36-g21d9d56f4de5a, first fail: v4.4-st5-586-geb97410e0086c)



platform | arch | lab | compiler | defconfig | regressions
-----------------------------+--------+---------------+----------+------------------------------+------------
qemu_x86_64-uefi-mixed | x86_64 | lab-broonie | gcc-10 | x86_64_defconfig | 1

Details: https://kernelci.org/test/plan/id/62e0b2c655c296c1c3daf060

Results: 0 PASS, 1 FAIL, 0 SKIP
Full config: x86_64_defconfig
Compiler: gcc-10 (gcc (Debian 10.2.1-6) 10.2.1 20210110)
Plain log: https://storage.kernelci.org//cip-gitlab/ci-pavel-linux-test/v4.4-st5-585-gc99f2b257bde/x86_64/x86_64_defconfig/gcc-10/lab-broonie/baseline-qemu_x86_64-uefi-mixed.txt
HTML log: https://storage.kernelci.org//cip-gitlab/ci-pavel-linux-test/v4.4-st5-585-gc99f2b257bde/x86_64/x86_64_defconfig/gcc-10/lab-broonie/baseline-qemu_x86_64-uefi-mixed.html
Rootfs: http://storage.kernelci.org/images/rootfs/buildroot/buildroot-baseline/20220718.0/x86/rootfs.cpio.gz


* baseline.login: https://kernelci.org/test/case/id/62e0b2c655c296c1c3daf061
failing since 0 day (last pass: v5.10.129-cip12-36-g21d9d56f4de5a, first fail: v4.4-st5-586-geb97410e0086c)



platform | arch | lab | compiler | defconfig | regressions
-----------------------------+--------+---------------+----------+------------------------------+------------
qemu_x86_64-uefi-mixed | x86_64 | lab-collabora | gcc-10 | x86_64_defconfig | 1

Details: https://kernelci.org/test/plan/id/62e0b4e8ec5d7a49a7daf05d

Results: 0 PASS, 1 FAIL, 0 SKIP
Full config: x86_64_defconfig
Compiler: gcc-10 (gcc (Debian 10.2.1-6) 10.2.1 20210110)
Plain log: https://storage.kernelci.org//cip-gitlab/ci-pavel-linux-test/v4.4-st5-585-gc99f2b257bde/x86_64/x86_64_defconfig/gcc-10/lab-collabora/baseline-qemu_x86_64-uefi-mixed.txt
HTML log: https://storage.kernelci.org//cip-gitlab/ci-pavel-linux-test/v4.4-st5-585-gc99f2b257bde/x86_64/x86_64_defconfig/gcc-10/lab-collabora/baseline-qemu_x86_64-uefi-mixed.html
Rootfs: http://storage.kernelci.org/images/rootfs/buildroot/buildroot-baseline/20220718.0/x86/rootfs.cpio.gz


* baseline.login: https://kernelci.org/test/case/id/62e0b4e8ec5d7a49a7daf05e
failing since 0 day (last pass: v5.10.129-cip12-36-g21d9d56f4de5a, first fail: v4.4-st5-586-geb97410e0086c)



platform | arch | lab | compiler | defconfig | regressions
-----------------------------+--------+---------------+----------+------------------------------+------------
qemu_x86_64-uefi-mixed | x86_64 | lab-collabora | gcc-10 | x86_64_defcon...6-chromebook | 1

Details: https://kernelci.org/test/plan/id/62e0b511ec5d7a49a7daf065

Results: 0 PASS, 1 FAIL, 0 SKIP
Full config: x86_64_defconfig+x86-chromebook
Compiler: gcc-10 (gcc (Debian 10.2.1-6) 10.2.1 20210110)
Plain log: https://storage.kernelci.org//cip-gitlab/ci-pavel-linux-test/v4.4-st5-585-gc99f2b257bde/x86_64/x86_64_defconfig+x86-chromebook/gcc-10/lab-collabora/baseline-qemu_x86_64-uefi-mixed.txt
HTML log: https://storage.kernelci.org//cip-gitlab/ci-pavel-linux-test/v4.4-st5-585-gc99f2b257bde/x86_64/x86_64_defconfig+x86-chromebook/gcc-10/lab-collabora/baseline-qemu_x86_64-uefi-mixed.html
Rootfs: http://storage.kernelci.org/images/rootfs/buildroot/buildroot-baseline/20220718.0/x86/rootfs.cpio.gz


* baseline.login: https://kernelci.org/test/case/id/62e0b511ec5d7a49a7daf066
failing since 0 day (last pass: v5.10.129-cip12-36-g21d9d56f4de5a, first fail: v4.4-st5-586-geb97410e0086c)



platform | arch | lab | compiler | defconfig | regressions
-----------------------------+--------+---------------+----------+------------------------------+------------
rk3288-veyron-jaq | arm | lab-collabora | gcc-10 | multi_v7_defconfig | 28

Details: https://kernelci.org/test/plan/id/62e0d8357f4569c261daf057

Results: 39 PASS, 30 FAIL, 2 SKIP
Full config: multi_v7_defconfig
Compiler: gcc-10 (arm-linux-gnueabihf-gcc (Debian 10.2.1-6) 10.2.1 20210110)
Plain log: https://storage.kernelci.org//cip-gitlab/ci-pavel-linux-test/v4.4-st5-585-gc99f2b257bde/arm/multi_v7_defconfig/gcc-10/lab-collabora/baseline-rk3288-veyron-jaq.txt
HTML log: https://storage.kernelci.org//cip-gitlab/ci-pavel-linux-test/v4.4-st5-585-gc99f2b257bde/arm/multi_v7_defconfig/gcc-10/lab-collabora/baseline-rk3288-veyron-jaq.html
Rootfs: http://storage.kernelci.org/images/rootfs/buildroot/buildroot-baseline/20220718.0/armel/rootfs.cpio.gz


* baseline.bootrr.rockchip-vopl-probed: https://kernelci.org/test/case/id/62e0d8357f4569c261daf05c
failing since 0 day (last pass: v5.10.129-cip12-36-g21d9d56f4de5a, first fail: v4.4-st5-586-geb97410e0086c)

2022-07-27T06:15:58.287027 /lava-6901620/1/../bin/lava-test-case
2022-07-27T06:15:58.309679 [ 49.866128] <LAVA_SIGNAL_TESTCASE TEST_CASE_ID=rockchip-vopl-probed RESULT=fail>

* baseline.bootrr.rockchip-vopb-probed: https://kernelci.org/test/case/id/62e0d8357f4569c261daf05d
failing since 0 day (last pass: v5.10.129-cip12-36-g21d9d56f4de5a, first fail: v4.4-st5-586-geb97410e0086c)

2022-07-27T06:15:57.242063 /lava-6901620/1/../bin/lava-test-case
2022-07-27T06:15:57.265409 [ 48.821942] <LAVA_SIGNAL_TESTCASE TEST_CASE_ID=rockchip-vopb-probed RESULT=fail>

* baseline.bootrr.rockchip-usb-phy-grf-probed: https://kernelci.org/test/case/id/62e0d8357f4569c261daf05f
failing since 0 day (last pass: v5.10.129-cip12-36-g21d9d56f4de5a, first fail: v4.4-st5-586-geb97410e0086c)

2022-07-27T06:15:56.157275 /lava-6901620/1/../bin/lava-test-case
2022-07-27T06:15:56.178308 [ 47.734443] <LAVA_SIGNAL_TESTCASE TEST_CASE_ID=rockchip-usb-phy-grf-probed RESULT=fail>

* baseline.bootrr.rockchip-pwm0-probed: https://kernelci.org/test/case/id/62e0d8357f4569c261daf067
failing since 0 day (last pass: v5.10.129-cip12-36-g21d9d56f4de5a, first fail: v4.4-st5-586-geb97410e0086c)

2022-07-27T06:15:54.937145 /lava-6901620/1/../bin/lava-test-case
2022-07-27T06:15:54.962461 [ 46.519194] <LAVA_SIGNAL_TESTCASE TEST_CASE_ID=rockchip-pwm0-probed RESULT=fail>

* baseline.bootrr.rockchip-pm-domain-pmu-probed: https://kernelci.org/test/case/id/62e0d8357f4569c261daf069
failing since 0 day (last pass: v5.10.129-cip12-36-g21d9d56f4de5a, first fail: v4.4-st5-586-geb97410e0086c)

2022-07-27T06:15:53.857054 /lava-6901620/1/../bin/lava-test-case
2022-07-27T06:15:53.875870 [ 45.430906] <LAVA_SIGNAL_TESTCASE TEST_CASE_ID=rockchip-pm-domain-pmu-probed RESULT=fail>

* baseline.bootrr.rockchip-pm-domain-driver-present: https://kernelci.org/test/case/id/62e0d8357f4569c261daf06a
failing since 0 day (last pass: v5.10.129-cip12-36-g21d9d56f4de5a, first fail: v4.4-st5-586-geb97410e0086c)

2022-07-27T06:15:52.793314 /lava-6901620/1/../bin/lava-test-case
2022-07-27T06:15:52.820081 [ 44.375967] <LAVA_SIGNAL_TESTCASE TEST_CASE_ID=rockchip-pm-domain-driver-present RESULT=fail>

* baseline.bootrr.rockchip-iodomain-driver-present: https://kernelci.org/test/case/id/62e0d8357f4569c261daf06c
failing since 0 day (last pass: v5.10.129-cip12-36-g21d9d56f4de5a, first fail: v4.4-st5-586-geb97410e0086c)

2022-07-27T06:15:50.672932 /lava-6901620/1/../bin/lava-test-case
2022-07-27T06:15:50.697099 [ 42.253510] <LAVA_SIGNAL_TESTCASE TEST_CASE_ID=rockchip-iodomain-driver-present RESULT=fail>

* baseline.bootrr.rockchip-i2s-probed: https://kernelci.org/test/case/id/62e0d8357f4569c261daf06d
failing since 0 day (last pass: v5.10.129-cip12-36-g21d9d56f4de5a, first fail: v4.4-st5-586-geb97410e0086c)

2022-07-27T06:15:49.612092 /lava-6901620/1/../bin/lava-test-case
2022-07-27T06:15:49.636826 [ 41.194290] <LAVA_SIGNAL_TESTCASE TEST_CASE_ID=rockchip-i2s-probed RESULT=fail>

* baseline.bootrr.rockcip-i2s-driver-present: https://kernelci.org/test/case/id/62e0d8357f4569c261daf06e
failing since 0 day (last pass: v5.10.129-cip12-36-g21d9d56f4de5a, first fail: v4.4-st5-586-geb97410e0086c)

2022-07-27T06:15:48.551086 /lava-6901620/1/../bin/lava-test-case
2022-07-27T06:15:48.576120 [ 40.132848] <LAVA_SIGNAL_TESTCASE TEST_CASE_ID=rockcip-i2s-driver-present RESULT=fail>

* baseline.bootrr.rockchip-dp-phy-grf-probed: https://kernelci.org/test/case/id/62e0d8357f4569c261daf06f
failing since 0 day (last pass: v5.10.129-cip12-36-g21d9d56f4de5a, first fail: v4.4-st5-586-geb97410e0086c)

2022-07-27T06:15:47.491825 /lava-6901620/1/../bin/lava-test-case
2022-07-27T06:15:47.516006 [ 39.073075] <LAVA_SIGNAL_TESTCASE TEST_CASE_ID=rockchip-dp-phy-grf-probed RESULT=fail>

* baseline.bootrr.rockchip-dp-phy-driver-present: https://kernelci.org/test/case/id/62e0d8357f4569c261daf070
failing since 0 day (last pass: v5.10.129-cip12-36-g21d9d56f4de5a, first fail: v4.4-st5-586-geb97410e0086c)

2022-07-27T06:15:46.432532 /lava-6901620/1/../bin/lava-test-case
2022-07-27T06:15:46.458276 [ 38.013240] <LAVA_SIGNAL_TESTCASE TEST_CASE_ID=rockchip-dp-phy-driver-present RESULT=fail>

* baseline.bootrr.rockchip-dp-edp-probed: https://kernelci.org/test/case/id/62e0d8357f4569c261daf071
failing since 0 day (last pass: v5.10.129-cip12-36-g21d9d56f4de5a, first fail: v4.4-st5-586-geb97410e0086c)

2022-07-27T06:15:45.372786 /lava-6901620/1/../bin/lava-test-case
2022-07-27T06:15:45.396340 [ 36.953698] <LAVA_SIGNAL_TESTCASE TEST_CASE_ID=rockchip-dp-edp-probed RESULT=fail>

* baseline.bootrr.rockchip-dp-driver-present: https://kernelci.org/test/case/id/62e0d8357f4569c261daf072
failing since 0 day (last pass: v5.10.129-cip12-36-g21d9d56f4de5a, first fail: v4.4-st5-586-geb97410e0086c)

2022-07-27T06:15:44.315492 /lava-6901620/1/../bin/lava-test-case
2022-07-27T06:15:44.338201 [ 35.894512] <LAVA_SIGNAL_TESTCASE TEST_CASE_ID=rockchip-dp-driver-present RESULT=fail>

* baseline.bootrr.rk_iommu-vpu_mmu-probed: https://kernelci.org/test/case/id/62e0d8357f4569c261daf073
failing since 0 day (last pass: v5.10.129-cip12-36-g21d9d56f4de5a, first fail: v4.4-st5-586-geb97410e0086c)

2022-07-27T06:15:43.258214 /lava-6901620/1/../bin/lava-test-case
2022-07-27T06:15:43.283044 [ 34.840531] <LAVA_SIGNAL_TESTCASE TEST_CASE_ID=rk_iommu-vpu_mmu-probed RESULT=fail>

* baseline.bootrr.rk_iommu-vopl_mmu-probed: https://kernelci.org/test/case/id/62e0d8357f4569c261daf074
failing since 0 day (last pass: v5.10.129-cip12-36-g21d9d56f4de5a, first fail: v4.4-st5-586-geb97410e0086c)

2022-07-27T06:15:42.215217 /lava-6901620/1/../bin/lava-test-case
2022-07-27T06:15:42.234219 [ 33.790689] <LAVA_SIGNAL_TESTCASE TEST_CASE_ID=rk_iommu-vopl_mmu-probed RESULT=fail>

* baseline.bootrr.rk_iommu-vopb_mmu-probed: https://kernelci.org/test/case/id/62e0d8357f4569c261daf075
failing since 0 day (last pass: v5.10.129-cip12-36-g21d9d56f4de5a, first fail: v4.4-st5-586-geb97410e0086c)

2022-07-27T06:15:41.155230 /lava-6901620/1/../bin/lava-test-case
2022-07-27T06:15:41.180383 [ 32.736827] <LAVA_SIGNAL_TESTCASE TEST_CASE_ID=rk_iommu-vopb_mmu-probed RESULT=fail>

* baseline.bootrr.ramoops-probed: https://kernelci.org/test/case/id/62e0d8357f4569c261daf079
failing since 0 day (last pass: v5.10.129-cip12-36-g21d9d56f4de5a, first fail: v4.4-st5-586-geb97410e0086c)

2022-07-27T06:15:37.848209 /lava-6901620/1/../bin/lava-test-case
2022-07-27T06:15:37.862298 [ 29.420210] <LAVA_SIGNAL_TESTCASE TEST_CASE_ID=ramoops-probed RESULT=fail>

* baseline.bootrr.ramoops-driver-present: https://kernelci.org/test/case/id/62e0d8357f4569c261daf07a
failing since 0 day (last pass: v5.10.129-cip12-36-g21d9d56f4de5a, first fail: v4.4-st5-586-geb97410e0086c)

2022-07-27T06:15:36.783487 /lava-6901620/1/../bin/lava-test-case
2022-07-27T06:15:36.807388 [ 28.364609] <LAVA_SIGNAL_TESTCASE TEST_CASE_ID=ramoops-driver-present RESULT=fail>

* baseline.bootrr.dwhdmi-rockchip-probed: https://kernelci.org/test/case/id/62e0d8357f4569c261daf083
failing since 0 day (last pass: v5.10.129-cip12-36-g21d9d56f4de5a, first fail: v4.4-st5-586-geb97410e0086c)

2022-07-27T06:15:34.493566 /lava-6901620/1/../bin/lava-test-case
2022-07-27T06:15:34.511442 [ 26.068322] <LAVA_SIGNAL_TESTCASE TEST_CASE_ID=dwhdmi-rockchip-probed RESULT=fail>

* baseline.bootrr.dw_wdt-probed: https://kernelci.org/test/case/id/62e0d8357f4569c261daf088
failing since 0 day (last pass: v5.10.129-cip12-36-g21d9d56f4de5a, first fail: v4.4-st5-586-geb97410e0086c)

2022-07-27T06:15:33.348489 /lava-6901620/1/../bin/lava-test-case
2022-07-27T06:15:33.371957 [ 24.929398] <LAVA_SIGNAL_TESTCASE TEST_CASE_ID=dw_wdt-probed RESULT=fail>

* baseline.bootrr.rk3288-crypto-probed: https://kernelci.org/test/case/id/62e0d8357f4569c261daf08d
failing since 0 day (last pass: v5.10.129-cip12-36-g21d9d56f4de5a, first fail: v4.4-st5-586-geb97410e0086c)

2022-07-27T06:15:39.947577 /lava-6901620/1/../bin/lava-test-case
2022-07-27T06:15:39.973603 [ 31.530510] <LAVA_SIGNAL_TESTCASE TEST_CASE_ID=rk3288-crypto-probed RESULT=fail>

* baseline.bootrr.rk3288-crypto-driver-present: https://kernelci.org/test/case/id/62e0d8357f4569c261daf08e
failing since 0 day (last pass: v5.10.129-cip12-36-g21d9d56f4de5a, first fail: v4.4-st5-586-geb97410e0086c)

2022-07-27T06:15:38.888664 /lava-6901620/1/../bin/lava-test-case
2022-07-27T06:15:38.912330 [ 30.468769] <LAVA_SIGNAL_TESTCASE TEST_CASE_ID=rk3288-crypto-driver-present RESULT=fail>

* baseline.bootrr.dw_wdt-driver-present: https://kernelci.org/test/case/id/62e0d8357f4569c261daf08f
failing since 0 day (last pass: v5.10.129-cip12-36-g21d9d56f4de5a, first fail: v4.4-st5-586-geb97410e0086c)

2022-07-27T06:15:32.290723 /lava-6901620/1/../bin/lava-test-case
2022-07-27T06:15:32.314069 [ 23.869958] <LAVA_SIGNAL_TESTCASE TEST_CASE_ID=dw_wdt-driver-present RESULT=fail>

* baseline.bootrr.cros-ec-keyb-probed: https://kernelci.org/test/case/id/62e0d8357f4569c261daf094
failing since 0 day (last pass: v5.10.129-cip12-36-g21d9d56f4de5a, first fail: v4.4-st5-586-geb97410e0086c)

2022-07-27T06:15:31.098902 /lava-6901620/1/../bin/lava-test-case
2022-07-27T06:15:31.123770 [ 22.680307] <LAVA_SIGNAL_TESTCASE TEST_CASE_ID=cros-ec-keyb-probed RESULT=fail>

* baseline.bootrr.cros-ec-i2c-tunnel-probed: https://kernelci.org/test/case/id/62e0d8357f4569c261daf096
failing since 0 day (last pass: v5.10.129-cip12-36-g21d9d56f4de5a, first fail: v4.4-st5-586-geb97410e0086c)

2022-07-27T06:15:30.014727 /lava-6901620/1/../bin/lava-test-case
2022-07-27T06:15:30.038573 [ 21.594689] <LAVA_SIGNAL_TESTCASE TEST_CASE_ID=cros-ec-i2c-tunnel-probed RESULT=fail>

* baseline.bootrr.cros-ec-i2c-tunnel-driver-present: https://kernelci.org/test/case/id/62e0d8357f4569c261daf097
failing since 0 day (last pass: v5.10.129-cip12-36-g21d9d56f4de5a, first fail: v4.4-st5-586-geb97410e0086c)

2022-07-27T06:15:28.967903 /lava-6901620/1/../bin/lava-test-case
2022-07-27T06:15:28.992673 [ 20.548858] <LAVA_SIGNAL_TESTCASE TEST_CASE_ID=cros-ec-i2c-tunnel-driver-present RESULT=fail>

* baseline.bootrr.cros-ec-dev-probed: https://kernelci.org/test/case/id/62e0d8357f4569c261daf098
failing since 0 day (last pass: v5.10.129-cip12-36-g21d9d56f4de5a, first fail: v4.4-st5-586-geb97410e0086c)

2022-07-27T06:15:27.910138 /lava-6901620/1/../bin/lava-test-case
2022-07-27T06:15:27.933499 [ 19.489714] <LAVA_SIGNAL_TESTCASE TEST_CASE_ID=cros-ec-dev-probed RESULT=fail>

* baseline.bootrr.cros-ec-dev-driver-present: https://kernelci.org/test/case/id/62e0d8357f4569c261daf099
failing since 0 day (last pass: v5.10.129-cip12-36-g21d9d56f4de5a, first fail: v4.4-st5-586-geb97410e0086c)

2022-07-27T06:15:26.848182 /lava-6901620/1/../bin/lava-test-case
2022-07-27T06:15:26.873910 [ 18.430426] <LAVA_SIGNAL_TESTCASE TEST_CASE_ID=cros-ec-dev-driver-present RESULT=fail>


cip-gitlab/ci/pavel/linux-test baseline-cip-nfs: 4 runs, 4 regressions (v4.4-st5-585-gc99f2b257bde) #kernelci

kernelci.org bot <bot@...>
 

cip-gitlab/ci/pavel/linux-test baseline-cip-nfs: 4 runs, 4 regressions (v4.4-st5-585-gc99f2b257bde)

Regressions Summary
-------------------

platform | arch | lab | compiler | defconfig | regressions
-----------------------------+--------+---------------+----------+------------------------------+------------
beaglebone-black | arm | lab-broonie | gcc-10 | multi_v7_defconfig | 1
beaglebone-black | arm | lab-cip | gcc-10 | multi_v7_defconfig | 1
hp-11A-G6-EE-grunt | x86_64 | lab-collabora | gcc-10 | x86_64_defcon...6-chromebook | 1
hp-x360-12b-c...4020-octopus | x86_64 | lab-collabora | gcc-10 | x86_64_defcon...6-chromebook | 1

Details: https://kernelci.org/test/job/cip-gitlab/branch/ci%2Fpavel%2Flinux-test/kernel/v4.4-st5-585-gc99f2b257bde/plan/baseline-cip-nfs/

Test: baseline-cip-nfs
Tree: cip-gitlab
Branch: ci/pavel/linux-test
Describe: v4.4-st5-585-gc99f2b257bde
URL: https://gitlab.com/cip-project/cip-kernel/linux-cip.git
SHA: c99f2b257bde3cd60a833056aab624ad5fab3812


Test Regressions
----------------


platform | arch | lab | compiler | defconfig | regressions
-----------------------------+--------+---------------+----------+------------------------------+------------
beaglebone-black | arm | lab-broonie | gcc-10 | multi_v7_defconfig | 1

Details: https://kernelci.org/test/plan/id/62e0b25643d1bb1072daf074

Results: 0 PASS, 1 FAIL, 0 SKIP
Full config: multi_v7_defconfig
Compiler: gcc-10 (arm-linux-gnueabihf-gcc (Debian 10.2.1-6) 10.2.1 20210110)
Plain log: https://storage.kernelci.org//cip-gitlab/ci-pavel-linux-test/v4.4-st5-585-gc99f2b257bde/arm/multi_v7_defconfig/gcc-10/lab-broonie/baseline-cip-nfs-beaglebone-black.txt
HTML log: https://storage.kernelci.org//cip-gitlab/ci-pavel-linux-test/v4.4-st5-585-gc99f2b257bde/arm/multi_v7_defconfig/gcc-10/lab-broonie/baseline-cip-nfs-beaglebone-black.html
Rootfs: https://storage.kernelci.org/images/rootfs/cip/20211105/qemu-arm/cip-core-image-kernelci-cip-core-buster-qemu-arm-initrd.img.gz


* baseline-cip-nfs.login: https://kernelci.org/test/case/id/62e0b25643d1bb1072daf075
failing since 76 days (last pass: v5.10.109-cip5-384-g722204542e8a, first fail: v4.4-st5-260-gb0fe64f485ff)



platform | arch | lab | compiler | defconfig | regressions
-----------------------------+--------+---------------+----------+------------------------------+------------
beaglebone-black | arm | lab-cip | gcc-10 | multi_v7_defconfig | 1

Details: https://kernelci.org/test/plan/id/62e0b6112eb9b911dcdaf066

Results: 3 PASS, 1 FAIL, 0 SKIP
Full config: multi_v7_defconfig
Compiler: gcc-10 (arm-linux-gnueabihf-gcc (Debian 10.2.1-6) 10.2.1 20210110)
Plain log: https://storage.kernelci.org//cip-gitlab/ci-pavel-linux-test/v4.4-st5-585-gc99f2b257bde/arm/multi_v7_defconfig/gcc-10/lab-cip/baseline-cip-nfs-beaglebone-black.txt
HTML log: https://storage.kernelci.org//cip-gitlab/ci-pavel-linux-test/v4.4-st5-585-gc99f2b257bde/arm/multi_v7_defconfig/gcc-10/lab-cip/baseline-cip-nfs-beaglebone-black.html
Rootfs: https://storage.kernelci.org/images/rootfs/cip/20211105/qemu-arm/cip-core-image-kernelci-cip-core-buster-qemu-arm-initrd.img.gz


* baseline-cip-nfs.dmesg.crit: https://kernelci.org/test/case/id/62e0b6112eb9b911dcdaf069
failing since 0 day (last pass: v5.10.129-cip12-36-g21d9d56f4de5a, first fail: v4.4-st5-586-geb97410e0086c)
1 lines

2022-07-27T03:50:17.495994 / #
2022-07-27T03:50:17.502867
2022-07-27T03:50:22.530568 / # export NFS_ROOTFS='/var/lib/lava/dispatcher/tmp/716784/extract-nfsrootfs-crnll4d3'
2022-07-27T03:50:22.541542 export NFS_ROOTFS='/var/lib/lava/dispatcher/tmp/716784/extract-nfsrootfs-</lib/lava/dispatcher/tmp/716784/extract-nfsrootfs-c rnll4d3'
2022-07-27T03:50:24.598452 / # export NFS_SERVER_IP='172.16.3.3'
2022-07-27T03:50:24.609330 export NFS_SERVER_IP='172.16.3.3'
2022-07-27T03:50:24.723698 / # #
2022-07-27T03:50:24.730330 #
2022-07-27T03:50:24.845279 / # export SHELL=/bin/sh
2022-07-27T03:50:24.851841 export SHELL=/bin/sh
... (13 line(s) more)



platform | arch | lab | compiler | defconfig | regressions
-----------------------------+--------+---------------+----------+------------------------------+------------
hp-11A-G6-EE-grunt | x86_64 | lab-collabora | gcc-10 | x86_64_defcon...6-chromebook | 1

Details: https://kernelci.org/test/plan/id/62e0b782df106222eddaf056

Results: 0 PASS, 1 FAIL, 0 SKIP
Full config: x86_64_defconfig+x86-chromebook
Compiler: gcc-10 (gcc (Debian 10.2.1-6) 10.2.1 20210110)
Plain log: https://storage.kernelci.org//cip-gitlab/ci-pavel-linux-test/v4.4-st5-585-gc99f2b257bde/x86_64/x86_64_defconfig+x86-chromebook/gcc-10/lab-collabora/baseline-cip-nfs-hp-11A-G6-EE-grunt.txt
HTML log: https://storage.kernelci.org//cip-gitlab/ci-pavel-linux-test/v4.4-st5-585-gc99f2b257bde/x86_64/x86_64_defconfig+x86-chromebook/gcc-10/lab-collabora/baseline-cip-nfs-hp-11A-G6-EE-grunt.html
Rootfs: https://storage.kernelci.org/images/rootfs/cip/20211105/qemu-amd64/cip-core-image-kernelci-cip-core-buster-qemu-amd64-initrd.img.gz


* baseline-cip-nfs.login: https://kernelci.org/test/case/id/62e0b782df106222eddaf057
failing since 0 day (last pass: v5.10.129-cip12-36-g21d9d56f4de5a, first fail: v4.4-st5-586-geb97410e0086c)



platform | arch | lab | compiler | defconfig | regressions
-----------------------------+--------+---------------+----------+------------------------------+------------
hp-x360-12b-c...4020-octopus | x86_64 | lab-collabora | gcc-10 | x86_64_defcon...6-chromebook | 1

Details: https://kernelci.org/test/plan/id/62e0b48c8fd25dce30daf07d

Results: 0 PASS, 1 FAIL, 0 SKIP
Full config: x86_64_defconfig+x86-chromebook
Compiler: gcc-10 (gcc (Debian 10.2.1-6) 10.2.1 20210110)
Plain log: https://storage.kernelci.org//cip-gitlab/ci-pavel-linux-test/v4.4-st5-585-gc99f2b257bde/x86_64/x86_64_defconfig+x86-chromebook/gcc-10/lab-collabora/baseline-cip-nfs-hp-x360-12b-ca0010nr-n4020-octopus.txt
HTML log: https://storage.kernelci.org//cip-gitlab/ci-pavel-linux-test/v4.4-st5-585-gc99f2b257bde/x86_64/x86_64_defconfig+x86-chromebook/gcc-10/lab-collabora/baseline-cip-nfs-hp-x360-12b-ca0010nr-n4020-octopus.html
Rootfs: https://storage.kernelci.org/images/rootfs/cip/20211105/qemu-amd64/cip-core-image-kernelci-cip-core-buster-qemu-amd64-initrd.img.gz


* baseline-cip-nfs.login: https://kernelci.org/test/case/id/62e0b48c8fd25dce30daf07e
failing since 0 day (last pass: v5.10.129-cip12-36-g21d9d56f4de5a, first fail: v4.4-st5-586-geb97410e0086c)


cip-gitlab/ci/pavel/linux-test build: 175 builds: 5 failed, 170 passed, 6 errors, 188 warnings (v4.4-st5-585-gc99f2b257bde) #kernelci

kernelci.org bot <bot@...>
 

cip-gitlab/ci/pavel/linux-test build: 175 builds: 5 failed, 170 passed, 6 errors, 188 warnings (v4.4-st5-585-gc99f2b257bde)

Full Build Summary: https://kernelci.org/build/cip-gitlab/branch/ci%2Fpavel%2Flinux-test/kernel/v4.4-st5-585-gc99f2b257bde/

Tree: cip-gitlab
Branch: ci/pavel/linux-test
Git Describe: v4.4-st5-585-gc99f2b257bde
Git Commit: c99f2b257bde3cd60a833056aab624ad5fab3812
Git URL: https://gitlab.com/cip-project/cip-kernel/linux-cip.git
Built: 6 unique architectures

Build Failures Detected:

arm:
rpc_defconfig: (gcc-10) FAIL

mips:
fuloong2e_defconfig: (gcc-10) FAIL
ip27_defconfig: (gcc-10) FAIL
ip28_defconfig: (gcc-10) FAIL
lemote2f_defconfig: (gcc-10) FAIL

Errors and Warnings Detected:

arc:
axs103_defconfig (gcc-10): 1 warning
nsim_hs_defconfig (gcc-10): 1 warning
nsim_hs_smp_defconfig (gcc-10): 1 warning
nsimosci_hs_defconfig (gcc-10): 1 warning
nsimosci_hs_smp_defconfig (gcc-10): 1 warning
vdk_hs38_defconfig (gcc-10): 1 warning
vdk_hs38_smp_defconfig (gcc-10): 1 warning

arm64:
defconfig (gcc-10): 2 warnings
defconfig+arm64-chromebook (gcc-10): 2 warnings

arm:
acs5k_defconfig (gcc-10): 1 warning
acs5k_tiny_defconfig (gcc-10): 1 warning
am200epdkit_defconfig (gcc-10): 1 warning
assabet_defconfig (gcc-10): 1 warning
at91_dt_defconfig (gcc-10): 1 warning
axm55xx_defconfig (gcc-10): 1 warning
bcm2835_defconfig (gcc-10): 1 warning
bcm_defconfig (gcc-10): 1 warning
cerfcube_defconfig (gcc-10): 1 warning
clps711x_defconfig (gcc-10): 2 warnings
cm_x2xx_defconfig (gcc-10): 1 warning
cm_x300_defconfig (gcc-10): 1 warning
colibri_pxa270_defconfig (gcc-10): 1 warning
colibri_pxa300_defconfig (gcc-10): 1 warning
collie_defconfig (gcc-10): 1 warning
corgi_defconfig (gcc-10): 1 warning
davinci_all_defconfig (gcc-10): 2 warnings
dove_defconfig (gcc-10): 1 warning
ebsa110_defconfig (gcc-10): 1 warning
efm32_defconfig (gcc-10): 1 warning
em_x270_defconfig (gcc-10): 1 warning
ep93xx_defconfig (gcc-10): 1 warning
eseries_pxa_defconfig (gcc-10): 1 warning
exynos_defconfig (gcc-10): 1 warning
footbridge_defconfig (gcc-10): 1 warning
h3600_defconfig (gcc-10): 1 warning
h5000_defconfig (gcc-10): 1 warning
hackkit_defconfig (gcc-10): 1 warning
hisi_defconfig (gcc-10): 1 warning
imote2_defconfig (gcc-10): 1 warning
imx_v4_v5_defconfig (gcc-10): 1 warning
integrator_defconfig (gcc-10): 1 warning
iop13xx_defconfig (gcc-10): 1 warning
iop32x_defconfig (gcc-10): 1 warning
iop33x_defconfig (gcc-10): 1 warning
ixp4xx_defconfig (gcc-10): 1 warning
jornada720_defconfig (gcc-10): 1 warning
keystone_defconfig (gcc-10): 1 warning
ks8695_defconfig (gcc-10): 1 warning
lart_defconfig (gcc-10): 1 warning
lpc18xx_defconfig (gcc-10): 1 warning
lpc32xx_defconfig (gcc-10): 2 warnings
lpd270_defconfig (gcc-10): 1 warning
lubbock_defconfig (gcc-10): 1 warning
magician_defconfig (gcc-10): 1 warning
mainstone_defconfig (gcc-10): 1 warning
mini2440_defconfig (gcc-10): 2 warnings
mmp2_defconfig (gcc-10): 1 warning
multi_v7_defconfig (gcc-10): 1 warning
mv78xx0_defconfig (gcc-10): 1 warning
mvebu_v5_defconfig (gcc-10): 1 warning
mvebu_v7_defconfig (gcc-10): 1 warning
mxs_defconfig (gcc-10): 2 warnings
neponset_defconfig (gcc-10): 1 warning
netwinder_defconfig (gcc-10): 1 warning
netx_defconfig (gcc-10): 1 warning
nhk8815_defconfig (gcc-10): 1 warning
omap1_defconfig (gcc-10): 2 warnings
omap2plus_defconfig (gcc-10): 1 warning
orion5x_defconfig (gcc-10): 1 warning
palmz72_defconfig (gcc-10): 1 warning
pcm027_defconfig (gcc-10): 1 warning
pleb_defconfig (gcc-10): 1 warning
pxa168_defconfig (gcc-10): 1 warning
pxa255-idp_defconfig (gcc-10): 1 warning
pxa3xx_defconfig (gcc-10): 1 warning
pxa910_defconfig (gcc-10): 1 warning
qcom_defconfig (gcc-10): 1 warning
raumfeld_defconfig (gcc-10): 1 warning
realview-smp_defconfig (gcc-10): 1 warning
realview_defconfig (gcc-10): 1 warning
rpc_defconfig (gcc-10): 2 errors
s3c6400_defconfig (gcc-10): 2 warnings
sama5_defconfig (gcc-10): 1 warning
simpad_defconfig (gcc-10): 1 warning
socfpga_defconfig (gcc-10): 1 warning
spear13xx_defconfig (gcc-10): 1 warning
spitz_defconfig (gcc-10): 1 warning
sunxi_defconfig (gcc-10): 1 warning
tegra_defconfig (gcc-10): 1 warning
trizeps4_defconfig (gcc-10): 1 warning
u8500_defconfig (gcc-10): 1 warning
versatile_defconfig (gcc-10): 1 warning
vexpress_defconfig (gcc-10): 1 warning
viper_defconfig (gcc-10): 1 warning
vt8500_v6_v7_defconfig (gcc-10): 1 warning
xcep_defconfig (gcc-10): 1 warning
zeus_defconfig (gcc-10): 1 warning

i386:
i386_defconfig (gcc-10): 5 warnings

mips:
ar7_defconfig (gcc-10): 1 warning
ath79_defconfig (gcc-10): 1 warning
bcm47xx_defconfig (gcc-10): 1 warning
bcm63xx_defconfig (gcc-10): 1 warning
bigsur_defconfig (gcc-10): 1 warning
bmips_be_defconfig (gcc-10): 1 warning
bmips_stb_defconfig (gcc-10): 1 warning
capcella_defconfig (gcc-10): 1 warning
cavium_octeon_defconfig (gcc-10): 1 warning
ci20_defconfig (gcc-10): 1 warning
cobalt_defconfig (gcc-10): 1 warning
db1xxx_defconfig (gcc-10): 1 warning
decstation_defconfig (gcc-10): 1 warning
fuloong2e_defconfig (gcc-10): 2 errors
gpr_defconfig (gcc-10): 1 warning
ip22_defconfig (gcc-10): 2 warnings
ip32_defconfig (gcc-10): 1 warning
jazz_defconfig (gcc-10): 1 warning
jmr3927_defconfig (gcc-10): 1 warning
lasat_defconfig (gcc-10): 1 warning
lemote2f_defconfig (gcc-10): 2 errors
loongson3_defconfig (gcc-10): 1 warning
ls1b_defconfig (gcc-10): 1 warning
malta_defconfig (gcc-10): 1 warning
malta_kvm_defconfig (gcc-10): 1 warning
malta_kvm_guest_defconfig (gcc-10): 1 warning
malta_qemu_32r6_defconfig (gcc-10): 1 warning
maltaaprp_defconfig (gcc-10): 1 warning
maltasmvp_defconfig (gcc-10): 1 warning
maltasmvp_eva_defconfig (gcc-10): 1 warning
maltaup_defconfig (gcc-10): 1 warning
maltaup_xpa_defconfig (gcc-10): 1 warning
markeins_defconfig (gcc-10): 1 warning
mips_paravirt_defconfig (gcc-10): 1 warning
mpc30x_defconfig (gcc-10): 1 warning
msp71xx_defconfig (gcc-10): 1 warning
mtx1_defconfig (gcc-10): 4 warnings
nlm_xlp_defconfig (gcc-10): 1 warning
nlm_xlr_defconfig (gcc-10): 1 warning
pnx8335_stb225_defconfig (gcc-10): 1 warning
qi_lb60_defconfig (gcc-10): 1 warning
rb532_defconfig (gcc-10): 1 warning
rbtx49xx_defconfig (gcc-10): 1 warning
rm200_defconfig (gcc-10): 1 warning
rt305x_defconfig (gcc-10): 1 warning
sb1250_swarm_defconfig (gcc-10): 1 warning
sead3_defconfig (gcc-10): 1 warning
sead3micro_defconfig (gcc-10): 1 warning
tb0219_defconfig (gcc-10): 1 warning
tb0287_defconfig (gcc-10): 1 warning
workpad_defconfig (gcc-10): 1 warning

x86_64:
allnoconfig (gcc-10): 4 warnings
tinyconfig (gcc-10): 3 warnings
x86_64_defconfig (gcc-10): 9 warnings
x86_64_defconfig+x86-chromebook (gcc-10): 9 warnings

Errors summary:

4 cc1: error: ‘-mloongson-mmi’ must be used with ‘-mhard-float’
1 arm-linux-gnueabihf-gcc: error: unrecognized -march target: armv3
1 arm-linux-gnueabihf-gcc: error: missing argument to ‘-march=’

Warnings summary:

140 net/ipv4/inet_hashtables.c:608:68: warning: suggest parentheses around ‘+’ in operand of ‘&’ [-Wparentheses]
7 net/ipv4/inet_hashtables.c:608:68: warning: suggest parentheses around '+' in operand of '&' [-Wparentheses]
7 arch/x86/kernel/process.c:456: Warning: no instruction mnemonic suffix given and no register operands; using default for `btr'
4 arch/x86/entry/entry_64.S:487: Warning: no instruction mnemonic suffix given and no register operands; using default for `btr'
4 arch/x86/entry/entry_64.S:1642: Warning: no instruction mnemonic suffix given and no register operands; using default for `sysret'
3 ld: warning: creating DT_TEXTREL in a PIE
3 WARNING: vmlinux.o (.discard.retpoline_safe): unexpected non-allocatable section.
3 WARNING: vmlinux.o (.discard.nospec): unexpected non-allocatable section.
2 sound/pci/echoaudio/echoaudio_dsp.c:647:9: warning: iteration 1073741824 invokes undefined behavior [-Waggressive-loop-optimizations]
2 ld: arch/x86/boot/compressed/head_64.o: warning: relocation in read-only section `.head.text'
2 drivers/tty/serial/samsung.c:1776:34: warning: array ‘s3c24xx_uart_dt_match’ assumed to have one element
2 drivers/net/ethernet/apm/xgene/xgene_enet_main.c:32:36: warning: array ‘xgene_enet_acpi_match’ assumed to have one element
1 sound/pci/echoaudio/echoaudio_dsp.c:658:9: warning: iteration 1073741824 invokes undefined behavior [-Waggressive-loop-optimizations]
1 ld: arch/x86/boot/compressed/head_32.o: warning: relocation in read-only section `.head.text'
1 drivers/net/ethernet/seeq/sgiseeq.c:804:26: warning: passing argument 5 of ‘dma_free_attrs’ makes pointer from integer without a cast [-Wint-conversion]
1 drivers/mmc/host/sdhci-s3c.c:429:34: warning: array ‘sdhci_s3c_dt_match’ assumed to have one element
1 drivers/gpio/gpio-omap.c:1161:34: warning: array ‘omap_gpio_match’ assumed to have one element
1 arch/arm/mach-mxs/mach-mxs.c:285:26: warning: duplicate ‘const’ declaration specifier [-Wduplicate-decl-specifier]
1 arch/arm/mach-lpc32xx/phy3250.c:215:36: warning: duplicate ‘const’ declaration specifier [-Wduplicate-decl-specifier]
1 arch/arm/mach-davinci/da8xx-dt.c:23:34: warning: duplicate ‘const’ declaration specifier [-Wduplicate-decl-specifier]
1 arch/arm/mach-clps711x/board-autcpu12.c:163:26: warning: duplicate ‘const’ declaration specifier [-Wduplicate-decl-specifier]

================================================================================

Detailed per-defconfig build reports:

--------------------------------------------------------------------------------
acs5k_defconfig (arm, gcc-10) — PASS, 0 errors, 1 warning, 0 section mismatches

Warnings:
net/ipv4/inet_hashtables.c:608:68: warning: suggest parentheses around ‘+’ in operand of ‘&’ [-Wparentheses]

--------------------------------------------------------------------------------
acs5k_tiny_defconfig (arm, gcc-10) — PASS, 0 errors, 1 warning, 0 section mismatches

Warnings:
net/ipv4/inet_hashtables.c:608:68: warning: suggest parentheses around ‘+’ in operand of ‘&’ [-Wparentheses]

--------------------------------------------------------------------------------
allnoconfig (mips, gcc-10) — PASS, 0 errors, 0 warnings, 0 section mismatches

--------------------------------------------------------------------------------
allnoconfig (i386, gcc-10) — PASS, 0 errors, 0 warnings, 0 section mismatches

--------------------------------------------------------------------------------
allnoconfig (x86_64, gcc-10) — PASS, 0 errors, 4 warnings, 0 section mismatches

Warnings:
arch/x86/entry/entry_64.S:487: Warning: no instruction mnemonic suffix given and no register operands; using default for `btr'
arch/x86/entry/entry_64.S:1642: Warning: no instruction mnemonic suffix given and no register operands; using default for `sysret'
arch/x86/kernel/process.c:456: Warning: no instruction mnemonic suffix given and no register operands; using default for `btr'
arch/x86/kernel/process.c:456: Warning: no instruction mnemonic suffix given and no register operands; using default for `btr'

--------------------------------------------------------------------------------
allnoconfig (arc, gcc-10) — PASS, 0 errors, 0 warnings, 0 section mismatches

--------------------------------------------------------------------------------
allnoconfig (arm, gcc-10) — PASS, 0 errors, 0 warnings, 0 section mismatches

--------------------------------------------------------------------------------
am200epdkit_defconfig (arm, gcc-10) — PASS, 0 errors, 1 warning, 0 section mismatches

Warnings:
net/ipv4/inet_hashtables.c:608:68: warning: suggest parentheses around ‘+’ in operand of ‘&’ [-Wparentheses]

--------------------------------------------------------------------------------
ar7_defconfig (mips, gcc-10) — PASS, 0 errors, 1 warning, 0 section mismatches

Warnings:
net/ipv4/inet_hashtables.c:608:68: warning: suggest parentheses around ‘+’ in operand of ‘&’ [-Wparentheses]

--------------------------------------------------------------------------------
assabet_defconfig (arm, gcc-10) — PASS, 0 errors, 1 warning, 0 section mismatches

Warnings:
net/ipv4/inet_hashtables.c:608:68: warning: suggest parentheses around ‘+’ in operand of ‘&’ [-Wparentheses]

--------------------------------------------------------------------------------
at91_dt_defconfig (arm, gcc-10) — PASS, 0 errors, 1 warning, 0 section mismatches

Warnings:
net/ipv4/inet_hashtables.c:608:68: warning: suggest parentheses around ‘+’ in operand of ‘&’ [-Wparentheses]

--------------------------------------------------------------------------------
ath79_defconfig (mips, gcc-10) — PASS, 0 errors, 1 warning, 0 section mismatches

Warnings:
net/ipv4/inet_hashtables.c:608:68: warning: suggest parentheses around ‘+’ in operand of ‘&’ [-Wparentheses]

--------------------------------------------------------------------------------
axm55xx_defconfig (arm, gcc-10) — PASS, 0 errors, 1 warning, 0 section mismatches

Warnings:
net/ipv4/inet_hashtables.c:608:68: warning: suggest parentheses around ‘+’ in operand of ‘&’ [-Wparentheses]

--------------------------------------------------------------------------------
axs103_defconfig (arc, gcc-10) — PASS, 0 errors, 1 warning, 0 section mismatches

Warnings:
net/ipv4/inet_hashtables.c:608:68: warning: suggest parentheses around '+' in operand of '&' [-Wparentheses]

--------------------------------------------------------------------------------
bcm2835_defconfig (arm, gcc-10) — PASS, 0 errors, 1 warning, 0 section mismatches

Warnings:
net/ipv4/inet_hashtables.c:608:68: warning: suggest parentheses around ‘+’ in operand of ‘&’ [-Wparentheses]

--------------------------------------------------------------------------------
bcm47xx_defconfig (mips, gcc-10) — PASS, 0 errors, 1 warning, 0 section mismatches

Warnings:
net/ipv4/inet_hashtables.c:608:68: warning: suggest parentheses around ‘+’ in operand of ‘&’ [-Wparentheses]

--------------------------------------------------------------------------------
bcm63xx_defconfig (mips, gcc-10) — PASS, 0 errors, 1 warning, 0 section mismatches

Warnings:
net/ipv4/inet_hashtables.c:608:68: warning: suggest parentheses around ‘+’ in operand of ‘&’ [-Wparentheses]

--------------------------------------------------------------------------------
bcm_defconfig (arm, gcc-10) — PASS, 0 errors, 1 warning, 0 section mismatches

Warnings:
net/ipv4/inet_hashtables.c:608:68: warning: suggest parentheses around ‘+’ in operand of ‘&’ [-Wparentheses]

--------------------------------------------------------------------------------
bigsur_defconfig (mips, gcc-10) — PASS, 0 errors, 1 warning, 0 section mismatches

Warnings:
net/ipv4/inet_hashtables.c:608:68: warning: suggest parentheses around ‘+’ in operand of ‘&’ [-Wparentheses]

--------------------------------------------------------------------------------
bmips_be_defconfig (mips, gcc-10) — PASS, 0 errors, 1 warning, 0 section mismatches

Warnings:
net/ipv4/inet_hashtables.c:608:68: warning: suggest parentheses around ‘+’ in operand of ‘&’ [-Wparentheses]

--------------------------------------------------------------------------------
bmips_stb_defconfig (mips, gcc-10) — PASS, 0 errors, 1 warning, 0 section mismatches

Warnings:
net/ipv4/inet_hashtables.c:608:68: warning: suggest parentheses around ‘+’ in operand of ‘&’ [-Wparentheses]

--------------------------------------------------------------------------------
capcella_defconfig (mips, gcc-10) — PASS, 0 errors, 1 warning, 0 section mismatches

Warnings:
net/ipv4/inet_hashtables.c:608:68: warning: suggest parentheses around ‘+’ in operand of ‘&’ [-Wparentheses]

--------------------------------------------------------------------------------
cavium_octeon_defconfig (mips, gcc-10) — PASS, 0 errors, 1 warning, 0 section mismatches

Warnings:
net/ipv4/inet_hashtables.c:608:68: warning: suggest parentheses around ‘+’ in operand of ‘&’ [-Wparentheses]

--------------------------------------------------------------------------------
cerfcube_defconfig (arm, gcc-10) — PASS, 0 errors, 1 warning, 0 section mismatches

Warnings:
net/ipv4/inet_hashtables.c:608:68: warning: suggest parentheses around ‘+’ in operand of ‘&’ [-Wparentheses]

--------------------------------------------------------------------------------
ci20_defconfig (mips, gcc-10) — PASS, 0 errors, 1 warning, 0 section mismatches

Warnings:
net/ipv4/inet_hashtables.c:608:68: warning: suggest parentheses around ‘+’ in operand of ‘&’ [-Wparentheses]

--------------------------------------------------------------------------------
clps711x_defconfig (arm, gcc-10) — PASS, 0 errors, 2 warnings, 0 section mismatches

Warnings:
arch/arm/mach-clps711x/board-autcpu12.c:163:26: warning: duplicate ‘const’ declaration specifier [-Wduplicate-decl-specifier]
net/ipv4/inet_hashtables.c:608:68: warning: suggest parentheses around ‘+’ in operand of ‘&’ [-Wparentheses]

--------------------------------------------------------------------------------
cm_x2xx_defconfig (arm, gcc-10) — PASS, 0 errors, 1 warning, 0 section mismatches

Warnings:
net/ipv4/inet_hashtables.c:608:68: warning: suggest parentheses around ‘+’ in operand of ‘&’ [-Wparentheses]

--------------------------------------------------------------------------------
cm_x300_defconfig (arm, gcc-10) — PASS, 0 errors, 1 warning, 0 section mismatches

Warnings:
net/ipv4/inet_hashtables.c:608:68: warning: suggest parentheses around ‘+’ in operand of ‘&’ [-Wparentheses]

--------------------------------------------------------------------------------
cobalt_defconfig (mips, gcc-10) — PASS, 0 errors, 1 warning, 0 section mismatches

Warnings:
net/ipv4/inet_hashtables.c:608:68: warning: suggest parentheses around ‘+’ in operand of ‘&’ [-Wparentheses]

--------------------------------------------------------------------------------
colibri_pxa270_defconfig (arm, gcc-10) — PASS, 0 errors, 1 warning, 0 section mismatches

Warnings:
net/ipv4/inet_hashtables.c:608:68: warning: suggest parentheses around ‘+’ in operand of ‘&’ [-Wparentheses]

--------------------------------------------------------------------------------
colibri_pxa300_defconfig (arm, gcc-10) — PASS, 0 errors, 1 warning, 0 section mismatches

Warnings:
net/ipv4/inet_hashtables.c:608:68: warning: suggest parentheses around ‘+’ in operand of ‘&’ [-Wparentheses]

--------------------------------------------------------------------------------
collie_defconfig (arm, gcc-10) — PASS, 0 errors, 1 warning, 0 section mismatches

Warnings:
net/ipv4/inet_hashtables.c:608:68: warning: suggest parentheses around ‘+’ in operand of ‘&’ [-Wparentheses]

--------------------------------------------------------------------------------
corgi_defconfig (arm, gcc-10) — PASS, 0 errors, 1 warning, 0 section mismatches

Warnings:
net/ipv4/inet_hashtables.c:608:68: warning: suggest parentheses around ‘+’ in operand of ‘&’ [-Wparentheses]

--------------------------------------------------------------------------------
davinci_all_defconfig (arm, gcc-10) — PASS, 0 errors, 2 warnings, 0 section mismatches

Warnings:
arch/arm/mach-davinci/da8xx-dt.c:23:34: warning: duplicate ‘const’ declaration specifier [-Wduplicate-decl-specifier]
net/ipv4/inet_hashtables.c:608:68: warning: suggest parentheses around ‘+’ in operand of ‘&’ [-Wparentheses]

--------------------------------------------------------------------------------
db1xxx_defconfig (mips, gcc-10) — PASS, 0 errors, 1 warning, 0 section mismatches

Warnings:
net/ipv4/inet_hashtables.c:608:68: warning: suggest parentheses around ‘+’ in operand of ‘&’ [-Wparentheses]

--------------------------------------------------------------------------------
decstation_defconfig (mips, gcc-10) — PASS, 0 errors, 1 warning, 0 section mismatches

Warnings:
net/ipv4/inet_hashtables.c:608:68: warning: suggest parentheses around ‘+’ in operand of ‘&’ [-Wparentheses]

--------------------------------------------------------------------------------
defconfig (arm64, gcc-10) — PASS, 0 errors, 2 warnings, 0 section mismatches

Warnings:
net/ipv4/inet_hashtables.c:608:68: warning: suggest parentheses around ‘+’ in operand of ‘&’ [-Wparentheses]
drivers/net/ethernet/apm/xgene/xgene_enet_main.c:32:36: warning: array ‘xgene_enet_acpi_match’ assumed to have one element

--------------------------------------------------------------------------------
defconfig+arm64-chromebook (arm64, gcc-10) — PASS, 0 errors, 2 warnings, 0 section mismatches

Warnings:
net/ipv4/inet_hashtables.c:608:68: warning: suggest parentheses around ‘+’ in operand of ‘&’ [-Wparentheses]
drivers/net/ethernet/apm/xgene/xgene_enet_main.c:32:36: warning: array ‘xgene_enet_acpi_match’ assumed to have one element

--------------------------------------------------------------------------------
dove_defconfig (arm, gcc-10) — PASS, 0 errors, 1 warning, 0 section mismatches

Warnings:
net/ipv4/inet_hashtables.c:608:68: warning: suggest parentheses around ‘+’ in operand of ‘&’ [-Wparentheses]

--------------------------------------------------------------------------------
e55_defconfig (mips, gcc-10) — PASS, 0 errors, 0 warnings, 0 section mismatches

--------------------------------------------------------------------------------
ebsa110_defconfig (arm, gcc-10) — PASS, 0 errors, 1 warning, 0 section mismatches

Warnings:
net/ipv4/inet_hashtables.c:608:68: warning: suggest parentheses around ‘+’ in operand of ‘&’ [-Wparentheses]

--------------------------------------------------------------------------------
efm32_defconfig (arm, gcc-10) — PASS, 0 errors, 1 warning, 0 section mismatches

Warnings:
net/ipv4/inet_hashtables.c:608:68: warning: suggest parentheses around ‘+’ in operand of ‘&’ [-Wparentheses]

--------------------------------------------------------------------------------
em_x270_defconfig (arm, gcc-10) — PASS, 0 errors, 1 warning, 0 section mismatches

Warnings:
net/ipv4/inet_hashtables.c:608:68: warning: suggest parentheses around ‘+’ in operand of ‘&’ [-Wparentheses]

--------------------------------------------------------------------------------
ep93xx_defconfig (arm, gcc-10) — PASS, 0 errors, 1 warning, 0 section mismatches

Warnings:
net/ipv4/inet_hashtables.c:608:68: warning: suggest parentheses around ‘+’ in operand of ‘&’ [-Wparentheses]

--------------------------------------------------------------------------------
eseries_pxa_defconfig (arm, gcc-10) — PASS, 0 errors, 1 warning, 0 section mismatches

Warnings:
net/ipv4/inet_hashtables.c:608:68: warning: suggest parentheses around ‘+’ in operand of ‘&’ [-Wparentheses]

--------------------------------------------------------------------------------
exynos_defconfig (arm, gcc-10) — PASS, 0 errors, 1 warning, 0 section mismatches

Warnings:
net/ipv4/inet_hashtables.c:608:68: warning: suggest parentheses around ‘+’ in operand of ‘&’ [-Wparentheses]

--------------------------------------------------------------------------------
footbridge_defconfig (arm, gcc-10) — PASS, 0 errors, 1 warning, 0 section mismatches

Warnings:
net/ipv4/inet_hashtables.c:608:68: warning: suggest parentheses around ‘+’ in operand of ‘&’ [-Wparentheses]

--------------------------------------------------------------------------------
fuloong2e_defconfig (mips, gcc-10) — FAIL, 2 errors, 0 warnings, 0 section mismatches

Errors:
cc1: error: ‘-mloongson-mmi’ must be used with ‘-mhard-float’
cc1: error: ‘-mloongson-mmi’ must be used with ‘-mhard-float’

--------------------------------------------------------------------------------
gpr_defconfig (mips, gcc-10) — PASS, 0 errors, 1 warning, 0 section mismatches

Warnings:
net/ipv4/inet_hashtables.c:608:68: warning: suggest parentheses around ‘+’ in operand of ‘&’ [-Wparentheses]

--------------------------------------------------------------------------------
h3600_defconfig (arm, gcc-10) — PASS, 0 errors, 1 warning, 0 section mismatches

Warnings:
net/ipv4/inet_hashtables.c:608:68: warning: suggest parentheses around ‘+’ in operand of ‘&’ [-Wparentheses]

--------------------------------------------------------------------------------
h5000_defconfig (arm, gcc-10) — PASS, 0 errors, 1 warning, 0 section mismatches

Warnings:
net/ipv4/inet_hashtables.c:608:68: warning: suggest parentheses around ‘+’ in operand of ‘&’ [-Wparentheses]

--------------------------------------------------------------------------------
hackkit_defconfig (arm, gcc-10) — PASS, 0 errors, 1 warning, 0 section mismatches

Warnings:
net/ipv4/inet_hashtables.c:608:68: warning: suggest parentheses around ‘+’ in operand of ‘&’ [-Wparentheses]

--------------------------------------------------------------------------------
hisi_defconfig (arm, gcc-10) — PASS, 0 errors, 1 warning, 0 section mismatches

Warnings:
net/ipv4/inet_hashtables.c:608:68: warning: suggest parentheses around ‘+’ in operand of ‘&’ [-Wparentheses]

--------------------------------------------------------------------------------
i386_defconfig (i386, gcc-10) — PASS, 0 errors, 5 warnings, 0 section mismatches

Warnings:
net/ipv4/inet_hashtables.c:608:68: warning: suggest parentheses around ‘+’ in operand of ‘&’ [-Wparentheses]
WARNING: vmlinux.o (.discard.nospec): unexpected non-allocatable section.
WARNING: vmlinux.o (.discard.retpoline_safe): unexpected non-allocatable section.
ld: arch/x86/boot/compressed/head_32.o: warning: relocation in read-only section `.head.text'
ld: warning: creating DT_TEXTREL in a PIE

--------------------------------------------------------------------------------
imote2_defconfig (arm, gcc-10) — PASS, 0 errors, 1 warning, 0 section mismatches

Warnings:
net/ipv4/inet_hashtables.c:608:68: warning: suggest parentheses around ‘+’ in operand of ‘&’ [-Wparentheses]

--------------------------------------------------------------------------------
imx_v4_v5_defconfig (arm, gcc-10) — PASS, 0 errors, 1 warning, 0 section mismatches

Warnings:
net/ipv4/inet_hashtables.c:608:68: warning: suggest parentheses around ‘+’ in operand of ‘&’ [-Wparentheses]

--------------------------------------------------------------------------------
integrator_defconfig (arm, gcc-10) — PASS, 0 errors, 1 warning, 0 section mismatches

Warnings:
net/ipv4/inet_hashtables.c:608:68: warning: suggest parentheses around ‘+’ in operand of ‘&’ [-Wparentheses]

--------------------------------------------------------------------------------
iop13xx_defconfig (arm, gcc-10) — PASS, 0 errors, 1 warning, 0 section mismatches

Warnings:
net/ipv4/inet_hashtables.c:608:68: warning: suggest parentheses around ‘+’ in operand of ‘&’ [-Wparentheses]

--------------------------------------------------------------------------------
iop32x_defconfig (arm, gcc-10) — PASS, 0 errors, 1 warning, 0 section mismatches

Warnings:
net/ipv4/inet_hashtables.c:608:68: warning: suggest parentheses around ‘+’ in operand of ‘&’ [-Wparentheses]

--------------------------------------------------------------------------------
iop33x_defconfig (arm, gcc-10) — PASS, 0 errors, 1 warning, 0 section mismatches

Warnings:
net/ipv4/inet_hashtables.c:608:68: warning: suggest parentheses around ‘+’ in operand of ‘&’ [-Wparentheses]

--------------------------------------------------------------------------------
ip22_defconfig (mips, gcc-10) — PASS, 0 errors, 2 warnings, 0 section mismatches

Warnings:
drivers/net/ethernet/seeq/sgiseeq.c:804:26: warning: passing argument 5 of ‘dma_free_attrs’ makes pointer from integer without a cast [-Wint-conversion]
net/ipv4/inet_hashtables.c:608:68: warning: suggest parentheses around ‘+’ in operand of ‘&’ [-Wparentheses]

--------------------------------------------------------------------------------
ip27_defconfig (mips, gcc-10) — FAIL, 0 errors, 0 warnings, 0 section mismatches

--------------------------------------------------------------------------------
ip28_defconfig (mips, gcc-10) — FAIL, 0 errors, 0 warnings, 0 section mismatches

--------------------------------------------------------------------------------
ip32_defconfig (mips, gcc-10) — PASS, 0 errors, 1 warning, 0 section mismatches

Warnings:
net/ipv4/inet_hashtables.c:608:68: warning: suggest parentheses around ‘+’ in operand of ‘&’ [-Wparentheses]

--------------------------------------------------------------------------------
ixp4xx_defconfig (arm, gcc-10) — PASS, 0 errors, 1 warning, 0 section mismatches

Warnings:
net/ipv4/inet_hashtables.c:608:68: warning: suggest parentheses around ‘+’ in operand of ‘&’ [-Wparentheses]

--------------------------------------------------------------------------------
jazz_defconfig (mips, gcc-10) — PASS, 0 errors, 1 warning, 0 section mismatches

Warnings:
net/ipv4/inet_hashtables.c:608:68: warning: suggest parentheses around ‘+’ in operand of ‘&’ [-Wparentheses]

--------------------------------------------------------------------------------
jmr3927_defconfig (mips, gcc-10) — PASS, 0 errors, 1 warning, 0 section mismatches

Warnings:
net/ipv4/inet_hashtables.c:608:68: warning: suggest parentheses around ‘+’ in operand of ‘&’ [-Wparentheses]

--------------------------------------------------------------------------------
jornada720_defconfig (arm, gcc-10) — PASS, 0 errors, 1 warning, 0 section mismatches

Warnings:
net/ipv4/inet_hashtables.c:608:68: warning: suggest parentheses around ‘+’ in operand of ‘&’ [-Wparentheses]

--------------------------------------------------------------------------------
keystone_defconfig (arm, gcc-10) — PASS, 0 errors, 1 warning, 0 section mismatches

Warnings:
net/ipv4/inet_hashtables.c:608:68: warning: suggest parentheses around ‘+’ in operand of ‘&’ [-Wparentheses]

--------------------------------------------------------------------------------
ks8695_defconfig (arm, gcc-10) — PASS, 0 errors, 1 warning, 0 section mismatches

Warnings:
net/ipv4/inet_hashtables.c:608:68: warning: suggest parentheses around ‘+’ in operand of ‘&’ [-Wparentheses]

--------------------------------------------------------------------------------
lart_defconfig (arm, gcc-10) — PASS, 0 errors, 1 warning, 0 section mismatches

Warnings:
net/ipv4/inet_hashtables.c:608:68: warning: suggest parentheses around ‘+’ in operand of ‘&’ [-Wparentheses]

--------------------------------------------------------------------------------
lasat_defconfig (mips, gcc-10) — PASS, 0 errors, 1 warning, 0 section mismatches

Warnings:
net/ipv4/inet_hashtables.c:608:68: warning: suggest parentheses around ‘+’ in operand of ‘&’ [-Wparentheses]

--------------------------------------------------------------------------------
lemote2f_defconfig (mips, gcc-10) — FAIL, 2 errors, 0 warnings, 0 section mismatches

Errors:
cc1: error: ‘-mloongson-mmi’ must be used with ‘-mhard-float’
cc1: error: ‘-mloongson-mmi’ must be used with ‘-mhard-float’

--------------------------------------------------------------------------------
loongson3_defconfig (mips, gcc-10) — PASS, 0 errors, 1 warning, 0 section mismatches

Warnings:
net/ipv4/inet_hashtables.c:608:68: warning: suggest parentheses around ‘+’ in operand of ‘&’ [-Wparentheses]

--------------------------------------------------------------------------------
lpc18xx_defconfig (arm, gcc-10) — PASS, 0 errors, 1 warning, 0 section mismatches

Warnings:
net/ipv4/inet_hashtables.c:608:68: warning: suggest parentheses around ‘+’ in operand of ‘&’ [-Wparentheses]

--------------------------------------------------------------------------------
lpc32xx_defconfig (arm, gcc-10) — PASS, 0 errors, 2 warnings, 0 section mismatches

Warnings:
arch/arm/mach-lpc32xx/phy3250.c:215:36: warning: duplicate ‘const’ declaration specifier [-Wduplicate-decl-specifier]
net/ipv4/inet_hashtables.c:608:68: warning: suggest parentheses around ‘+’ in operand of ‘&’ [-Wparentheses]

--------------------------------------------------------------------------------
lpd270_defconfig (arm, gcc-10) — PASS, 0 errors, 1 warning, 0 section mismatches

Warnings:
net/ipv4/inet_hashtables.c:608:68: warning: suggest parentheses around ‘+’ in operand of ‘&’ [-Wparentheses]

--------------------------------------------------------------------------------
ls1b_defconfig (mips, gcc-10) — PASS, 0 errors, 1 warning, 0 section mismatches

Warnings:
net/ipv4/inet_hashtables.c:608:68: warning: suggest parentheses around ‘+’ in operand of ‘&’ [-Wparentheses]

--------------------------------------------------------------------------------
lubbock_defconfig (arm, gcc-10) — PASS, 0 errors, 1 warning, 0 section mismatches

Warnings:
net/ipv4/inet_hashtables.c:608:68: warning: suggest parentheses around ‘+’ in operand of ‘&’ [-Wparentheses]

--------------------------------------------------------------------------------
magician_defconfig (arm, gcc-10) — PASS, 0 errors, 1 warning, 0 section mismatches

Warnings:
net/ipv4/inet_hashtables.c:608:68: warning: suggest parentheses around ‘+’ in operand of ‘&’ [-Wparentheses]

--------------------------------------------------------------------------------
mainstone_defconfig (arm, gcc-10) — PASS, 0 errors, 1 warning, 0 section mismatches

Warnings:
net/ipv4/inet_hashtables.c:608:68: warning: suggest parentheses around ‘+’ in operand of ‘&’ [-Wparentheses]

--------------------------------------------------------------------------------
malta_defconfig (mips, gcc-10) — PASS, 0 errors, 1 warning, 0 section mismatches

Warnings:
net/ipv4/inet_hashtables.c:608:68: warning: suggest parentheses around ‘+’ in operand of ‘&’ [-Wparentheses]

--------------------------------------------------------------------------------
malta_kvm_defconfig (mips, gcc-10) — PASS, 0 errors, 1 warning, 0 section mismatches

Warnings:
net/ipv4/inet_hashtables.c:608:68: warning: suggest parentheses around ‘+’ in operand of ‘&’ [-Wparentheses]

--------------------------------------------------------------------------------
malta_kvm_guest_defconfig (mips, gcc-10) — PASS, 0 errors, 1 warning, 0 section mismatches

Warnings:
net/ipv4/inet_hashtables.c:608:68: warning: suggest parentheses around ‘+’ in operand of ‘&’ [-Wparentheses]

--------------------------------------------------------------------------------
malta_qemu_32r6_defconfig (mips, gcc-10) — PASS, 0 errors, 1 warning, 0 section mismatches

Warnings:
net/ipv4/inet_hashtables.c:608:68: warning: suggest parentheses around ‘+’ in operand of ‘&’ [-Wparentheses]

--------------------------------------------------------------------------------
maltaaprp_defconfig (mips, gcc-10) — PASS, 0 errors, 1 warning, 0 section mismatches

Warnings:
net/ipv4/inet_hashtables.c:608:68: warning: suggest parentheses around ‘+’ in operand of ‘&’ [-Wparentheses]

--------------------------------------------------------------------------------
maltasmvp_defconfig (mips, gcc-10) — PASS, 0 errors, 1 warning, 0 section mismatches

Warnings:
net/ipv4/inet_hashtables.c:608:68: warning: suggest parentheses around ‘+’ in operand of ‘&’ [-Wparentheses]

--------------------------------------------------------------------------------
maltasmvp_eva_defconfig (mips, gcc-10) — PASS, 0 errors, 1 warning, 0 section mismatches

Warnings:
net/ipv4/inet_hashtables.c:608:68: warning: suggest parentheses around ‘+’ in operand of ‘&’ [-Wparentheses]

--------------------------------------------------------------------------------
maltaup_defconfig (mips, gcc-10) — PASS, 0 errors, 1 warning, 0 section mismatches

Warnings:
net/ipv4/inet_hashtables.c:608:68: warning: suggest parentheses around ‘+’ in operand of ‘&’ [-Wparentheses]

--------------------------------------------------------------------------------
maltaup_xpa_defconfig (mips, gcc-10) — PASS, 0 errors, 1 warning, 0 section mismatches

Warnings:
net/ipv4/inet_hashtables.c:608:68: warning: suggest parentheses around ‘+’ in operand of ‘&’ [-Wparentheses]

--------------------------------------------------------------------------------
markeins_defconfig (mips, gcc-10) — PASS, 0 errors, 1 warning, 0 section mismatches

Warnings:
net/ipv4/inet_hashtables.c:608:68: warning: suggest parentheses around ‘+’ in operand of ‘&’ [-Wparentheses]

--------------------------------------------------------------------------------
mini2440_defconfig (arm, gcc-10) — PASS, 0 errors, 2 warnings, 0 section mismatches

Warnings:
net/ipv4/inet_hashtables.c:608:68: warning: suggest parentheses around ‘+’ in operand of ‘&’ [-Wparentheses]
drivers/tty/serial/samsung.c:1776:34: warning: array ‘s3c24xx_uart_dt_match’ assumed to have one element

--------------------------------------------------------------------------------
mips_paravirt_defconfig (mips, gcc-10) — PASS, 0 errors, 1 warning, 0 section mismatches

Warnings:
net/ipv4/inet_hashtables.c:608:68: warning: suggest parentheses around ‘+’ in operand of ‘&’ [-Wparentheses]

--------------------------------------------------------------------------------
mmp2_defconfig (arm, gcc-10) — PASS, 0 errors, 1 warning, 0 section mismatches

Warnings:
net/ipv4/inet_hashtables.c:608:68: warning: suggest parentheses around ‘+’ in operand of ‘&’ [-Wparentheses]

--------------------------------------------------------------------------------
mpc30x_defconfig (mips, gcc-10) — PASS, 0 errors, 1 warning, 0 section mismatches

Warnings:
net/ipv4/inet_hashtables.c:608:68: warning: suggest parentheses around ‘+’ in operand of ‘&’ [-Wparentheses]

--------------------------------------------------------------------------------
msp71xx_defconfig (mips, gcc-10) — PASS, 0 errors, 1 warning, 0 section mismatches

Warnings:
net/ipv4/inet_hashtables.c:608:68: warning: suggest parentheses around ‘+’ in operand of ‘&’ [-Wparentheses]

--------------------------------------------------------------------------------
mtx1_defconfig (mips, gcc-10) — PASS, 0 errors, 4 warnings, 0 section mismatches

Warnings:
net/ipv4/inet_hashtables.c:608:68: warning: suggest parentheses around ‘+’ in operand of ‘&’ [-Wparentheses]
sound/pci/echoaudio/echoaudio_dsp.c:647:9: warning: iteration 1073741824 invokes undefined behavior [-Waggressive-loop-optimizations]
sound/pci/echoaudio/echoaudio_dsp.c:658:9: warning: iteration 1073741824 invokes undefined behavior [-Waggressive-loop-optimizations]
sound/pci/echoaudio/echoaudio_dsp.c:647:9: warning: iteration 1073741824 invokes undefined behavior [-Waggressive-loop-optimizations]

--------------------------------------------------------------------------------
multi_v7_defconfig (arm, gcc-10) — PASS, 0 errors, 1 warning, 0 section mismatches

Warnings:
net/ipv4/inet_hashtables.c:608:68: warning: suggest parentheses around ‘+’ in operand of ‘&’ [-Wparentheses]

--------------------------------------------------------------------------------
mv78xx0_defconfig (arm, gcc-10) — PASS, 0 errors, 1 warning, 0 section mismatches

Warnings:
net/ipv4/inet_hashtables.c:608:68: warning: suggest parentheses around ‘+’ in operand of ‘&’ [-Wparentheses]

--------------------------------------------------------------------------------
mvebu_v5_defconfig (arm, gcc-10) — PASS, 0 errors, 1 warning, 0 section mismatches

Warnings:
net/ipv4/inet_hashtables.c:608:68: warning: suggest parentheses around ‘+’ in operand of ‘&’ [-Wparentheses]

--------------------------------------------------------------------------------
mvebu_v7_defconfig (arm, gcc-10) — PASS, 0 errors, 1 warning, 0 section mismatches

Warnings:
net/ipv4/inet_hashtables.c:608:68: warning: suggest parentheses around ‘+’ in operand of ‘&’ [-Wparentheses]

--------------------------------------------------------------------------------
mxs_defconfig (arm, gcc-10) — PASS, 0 errors, 2 warnings, 0 section mismatches

Warnings:
arch/arm/mach-mxs/mach-mxs.c:285:26: warning: duplicate ‘const’ declaration specifier [-Wduplicate-decl-specifier]
net/ipv4/inet_hashtables.c:608:68: warning: suggest parentheses around ‘+’ in operand of ‘&’ [-Wparentheses]

--------------------------------------------------------------------------------
neponset_defconfig (arm, gcc-10) — PASS, 0 errors, 1 warning, 0 section mismatches

Warnings:
net/ipv4/inet_hashtables.c:608:68: warning: suggest parentheses around ‘+’ in operand of ‘&’ [-Wparentheses]

--------------------------------------------------------------------------------
netwinder_defconfig (arm, gcc-10) — PASS, 0 errors, 1 warning, 0 section mismatches

Warnings:
net/ipv4/inet_hashtables.c:608:68: warning: suggest parentheses around ‘+’ in operand of ‘&’ [-Wparentheses]

--------------------------------------------------------------------------------
netx_defconfig (arm, gcc-10) — PASS, 0 errors, 1 warning, 0 section mismatches

Warnings:
net/ipv4/inet_hashtables.c:608:68: warning: suggest parentheses around ‘+’ in operand of ‘&’ [-Wparentheses]

--------------------------------------------------------------------------------
nhk8815_defconfig (arm, gcc-10) — PASS, 0 errors, 1 warning, 0 section mismatches

Warnings:
net/ipv4/inet_hashtables.c:608:68: warning: suggest parentheses around ‘+’ in operand of ‘&’ [-Wparentheses]

--------------------------------------------------------------------------------
nlm_xlp_defconfig (mips, gcc-10) — PASS, 0 errors, 1 warning, 0 section mismatches

Warnings:
net/ipv4/inet_hashtables.c:608:68: warning: suggest parentheses around ‘+’ in operand of ‘&’ [-Wparentheses]

--------------------------------------------------------------------------------
nlm_xlr_defconfig (mips, gcc-10) — PASS, 0 errors, 1 warning, 0 section mismatches

Warnings:
net/ipv4/inet_hashtables.c:608:68: warning: suggest parentheses around ‘+’ in operand of ‘&’ [-Wparentheses]

--------------------------------------------------------------------------------
nsim_hs_defconfig (arc, gcc-10) — PASS, 0 errors, 1 warning, 0 section mismatches

Warnings:
net/ipv4/inet_hashtables.c:608:68: warning: suggest parentheses around '+' in operand of '&' [-Wparentheses]

--------------------------------------------------------------------------------
nsim_hs_smp_defconfig (arc, gcc-10) — PASS, 0 errors, 1 warning, 0 section mismatches

Warnings:
net/ipv4/inet_hashtables.c:608:68: warning: suggest parentheses around '+' in operand of '&' [-Wparentheses]

--------------------------------------------------------------------------------
nsimosci_hs_defconfig (arc, gcc-10) — PASS, 0 errors, 1 warning, 0 section mismatches

Warnings:
net/ipv4/inet_hashtables.c:608:68: warning: suggest parentheses around '+' in operand of '&' [-Wparentheses]

--------------------------------------------------------------------------------
nsimosci_hs_smp_defconfig (arc, gcc-10) — PASS, 0 errors, 1 warning, 0 section mismatches

Warnings:
net/ipv4/inet_hashtables.c:608:68: warning: suggest parentheses around '+' in operand of '&' [-Wparentheses]

--------------------------------------------------------------------------------
nuc910_defconfig (arm, gcc-10) — PASS, 0 errors, 0 warnings, 0 section mismatches

--------------------------------------------------------------------------------
omap1_defconfig (arm, gcc-10) — PASS, 0 errors, 2 warnings, 0 section mismatches

Warnings:
drivers/gpio/gpio-omap.c:1161:34: warning: array ‘omap_gpio_match’ assumed to have one element
net/ipv4/inet_hashtables.c:608:68: warning: suggest parentheses around ‘+’ in operand of ‘&’ [-Wparentheses]

--------------------------------------------------------------------------------
omap2plus_defconfig (arm, gcc-10) — PASS, 0 errors, 1 warning, 0 section mismatches

Warnings:
net/ipv4/inet_hashtables.c:608:68: warning: suggest parentheses around ‘+’ in operand of ‘&’ [-Wparentheses]

--------------------------------------------------------------------------------
orion5x_defconfig (arm, gcc-10) — PASS, 0 errors, 1 warning, 0 section mismatches

Warnings:
net/ipv4/inet_hashtables.c:608:68: warning: suggest parentheses around ‘+’ in operand of ‘&’ [-Wparentheses]

--------------------------------------------------------------------------------
palmz72_defconfig (arm, gcc-10) — PASS, 0 errors, 1 warning, 0 section mismatches

Warnings:
net/ipv4/inet_hashtables.c:608:68: warning: suggest parentheses around ‘+’ in operand of ‘&’ [-Wparentheses]

--------------------------------------------------------------------------------
pcm027_defconfig (arm, gcc-10) — PASS, 0 errors, 1 warning, 0 section mismatches

Warnings:
net/ipv4/inet_hashtables.c:608:68: warning: suggest parentheses around ‘+’ in operand of ‘&’ [-Wparentheses]

--------------------------------------------------------------------------------
pleb_defconfig (arm, gcc-10) — PASS, 0 errors, 1 warning, 0 section mismatches

Warnings:
net/ipv4/inet_hashtables.c:608:68: warning: suggest parentheses around ‘+’ in operand of ‘&’ [-Wparentheses]

--------------------------------------------------------------------------------
pnx8335_stb225_defconfig (mips, gcc-10) — PASS, 0 errors, 1 warning, 0 section mismatches

Warnings:
net/ipv4/inet_hashtables.c:608:68: warning: suggest parentheses around ‘+’ in operand of ‘&’ [-Wparentheses]

--------------------------------------------------------------------------------
prima2_defconfig (arm, gcc-10) — PASS, 0 errors, 0 warnings, 0 section mismatches

--------------------------------------------------------------------------------
pxa168_defconfig (arm, gcc-10) — PASS, 0 errors, 1 warning, 0 section mismatches

Warnings:
net/ipv4/inet_hashtables.c:608:68: warning: suggest parentheses around ‘+’ in operand of ‘&’ [-Wparentheses]

--------------------------------------------------------------------------------
pxa255-idp_defconfig (arm, gcc-10) — PASS, 0 errors, 1 warning, 0 section mismatches

Warnings:
net/ipv4/inet_hashtables.c:608:68: warning: suggest parentheses around ‘+’ in operand of ‘&’ [-Wparentheses]

--------------------------------------------------------------------------------
pxa3xx_defconfig (arm, gcc-10) — PASS, 0 errors, 1 warning, 0 section mismatches

Warnings:
net/ipv4/inet_hashtables.c:608:68: warning: suggest parentheses around ‘+’ in operand of ‘&’ [-Wparentheses]

--------------------------------------------------------------------------------
pxa910_defconfig (arm, gcc-10) — PASS, 0 errors, 1 warning, 0 section mismatches

Warnings:
net/ipv4/inet_hashtables.c:608:68: warning: suggest parentheses around ‘+’ in operand of ‘&’ [-Wparentheses]

--------------------------------------------------------------------------------
qcom_defconfig (arm, gcc-10) — PASS, 0 errors, 1 warning, 0 section mismatches

Warnings:
net/ipv4/inet_hashtables.c:608:68: warning: suggest parentheses around ‘+’ in operand of ‘&’ [-Wparentheses]

--------------------------------------------------------------------------------
qi_lb60_defconfig (mips, gcc-10) — PASS, 0 errors, 1 warning, 0 section mismatches

Warnings:
net/ipv4/inet_hashtables.c:608:68: warning: suggest parentheses around ‘+’ in operand of ‘&’ [-Wparentheses]

--------------------------------------------------------------------------------
raumfeld_defconfig (arm, gcc-10) — PASS, 0 errors, 1 warning, 0 section mismatches

Warnings:
net/ipv4/inet_hashtables.c:608:68: warning: suggest parentheses around ‘+’ in operand of ‘&’ [-Wparentheses]

--------------------------------------------------------------------------------
rb532_defconfig (mips, gcc-10) — PASS, 0 errors, 1 warning, 0 section mismatches

Warnings:
net/ipv4/inet_hashtables.c:608:68: warning: suggest parentheses around ‘+’ in operand of ‘&’ [-Wparentheses]

--------------------------------------------------------------------------------
rbtx49xx_defconfig (mips, gcc-10) — PASS, 0 errors, 1 warning, 0 section mismatches

Warnings:
net/ipv4/inet_hashtables.c:608:68: warning: suggest parentheses around ‘+’ in operand of ‘&’ [-Wparentheses]

--------------------------------------------------------------------------------
realview-smp_defconfig (arm, gcc-10) — PASS, 0 errors, 1 warning, 0 section mismatches

Warnings:
net/ipv4/inet_hashtables.c:608:68: warning: suggest parentheses around ‘+’ in operand of ‘&’ [-Wparentheses]

--------------------------------------------------------------------------------
realview_defconfig (arm, gcc-10) — PASS, 0 errors, 1 warning, 0 section mismatches

Warnings:
net/ipv4/inet_hashtables.c:608:68: warning: suggest parentheses around ‘+’ in operand of ‘&’ [-Wparentheses]

--------------------------------------------------------------------------------
rm200_defconfig (mips, gcc-10) — PASS, 0 errors, 1 warning, 0 section mismatches

Warnings:
net/ipv4/inet_hashtables.c:608:68: warning: suggest parentheses around ‘+’ in operand of ‘&’ [-Wparentheses]

--------------------------------------------------------------------------------
rpc_defconfig (arm, gcc-10) — FAIL, 2 errors, 0 warnings, 0 section mismatches

Errors:
arm-linux-gnueabihf-gcc: error: unrecognized -march target: armv3
arm-linux-gnueabihf-gcc: error: missing argument to ‘-march=’

--------------------------------------------------------------------------------
rt305x_defconfig (mips, gcc-10) — PASS, 0 errors, 1 warning, 0 section mismatches

Warnings:
net/ipv4/inet_hashtables.c:608:68: warning: suggest parentheses around ‘+’ in operand of ‘&’ [-Wparentheses]

--------------------------------------------------------------------------------
s3c6400_defconfig (arm, gcc-10) — PASS, 0 errors, 2 warnings, 0 section mismatches

Warnings:
drivers/mmc/host/sdhci-s3c.c:429:34: warning: array ‘sdhci_s3c_dt_match’ assumed to have one element
drivers/tty/serial/samsung.c:1776:34: warning: array ‘s3c24xx_uart_dt_match’ assumed to have one element

--------------------------------------------------------------------------------
s5pv210_defconfig (arm, gcc-10) — PASS, 0 errors, 0 warnings, 0 section mismatches

--------------------------------------------------------------------------------
sama5_defconfig (arm, gcc-10) — PASS, 0 errors, 1 warning, 0 section mismatches

Warnings:
net/ipv4/inet_hashtables.c:608:68: warning: suggest parentheses around ‘+’ in operand of ‘&’ [-Wparentheses]

--------------------------------------------------------------------------------
sb1250_swarm_defconfig (mips, gcc-10) — PASS, 0 errors, 1 warning, 0 section mismatches

Warnings:
net/ipv4/inet_hashtables.c:608:68: warning: suggest parentheses around ‘+’ in operand of ‘&’ [-Wparentheses]

--------------------------------------------------------------------------------
sead3_defconfig (mips, gcc-10) — PASS, 0 errors, 1 warning, 0 section mismatches

Warnings:
net/ipv4/inet_hashtables.c:608:68: warning: suggest parentheses around ‘+’ in operand of ‘&’ [-Wparentheses]

--------------------------------------------------------------------------------
sead3micro_defconfig (mips, gcc-10) — PASS, 0 errors, 1 warning, 0 section mismatches

Warnings:
net/ipv4/inet_hashtables.c:608:68: warning: suggest parentheses around ‘+’ in operand of ‘&’ [-Wparentheses]

--------------------------------------------------------------------------------
simpad_defconfig (arm, gcc-10) — PASS, 0 errors, 1 warning, 0 section mismatches

Warnings:
net/ipv4/inet_hashtables.c:608:68: warning: suggest parentheses around ‘+’ in operand of ‘&’ [-Wparentheses]

--------------------------------------------------------------------------------
socfpga_defconfig (arm, gcc-10) — PASS, 0 errors, 1 warning, 0 section mismatches

Warnings:
net/ipv4/inet_hashtables.c:608:68: warning: suggest parentheses around ‘+’ in operand of ‘&’ [-Wparentheses]

--------------------------------------------------------------------------------
spear13xx_defconfig (arm, gcc-10) — PASS, 0 errors, 1 warning, 0 section mismatches

Warnings:
net/ipv4/inet_hashtables.c:608:68: warning: suggest parentheses around ‘+’ in operand of ‘&’ [-Wparentheses]

--------------------------------------------------------------------------------
spear3xx_defconfig (arm, gcc-10) — PASS, 0 errors, 0 warnings, 0 section mismatches

--------------------------------------------------------------------------------
spear6xx_defconfig (arm, gcc-10) — PASS, 0 errors, 0 warnings, 0 section mismatches

--------------------------------------------------------------------------------
spitz_defconfig (arm, gcc-10) — PASS, 0 errors, 1 warning, 0 section mismatches

Warnings:
net/ipv4/inet_hashtables.c:608:68: warning: suggest parentheses around ‘+’ in operand of ‘&’ [-Wparentheses]

--------------------------------------------------------------------------------
stm32_defconfig (arm, gcc-10) — PASS, 0 errors, 0 warnings, 0 section mismatches

--------------------------------------------------------------------------------
sunxi_defconfig (arm, gcc-10) — PASS, 0 errors, 1 warning, 0 section mismatches

Warnings:
net/ipv4/inet_hashtables.c:608:68: warning: suggest parentheses around ‘+’ in operand of ‘&’ [-Wparentheses]

--------------------------------------------------------------------------------
tb0219_defconfig (mips, gcc-10) — PASS, 0 errors, 1 warning, 0 section mismatches

Warnings:
net/ipv4/inet_hashtables.c:608:68: warning: suggest parentheses around ‘+’ in operand of ‘&’ [-Wparentheses]

--------------------------------------------------------------------------------
tb0287_defconfig (mips, gcc-10) — PASS, 0 errors, 1 warning, 0 section mismatches

Warnings:
net/ipv4/inet_hashtables.c:608:68: warning: suggest parentheses around ‘+’ in operand of ‘&’ [-Wparentheses]

--------------------------------------------------------------------------------
tct_hammer_defconfig (arm, gcc-10) — PASS, 0 errors, 0 warnings, 0 section mismatches

--------------------------------------------------------------------------------
tegra_defconfig (arm, gcc-10) — PASS, 0 errors, 1 warning, 0 section mismatches

Warnings:
net/ipv4/inet_hashtables.c:608:68: warning: suggest parentheses around ‘+’ in operand of ‘&’ [-Wparentheses]

--------------------------------------------------------------------------------
tinyconfig (arm, gcc-10) — PASS, 0 errors, 0 warnings, 0 section mismatches

--------------------------------------------------------------------------------
tinyconfig (i386, gcc-10) — PASS, 0 errors, 0 warnings, 0 section mismatches

--------------------------------------------------------------------------------
tinyconfig (mips, gcc-10) — PASS, 0 errors, 0 warnings, 0 section mismatches

--------------------------------------------------------------------------------
tinyconfig (arc, gcc-10) — PASS, 0 errors, 0 warnings, 0 section mismatches

--------------------------------------------------------------------------------
tinyconfig (x86_64, gcc-10) — PASS, 0 errors, 3 warnings, 0 section mismatches

Warnings:
arch/x86/entry/entry_64.S:487: Warning: no instruction mnemonic suffix given and no register operands; using default for `btr'
arch/x86/entry/entry_64.S:1642: Warning: no instruction mnemonic suffix given and no register operands; using default for `sysret'
arch/x86/kernel/process.c:456: Warning: no instruction mnemonic suffix given and no register operands; using default for `btr'

--------------------------------------------------------------------------------
trizeps4_defconfig (arm, gcc-10) — PASS, 0 errors, 1 warning, 0 section mismatches

Warnings:
net/ipv4/inet_hashtables.c:608:68: warning: suggest parentheses around ‘+’ in operand of ‘&’ [-Wparentheses]

--------------------------------------------------------------------------------
u300_defconfig (arm, gcc-10) — PASS, 0 errors, 0 warnings, 0 section mismatches

--------------------------------------------------------------------------------
u8500_defconfig (arm, gcc-10) — PASS, 0 errors, 1 warning, 0 section mismatches

Warnings:
net/ipv4/inet_hashtables.c:608:68: warning: suggest parentheses around ‘+’ in operand of ‘&’ [-Wparentheses]

--------------------------------------------------------------------------------
vdk_hs38_defconfig (arc, gcc-10) — PASS, 0 errors, 1 warning, 0 section mismatches

Warnings:
net/ipv4/inet_hashtables.c:608:68: warning: suggest parentheses around '+' in operand of '&' [-Wparentheses]

--------------------------------------------------------------------------------
vdk_hs38_smp_defconfig (arc, gcc-10) — PASS, 0 errors, 1 warning, 0 section mismatches

Warnings:
net/ipv4/inet_hashtables.c:608:68: warning: suggest parentheses around '+' in operand of '&' [-Wparentheses]

--------------------------------------------------------------------------------
versatile_defconfig (arm, gcc-10) — PASS, 0 errors, 1 warning, 0 section mismatches

Warnings:
net/ipv4/inet_hashtables.c:608:68: warning: suggest parentheses around ‘+’ in operand of ‘&’ [-Wparentheses]

--------------------------------------------------------------------------------
vexpress_defconfig (arm, gcc-10) — PASS, 0 errors, 1 warning, 0 section mismatches

Warnings:
net/ipv4/inet_hashtables.c:608:68: warning: suggest parentheses around ‘+’ in operand of ‘&’ [-Wparentheses]

--------------------------------------------------------------------------------
vf610m4_defconfig (arm, gcc-10) — PASS, 0 errors, 0 warnings, 0 section mismatches

--------------------------------------------------------------------------------
viper_defconfig (arm, gcc-10) — PASS, 0 errors, 1 warning, 0 section mismatches

Warnings:
net/ipv4/inet_hashtables.c:608:68: warning: suggest parentheses around ‘+’ in operand of ‘&’ [-Wparentheses]

--------------------------------------------------------------------------------
vt8500_v6_v7_defconfig (arm, gcc-10) — PASS, 0 errors, 1 warning, 0 section mismatches

Warnings:
net/ipv4/inet_hashtables.c:608:68: warning: suggest parentheses around ‘+’ in operand of ‘&’ [-Wparentheses]

--------------------------------------------------------------------------------
workpad_defconfig (mips, gcc-10) — PASS, 0 errors, 1 warning, 0 section mismatches

Warnings:
net/ipv4/inet_hashtables.c:608:68: warning: suggest parentheses around ‘+’ in operand of ‘&’ [-Wparentheses]

--------------------------------------------------------------------------------
x86_64_defconfig (x86_64, gcc-10) — PASS, 0 errors, 9 warnings, 0 section mismatches

Warnings:
arch/x86/entry/entry_64.S:487: Warning: no instruction mnemonic suffix given and no register operands; using default for `btr'
arch/x86/entry/entry_64.S:1642: Warning: no instruction mnemonic suffix given and no register operands; using default for `sysret'
arch/x86/kernel/process.c:456: Warning: no instruction mnemonic suffix given and no register operands; using default for `btr'
arch/x86/kernel/process.c:456: Warning: no instruction mnemonic suffix given and no register operands; using default for `btr'
net/ipv4/inet_hashtables.c:608:68: warning: suggest parentheses around ‘+’ in operand of ‘&’ [-Wparentheses]
WARNING: vmlinux.o (.discard.nospec): unexpected non-allocatable section.
WARNING: vmlinux.o (.discard.retpoline_safe): unexpected non-allocatable section.
ld: arch/x86/boot/compressed/head_64.o: warning: relocation in read-only section `.head.text'
ld: warning: creating DT_TEXTREL in a PIE

--------------------------------------------------------------------------------
x86_64_defconfig+x86-chromebook (x86_64, gcc-10) — PASS, 0 errors, 9 warnings, 0 section mismatches

Warnings:
arch/x86/entry/entry_64.S:487: Warning: no instruction mnemonic suffix given and no register operands; using default for `btr'
arch/x86/entry/entry_64.S:1642: Warning: no instruction mnemonic suffix given and no register operands; using default for `sysret'
arch/x86/kernel/process.c:456: Warning: no instruction mnemonic suffix given and no register operands; using default for `btr'
arch/x86/kernel/process.c:456: Warning: no instruction mnemonic suffix given and no register operands; using default for `btr'
net/ipv4/inet_hashtables.c:608:68: warning: suggest parentheses around ‘+’ in operand of ‘&’ [-Wparentheses]
WARNING: vmlinux.o (.discard.nospec): unexpected non-allocatable section.
WARNING: vmlinux.o (.discard.retpoline_safe): unexpected non-allocatable section.
ld: arch/x86/boot/compressed/head_64.o: warning: relocation in read-only section `.head.text'
ld: warning: creating DT_TEXTREL in a PIE

--------------------------------------------------------------------------------
xcep_defconfig (arm, gcc-10) — PASS, 0 errors, 1 warning, 0 section mismatches

Warnings:
net/ipv4/inet_hashtables.c:608:68: warning: suggest parentheses around ‘+’ in operand of ‘&’ [-Wparentheses]

--------------------------------------------------------------------------------
xilfpga_defconfig (mips, gcc-10) — PASS, 0 errors, 0 warnings, 0 section mismatches

--------------------------------------------------------------------------------
zeus_defconfig (arm, gcc-10) — PASS, 0 errors, 1 warning, 0 section mismatches

Warnings:
net/ipv4/inet_hashtables.c:608:68: warning: suggest parentheses around ‘+’ in operand of ‘&’ [-Wparentheses]

--------------------------------------------------------------------------------
zx_defconfig (arm, gcc-10) — PASS, 0 errors, 0 warnings, 0 section mismatches

---
For more info write to <info@...>


CIP IRC weekly meeting today on libera.chat

Jan Kiszka
 

Hi all,

Kindly be reminded to attend the weekly meeting through IRC to discuss
technical topics with CIP kernel today. Our channel is the following:

irc:irc.libera.chat:6667/cip

The IRC meeting is scheduled to UTC (GMT) 12:00:

https://www.timeanddate.com/worldclock/meetingdetails.html?year=2022&month=7&day=28&hour=12&min=0&sec=0&p1=224&p2=179&p3=136&p4=37&p5=241&p6=248

USWest USEast UK DE TW JP
05:00 08:00 13:00 14:00 20:00 21:00

Last meeting minutes:
https://ircbot.wl.linuxfoundation.org/meetings/cip/2022/07/cip.2022-07-21-12.09.log.html

* Action items
1. Resolve/ignore failures of KernelCI on 4.4-cip - alicefm
2. Check cip devices on kernelci old pull request - patersonc
* Kernel maintenance updates
* Kernel testing
* AOB

Jan


New CVE entries this week

Masami Ichikawa
 

Hi !

It's this week's CVE report.

This week reported 5 new CVEs and 5 updated CVEs.

* New CVEs

CVE-2020-36557: A race condition in the Linux kernel before 5.6.2
between the VT_DISALLOCATE ioctl and closing/opening of ttys could
lead to a use-after-free.

CVSS v3 score is not assigned.

When a user passes VT_DISALLOCATE command via ioctl() while
tty_release() is still running, causing a use-after-free in
con_shutdown().

This vulnerability was fixed by commit ca4463b ("vt: vt_ioctl: fix
VT_DISALLOCATE freeing in-use virtual console") which was merged in
5.7-rc1.

Fixed status
mainline: [ca4463bf8438b403596edd0ec961ca0d4fbe0220]
stable/4.14: [b9eb60a0ef3971101c94f9cddb09708c2f900b35]
stable/4.19: [54584f79579b9f6ed49b93cadcd2361223ecce28]
stable/4.9: [6bc9bf78618edf42b31cb7551fb0c83af340c54f]
stable/5.4: [acf0e94019310a9e1c4b6807c208f49a25f74573]

CVE-2020-36558: vt: vt_ioctl: fix race in VT_RESIZEX

CVSS v3 score is not assigned.

There was a race condition bug in vt_ioctl() while processing
VT_RESIZEX ioctl command. This race condition bug could lead system
crash because of a Null pointer dereference.

This vulnerability was fixed by commit 6cd1ed5 ("vt: vt_ioctl: fix
race in VT_RESIZEX") which was merged in 5.6-rc3.

Fixed status
mainline: [6cd1ed50efd88261298577cd92a14f2768eddeeb]
stable/4.14: [69931c044c9de837602cfd4bcfc28123ce4987e2]
stable/4.19: [ec9645f1a77eab98951944273754307e192e69ae]
stable/4.9: [160fbca8d5d74c1a4cec4b666f36b3e614c19f4f]
stable/5.4: [897d5aaf3397e64a56274f2176d9e1b13adcb92e]

CVE-2022-2209: A use-after-free bug was found when executing IORING_OP
CVE-2022-2327: A double free bug was found when executing IORING_OP

CVE-2022-2209 and CVE-2022-2327 were fixed by commit df3f3bb
("io_uring: add missing item types for various requests").

CVE-2022-2209
NIST: CVSSv3 Score is not assigned.
CNA: 7.8 HIGH

CVE-2022-2327
NIST: CVSSv3 Score is not assigned.
CNA: 7.5 HIGH

It seems as if CVE-2022-2209 and CVE-2022-2327 have same root cuase
that is why they were fixed by commit ("io_uring: add missing item
types for various requests"). The flag IO_WQ_WORK_FILES was merged in
5.10-rc1 commit 0f20376 ("io_uring: pass required context in as
flags") and has been removed since 5.12-rc1dontuse commit 44526be
("io_uring: remove any grabbing of context") so 5.10 kernel was only
affected by this vulnerability.

The commit df3f3bb ("io_uring: add missing item types for various
requests") had kernel panic bug. This kernel panic bug was fixed by
commit fb2fbb3 ("io_uring: use separate list entry for iopoll
requests").
The io_uring feature has merged since 5.1 so 4.X kernels are not affected.

Fixed status
stable/5.10: [df3f3bb5059d20ef094d6b2f0256c4bf4127a859]

CVE-2022-36879: xfrm: xfrm_policy: fix a possible double
xfrm_pols_put() in xfrm_bundle_lookup()

CVSSv3 Score is not assigned

The xfrm_pols_put() put policies via xfrm_pols_put() when
xfrm_expand_policies() returns error. However, xfrm_expand_policies()
already called xfrm_pols_put().

Fixed status
mainline: [f85daf0e725358be78dfd208dea5fd665d8cb901]

* Updated CVEs

CVE-2021-33655: When sending malicous data to kernel by ioctl cmd
FBIOPUT_VSCREENINFO,kernel will write memory out of bounds

Added patch to 4.19 and add more patches to 5.10.

Fixed status
mainline: [e64242caef18b4a5840b0e7a9bff37abd4f4f933,
65a01e601dbba8b7a51a2677811f70f783766682,
6c11df58fd1ac0aefcb3b227f72769272b939e56]
stable/4.19: [eae522ed28fe1c00375a8a0081a97dce7996e4d8]
stable/5.10: [cecb806c766c78e1be62b6b7b1483ef59bbaeabe,
b727561ddc9360de9631af2d970d8ffed676a750,
b81212828ad19ab3eccf00626cd04099215060bf]
stable/5.15: [9c9e44bb3dd5233232f2379c2dde0e403b1fd642]
stable/5.18: [365b729e36ca942f4d2d184afc8486017504a597]
stable/5.4: [af93e821973426ded00158ea66a977039483997e]

CVE-2022-21505: Fix kexec lockdown bypass with ima policy

The mainline was fixed this week.

Fixed status
mainline: [543ce63b664e2c2f9533d089a4664b559c3e6b5b]

CVE-2022-23816: Mis-trained branch predictions for return instructions
may allow speculative code execution under certain microarchitecture-
dependent conditions on some AMD processors..

5.18 was fixed this week.

mainline: [742ab6df974ae8384a2dd213db1a3a06cf6d8936,
a883d624aed463c84c22596006e5a96f5b44db31,
369ae6ffc41a3c1137cab697635a84d0cc7cdcea,
00e1533325fd1fb5459229fe37f235462649f668,
0b53c374b9eff2255a386f1f1cfb9a928e52a5ae,
15e67227c49a57837108acfe1c80570e1bd9f962,
d9e9d2300681d68a775c28de6aa6e5290ae17796,
ee88d363d15617ff50ac24fab0ffec11113b2aeb,
1f001e9da6bbf482311e45e48f53c2bd2179e59c,
d77cfe594ad50e0bf95d457e02ccd578791b2a15,
af2e140f34208a5dfb6b7a8ad2d56bda88f0524d,
15583e514eb16744b80be85dea0774ece153177d,
0ee9073000e8791f8b134a8ded31bcc767f7f232,
aa3d480315ba6c3025a60958e1981072ea37c3df,
7c81c0c9210c9bfab2bae76aab2999de5bad27db,
951ddecf435659553ed15a9214e153a3af43a9a1,
a149180fbcf336e97ce4eb2cdc13672727feb94d,
6b80b59b3555706508008f1f127b5412c89c7fd8,
7fbf47c7ce50b38a64576b150e7011ae73d54669,
e8ec1b6e08a2102d8755ccb06fa26d540f26a2fa,
caa0ff24d5d0e02abce5e65c3d2b7f20a6617be5,
2dbb887e875b1de3ca8f40ddf26bcfe55798c609,
c779bc1a9002fa474175b80e72b85c9bf628abb0,
7c693f54c873691a4b7da05c7e0f74e67745d144,
166115c08a9b0b846b783088808a27d739be6e8d,
6ad0ad2bf8a67e27d1f9d006a1dabb0e1c360cc3,
bf5835bcdb9635c97f85120dba9bfa21e111130f,
9bb2ec608a209018080ca262f771e6a9ff203b6f,
b75b7f8ef1148be1b9321ffc2f6c19238904b438,
d147553b64bad34d2f92cb7d8ba454ae95c3baac,
3ebc170068885b6fc7bedda6c667bb2c4d533159,
0fe4aeea9c01baabecc8c3afc7889c809d939bc2,
a09a6e2399ba0595c3042b3164f3ca68a3cff33e,
d7caac991feeef1b871ee6988fd2c9725df09039,
b2620facef4889fefcbf2e87284f34dcd4189bce,
e6aa13622ea8283cc699cac5d018cc40a2ba2010,
56aa4d221f1ee2c3a49b45b800778ec6e0ab73c5,
bbb69e8bee1bd882784947095ffb2bfe0f7c9470,
acac5e98ef8d638a411cfa2ee676c87e1973f126,
8faea26e611189e933ea2281975ff4dc7c1106b6,
8bd200d23ec42d66ccd517a72dd0b9cc6132d2fd,
bb06650634d3552c0f8557e9d16aa1a408040e28,
fc02735b14fff8c6678b521d324ade27b1a3d4cf,
bea7e31a5caccb6fe8ed989c065072354f0ecb52,
9756bba28470722dacb79ffce554336dd1f6a6cd,
07853adc29a058c5fd143c14e5ac528448a72ed9,
7a05bc95ed1c5a59e47aaade9fb4083c27de9e62,
26aae8ccbc1972233afd08fb3f368947c0314265,
f43b9876e857c739d407bc56df288b0ebe1a9164,
f54d45372c6ac9c993451de5e51312485f7d10bc,
2c08b9b38f5b0f4a6c2d29be22b695e4ec4a556b,
2259da159fbe5dba8ac00b560cf00b6a6537fa18,
697977d8415d61f3acbc4ee6d564c9dcf0309507,
4ad3278df6fe2b0852b00d5757fc2ccd8e92c26e,
c27c753ea6fd1237f4f96abf8b623d7bab505513]
stable/5.18: [e492002673b03c636d2297fb869d68ae545c41c4,
e0ed7445cbb5a10bebec4f582894460453b3c0f6,
079c71b6e380c40ee870bc59f176b36d93786db5,
7ce2011c8b28a44ae80d7081dc634eec174650ca,
86fbd2844858c5aef57a28ebc3d53d298f37cc67,
e0c27dc584f6395e57d67f5c60b3ee2347a45590,
262941a05615d39d66dcf47909d6e67ea69d371d,
eb84031e5c599a4b218ede3e10e7b5fd8ccc391a,
0d15b9c30cb222d0e5ac2ff9ba7b93bd9af82d05,
ebe3ceb43f5b5b88062ffd62c08d19a57f5fa44b,
3525abdb3a63680b8623b0294bd9614b2352ccce,
2fc0ed17c526b032c1c416d77ebc491f446f1269,
a302187fb8f6d2707aaadf5e8a558ff046378a80,
a05146b2ac6ab1deff475a06441b825d176b320e,
df777869fe2de25b60195561d3b674c9084aaeca,
9d75af6b406702b0af616cee49ae11ec0b2abe3a,
64a98375f389bf695e2a2f199175b7a5ece44f45,
a70ed95a0b0a15cfa86b1df4004d47f074de7de2,
f88b40812b6b3d483fb5de11b72aeb0c2bb73c59,
c85b5f77d3b224975d5caa329f28b22b7ea5addc,
409586fb4a6e7b2331ecb4edec71e34e21750e05,
47e51d66d93d70d60e478cc81504deb0f4ff67ad,
2c0d8e35807a6086542919e2d044cfa6683476de,
e604d260c633926089e81f8e52c90c91bd797f12,
fb32593f8f383e32bb82fd85cc3dd372c89566ac,
5a3037b4de4dd52504c0842aac5f9498b3d450af,
7b2649892c7728d4ad662d75a887f8b43a209189,
6864df0932578931f13c8de5006975345f8cea0d,
4a691f1e69163dcfb7b064a25a082071da0bb633,
b75fada7f3cbbaf78beceb1bb71b67c2db3b473d,
bbcfdf144d2d9394e3f4aa129463dec8f53bd3b1,
4c7f90f8a9554dd6a7e614529b3d7450a8dc84e2,
a8a370f08eb55359980fe29165569333b1e0c54d,
80f8a9e9d530fec6094641b96fe3e5b5acb44830,
3d6bdd768577847ae680b27bfb50c6de2037afe7,
3e89c42462722bbf778ac1e97236dca518fabbf9,
ff110fe719555fd358ac9e0bd0ca549fae3e26e9,
8a95fadc8f3264dc98376d0de66ec59dd9eafb6f,
7377eea29dbcad2ad042eee66df17c11b8421654,
43827446da732ed012c9008c429424f81e36331b,
bcb9508413dc8a73cb8abd761a85dc5c6f9bd911,
245800423a576925d0bd571eacf09cc12e94a9ff,
d58141112c9965092a0f39d354b22394882585b4,
48fe9931c7ddf18063aa0c8d16c3831f9d9a16c4,
8c38306e2e9257af4af2819aa287a4711ff36329,
afd743f6dde87296c6f3414706964c491bb85862,
373e6942143b5ca27b24ee953ae450dd26a0dbfb,
409f6047a43315f2b9661149cb29d6f2ef2440fe,
813423f90f0553c81c5fb4d531fc688a5d506b24,
ee02cbcebb0985394910d8868c6eef49184b20f7,
df6fc784e8db07b8fe5aa1c624411f381f3abeaa,
e2fe046fe230c5159660257712566a849847cffa,
845351c56ca069162433cf935afb2257a4c021d1,
ffdd31e8db4e94f399e68727fadf776fc0a2d1ba,
6461cc8f22a1266498290b122b56f040d51d9224]

CVE-2022-29900: Information leak through mispredicted returns on AMD processors

stable/5.18 was fixed this week.

Fixed status
mainline: [742ab6df974ae8384a2dd213db1a3a06cf6d8936,
a883d624aed463c84c22596006e5a96f5b44db31,
369ae6ffc41a3c1137cab697635a84d0cc7cdcea,
00e1533325fd1fb5459229fe37f235462649f668,
0b53c374b9eff2255a386f1f1cfb9a928e52a5ae,
15e67227c49a57837108acfe1c80570e1bd9f962,
d9e9d2300681d68a775c28de6aa6e5290ae17796,
ee88d363d15617ff50ac24fab0ffec11113b2aeb,
1f001e9da6bbf482311e45e48f53c2bd2179e59c,
d77cfe594ad50e0bf95d457e02ccd578791b2a15,
af2e140f34208a5dfb6b7a8ad2d56bda88f0524d,
15583e514eb16744b80be85dea0774ece153177d,
0ee9073000e8791f8b134a8ded31bcc767f7f232,
aa3d480315ba6c3025a60958e1981072ea37c3df,
7c81c0c9210c9bfab2bae76aab2999de5bad27db,
951ddecf435659553ed15a9214e153a3af43a9a1,
a149180fbcf336e97ce4eb2cdc13672727feb94d,
6b80b59b3555706508008f1f127b5412c89c7fd8,
7fbf47c7ce50b38a64576b150e7011ae73d54669,
e8ec1b6e08a2102d8755ccb06fa26d540f26a2fa,
caa0ff24d5d0e02abce5e65c3d2b7f20a6617be5,
2dbb887e875b1de3ca8f40ddf26bcfe55798c609,
c779bc1a9002fa474175b80e72b85c9bf628abb0,
7c693f54c873691a4b7da05c7e0f74e67745d144,
166115c08a9b0b846b783088808a27d739be6e8d,
6ad0ad2bf8a67e27d1f9d006a1dabb0e1c360cc3,
bf5835bcdb9635c97f85120dba9bfa21e111130f,
9bb2ec608a209018080ca262f771e6a9ff203b6f,
b75b7f8ef1148be1b9321ffc2f6c19238904b438,
d147553b64bad34d2f92cb7d8ba454ae95c3baac,
3ebc170068885b6fc7bedda6c667bb2c4d533159,
0fe4aeea9c01baabecc8c3afc7889c809d939bc2,
a09a6e2399ba0595c3042b3164f3ca68a3cff33e,
d7caac991feeef1b871ee6988fd2c9725df09039,
b2620facef4889fefcbf2e87284f34dcd4189bce,
e6aa13622ea8283cc699cac5d018cc40a2ba2010,
56aa4d221f1ee2c3a49b45b800778ec6e0ab73c5,
bbb69e8bee1bd882784947095ffb2bfe0f7c9470,
acac5e98ef8d638a411cfa2ee676c87e1973f126,
8faea26e611189e933ea2281975ff4dc7c1106b6,
8bd200d23ec42d66ccd517a72dd0b9cc6132d2fd,
bb06650634d3552c0f8557e9d16aa1a408040e28,
fc02735b14fff8c6678b521d324ade27b1a3d4cf,
bea7e31a5caccb6fe8ed989c065072354f0ecb52,
9756bba28470722dacb79ffce554336dd1f6a6cd,
07853adc29a058c5fd143c14e5ac528448a72ed9,
7a05bc95ed1c5a59e47aaade9fb4083c27de9e62,
26aae8ccbc1972233afd08fb3f368947c0314265,
f43b9876e857c739d407bc56df288b0ebe1a9164,
f54d45372c6ac9c993451de5e51312485f7d10bc,
2c08b9b38f5b0f4a6c2d29be22b695e4ec4a556b,
2259da159fbe5dba8ac00b560cf00b6a6537fa18,
697977d8415d61f3acbc4ee6d564c9dcf0309507,
4ad3278df6fe2b0852b00d5757fc2ccd8e92c26e,
c27c753ea6fd1237f4f96abf8b623d7bab505513]
stable/5.18: [e492002673b03c636d2297fb869d68ae545c41c4,
e0ed7445cbb5a10bebec4f582894460453b3c0f6,
079c71b6e380c40ee870bc59f176b36d93786db5,
7ce2011c8b28a44ae80d7081dc634eec174650ca,
86fbd2844858c5aef57a28ebc3d53d298f37cc67,
e0c27dc584f6395e57d67f5c60b3ee2347a45590,
262941a05615d39d66dcf47909d6e67ea69d371d,
eb84031e5c599a4b218ede3e10e7b5fd8ccc391a,
0d15b9c30cb222d0e5ac2ff9ba7b93bd9af82d05,
ebe3ceb43f5b5b88062ffd62c08d19a57f5fa44b,
3525abdb3a63680b8623b0294bd9614b2352ccce,
2fc0ed17c526b032c1c416d77ebc491f446f1269,
a302187fb8f6d2707aaadf5e8a558ff046378a80,
a05146b2ac6ab1deff475a06441b825d176b320e,
df777869fe2de25b60195561d3b674c9084aaeca,
9d75af6b406702b0af616cee49ae11ec0b2abe3a,
64a98375f389bf695e2a2f199175b7a5ece44f45,
a70ed95a0b0a15cfa86b1df4004d47f074de7de2,
f88b40812b6b3d483fb5de11b72aeb0c2bb73c59,
c85b5f77d3b224975d5caa329f28b22b7ea5addc,
409586fb4a6e7b2331ecb4edec71e34e21750e05,
47e51d66d93d70d60e478cc81504deb0f4ff67ad,
2c0d8e35807a6086542919e2d044cfa6683476de,
e604d260c633926089e81f8e52c90c91bd797f12,
fb32593f8f383e32bb82fd85cc3dd372c89566ac,
5a3037b4de4dd52504c0842aac5f9498b3d450af,
7b2649892c7728d4ad662d75a887f8b43a209189,
6864df0932578931f13c8de5006975345f8cea0d,
4a691f1e69163dcfb7b064a25a082071da0bb633,
b75fada7f3cbbaf78beceb1bb71b67c2db3b473d,
bbcfdf144d2d9394e3f4aa129463dec8f53bd3b1,
4c7f90f8a9554dd6a7e614529b3d7450a8dc84e2,
a8a370f08eb55359980fe29165569333b1e0c54d,
80f8a9e9d530fec6094641b96fe3e5b5acb44830,
3d6bdd768577847ae680b27bfb50c6de2037afe7,
3e89c42462722bbf778ac1e97236dca518fabbf9,
ff110fe719555fd358ac9e0bd0ca549fae3e26e9,
8a95fadc8f3264dc98376d0de66ec59dd9eafb6f,
7377eea29dbcad2ad042eee66df17c11b8421654,
43827446da732ed012c9008c429424f81e36331b,
bcb9508413dc8a73cb8abd761a85dc5c6f9bd911,
245800423a576925d0bd571eacf09cc12e94a9ff,
d58141112c9965092a0f39d354b22394882585b4,
48fe9931c7ddf18063aa0c8d16c3831f9d9a16c4,
8c38306e2e9257af4af2819aa287a4711ff36329,
afd743f6dde87296c6f3414706964c491bb85862,
373e6942143b5ca27b24ee953ae450dd26a0dbfb,
409f6047a43315f2b9661149cb29d6f2ef2440fe,
813423f90f0553c81c5fb4d531fc688a5d506b24,
ee02cbcebb0985394910d8868c6eef49184b20f7,
df6fc784e8db07b8fe5aa1c624411f381f3abeaa,
e2fe046fe230c5159660257712566a849847cffa,
845351c56ca069162433cf935afb2257a4c021d1,
ffdd31e8db4e94f399e68727fadf776fc0a2d1ba,
6461cc8f22a1266498290b122b56f040d51d9224]

CVE-2022-29901: Information leak through mispredicted returns on Intel
processors

stable/5.18 was fixed this week.

Fixed status
mainline: [742ab6df974ae8384a2dd213db1a3a06cf6d8936,
a883d624aed463c84c22596006e5a96f5b44db31,
369ae6ffc41a3c1137cab697635a84d0cc7cdcea,
00e1533325fd1fb5459229fe37f235462649f668,
0b53c374b9eff2255a386f1f1cfb9a928e52a5ae,
15e67227c49a57837108acfe1c80570e1bd9f962,
d9e9d2300681d68a775c28de6aa6e5290ae17796,
ee88d363d15617ff50ac24fab0ffec11113b2aeb,
1f001e9da6bbf482311e45e48f53c2bd2179e59c,
d77cfe594ad50e0bf95d457e02ccd578791b2a15,
af2e140f34208a5dfb6b7a8ad2d56bda88f0524d,
15583e514eb16744b80be85dea0774ece153177d,
0ee9073000e8791f8b134a8ded31bcc767f7f232,
aa3d480315ba6c3025a60958e1981072ea37c3df,
7c81c0c9210c9bfab2bae76aab2999de5bad27db,
951ddecf435659553ed15a9214e153a3af43a9a1,
a149180fbcf336e97ce4eb2cdc13672727feb94d,
6b80b59b3555706508008f1f127b5412c89c7fd8,
7fbf47c7ce50b38a64576b150e7011ae73d54669,
e8ec1b6e08a2102d8755ccb06fa26d540f26a2fa,
caa0ff24d5d0e02abce5e65c3d2b7f20a6617be5,
2dbb887e875b1de3ca8f40ddf26bcfe55798c609,
c779bc1a9002fa474175b80e72b85c9bf628abb0,
7c693f54c873691a4b7da05c7e0f74e67745d144,
166115c08a9b0b846b783088808a27d739be6e8d,
6ad0ad2bf8a67e27d1f9d006a1dabb0e1c360cc3,
bf5835bcdb9635c97f85120dba9bfa21e111130f,
9bb2ec608a209018080ca262f771e6a9ff203b6f,
b75b7f8ef1148be1b9321ffc2f6c19238904b438,
d147553b64bad34d2f92cb7d8ba454ae95c3baac,
3ebc170068885b6fc7bedda6c667bb2c4d533159,
0fe4aeea9c01baabecc8c3afc7889c809d939bc2,
a09a6e2399ba0595c3042b3164f3ca68a3cff33e,
d7caac991feeef1b871ee6988fd2c9725df09039,
b2620facef4889fefcbf2e87284f34dcd4189bce,
e6aa13622ea8283cc699cac5d018cc40a2ba2010,
56aa4d221f1ee2c3a49b45b800778ec6e0ab73c5,
bbb69e8bee1bd882784947095ffb2bfe0f7c9470,
acac5e98ef8d638a411cfa2ee676c87e1973f126,
8faea26e611189e933ea2281975ff4dc7c1106b6,
8bd200d23ec42d66ccd517a72dd0b9cc6132d2fd,
bb06650634d3552c0f8557e9d16aa1a408040e28,
fc02735b14fff8c6678b521d324ade27b1a3d4cf,
bea7e31a5caccb6fe8ed989c065072354f0ecb52,
9756bba28470722dacb79ffce554336dd1f6a6cd,
07853adc29a058c5fd143c14e5ac528448a72ed9,
7a05bc95ed1c5a59e47aaade9fb4083c27de9e62,
26aae8ccbc1972233afd08fb3f368947c0314265,
f43b9876e857c739d407bc56df288b0ebe1a9164,
f54d45372c6ac9c993451de5e51312485f7d10bc,
2c08b9b38f5b0f4a6c2d29be22b695e4ec4a556b,
2259da159fbe5dba8ac00b560cf00b6a6537fa18,
697977d8415d61f3acbc4ee6d564c9dcf0309507,
4ad3278df6fe2b0852b00d5757fc2ccd8e92c26e,
c27c753ea6fd1237f4f96abf8b623d7bab505513]
stable/5.18: [e492002673b03c636d2297fb869d68ae545c41c4,
e0ed7445cbb5a10bebec4f582894460453b3c0f6,
079c71b6e380c40ee870bc59f176b36d93786db5,
7ce2011c8b28a44ae80d7081dc634eec174650ca,
86fbd2844858c5aef57a28ebc3d53d298f37cc67,
e0c27dc584f6395e57d67f5c60b3ee2347a45590,
262941a05615d39d66dcf47909d6e67ea69d371d,
eb84031e5c599a4b218ede3e10e7b5fd8ccc391a,
0d15b9c30cb222d0e5ac2ff9ba7b93bd9af82d05,
ebe3ceb43f5b5b88062ffd62c08d19a57f5fa44b,
3525abdb3a63680b8623b0294bd9614b2352ccce,
2fc0ed17c526b032c1c416d77ebc491f446f1269,
a302187fb8f6d2707aaadf5e8a558ff046378a80,
a05146b2ac6ab1deff475a06441b825d176b320e,
df777869fe2de25b60195561d3b674c9084aaeca,
9d75af6b406702b0af616cee49ae11ec0b2abe3a,
64a98375f389bf695e2a2f199175b7a5ece44f45,
a70ed95a0b0a15cfa86b1df4004d47f074de7de2,
f88b40812b6b3d483fb5de11b72aeb0c2bb73c59,
c85b5f77d3b224975d5caa329f28b22b7ea5addc,
409586fb4a6e7b2331ecb4edec71e34e21750e05,
47e51d66d93d70d60e478cc81504deb0f4ff67ad,
2c0d8e35807a6086542919e2d044cfa6683476de,
e604d260c633926089e81f8e52c90c91bd797f12,
fb32593f8f383e32bb82fd85cc3dd372c89566ac,
5a3037b4de4dd52504c0842aac5f9498b3d450af,
7b2649892c7728d4ad662d75a887f8b43a209189,
6864df0932578931f13c8de5006975345f8cea0d,
4a691f1e69163dcfb7b064a25a082071da0bb633,
b75fada7f3cbbaf78beceb1bb71b67c2db3b473d,
bbcfdf144d2d9394e3f4aa129463dec8f53bd3b1,
4c7f90f8a9554dd6a7e614529b3d7450a8dc84e2,
a8a370f08eb55359980fe29165569333b1e0c54d,
80f8a9e9d530fec6094641b96fe3e5b5acb44830,
3d6bdd768577847ae680b27bfb50c6de2037afe7,
3e89c42462722bbf778ac1e97236dca518fabbf9,
ff110fe719555fd358ac9e0bd0ca549fae3e26e9,
8a95fadc8f3264dc98376d0de66ec59dd9eafb6f,
7377eea29dbcad2ad042eee66df17c11b8421654,
43827446da732ed012c9008c429424f81e36331b,
bcb9508413dc8a73cb8abd761a85dc5c6f9bd911,
245800423a576925d0bd571eacf09cc12e94a9ff,
d58141112c9965092a0f39d354b22394882585b4,
48fe9931c7ddf18063aa0c8d16c3831f9d9a16c4,
8c38306e2e9257af4af2819aa287a4711ff36329,
afd743f6dde87296c6f3414706964c491bb85862,
373e6942143b5ca27b24ee953ae450dd26a0dbfb,
409f6047a43315f2b9661149cb29d6f2ef2440fe,
813423f90f0553c81c5fb4d531fc688a5d506b24,
ee02cbcebb0985394910d8868c6eef49184b20f7,
df6fc784e8db07b8fe5aa1c624411f381f3abeaa,
e2fe046fe230c5159660257712566a849847cffa,
845351c56ca069162433cf935afb2257a4c021d1,
ffdd31e8db4e94f399e68727fadf776fc0a2d1ba,
6461cc8f22a1266498290b122b56f040d51d9224]

Currently tracking CVEs

CVE-2021-31615: Unencrypted Bluetooth Low Energy baseband links in
Bluetooth Core Specifications 4.0 through 5.2

There is no fix information.

CVE-2020-26556: kernel: malleable commitment Bluetooth Mesh Provisioning

No fix information.

CVE-2020-26557: kernel: predictable Authvalue in Bluetooth Mesh
Provisioning Leads to MITM

No fix information.

CVE-2020-26559: kernel: Authvalue leak in Bluetooth Mesh Provisioning

No fix information.

CVE-2020-26560: kernel: impersonation attack in Bluetooth Mesh Provisioning

No fix information.

Regards,
--
Masami Ichikawa
Cybertrust Japan Co., Ltd.

Email :masami.ichikawa@...
:masami.ichikawa@...


[ANNOUNCE] 4.19.252-cip78-rt26 (-rt112)

Pavel Machek
 

Hi!

New realtime trees should be available at kernel.org.

Trees are available at

https://git.kernel.org/pub/scm/linux/kernel/git/cip/linux-cip.git/log/?h=linux-4.19.y-cip-rt
https://git.kernel.org/pub/scm/linux/kernel/git/cip/linux-cip.git/log/?h=linux-4.19.y-cip-rt-rebase

And their content should be identical.

Best regards,
Pavel
--
DENX Software Engineering GmbH, Managing Director: Wolfgang Denk
HRB 165235 Munich, Office: Kirchenstr.5, D-82194 Groebenzell, Germany

181 - 200 of 9152